{"text_format":"3","workbook":"xlsx","n_sheets":4,"sheets":["Sheet1","Sheet2","Defining Function","Sheet3"],"not_rendered":{"charts":2,"images":4,"macros":1,"defined_names":10,"comments":1},"read":"whole","date_system":"1900"}

{"sheet":"Sheet1","index":0,"n_rows":52,"n_cols":14,"rows_kept":52}
[null,"    Graphs in Biangular Coordinates"]
[]
[null,"         This graphing utility produces the graph "]
[null,"  of any linear function involving the angles q and f"]
[null,null,"  in the biangular coordinate system"]
[null,"      based on two poles along the horizontal axis."]
[]
[]
["The first pole is at the origin."]
["How far to the right is the second pole?",null,null,{"$f":"E10","v":2},2,47]
[null,null,"(1-6)"]
[]
["In the linear function f = mq + b:"]
[null,"What is the slope m (- 3 to 3)?",null,{"$f":"(E14-30)/10","v":-1},20,47]
[]
[null,"What is the intercept b (- 5 to 5)?",null,{"$f":"E16-5","v":3},8,13]
[]
[]
["Now enter the interval for q :  ",{"$nulls":7},"The graph of the linear biangular function"]
[null,null,"   Minimum angle a =",-1.5,{"$nulls":5},"q = ",{"$f":"m","v":-1},"f  ",{"$f":"IF(bb>0, \" + \", \" - \")","v":" + "},{"$f":"ABS(bb)","v":3}]
[null,null,"   Maximum angle b =",5]
[]
[{"$nulls":8},"Now trace along the \"linear\" biangular curve:"]
[{"$nulls":8},"q  = ",{"$f":"Sheet1!D20+K24*Sheet2!B12","v":{"v":0.7964071856287425,"d":"0.80"}},177]
[{"$nulls":8},"f =",{"$f":"LOOKUP(J24,Sheet2!C2:C503,Sheet2!D2:D503)","v":{"v":2.216566866267464,"d":"2.22"}}]
[{"$nulls":8},"x =",{"$f":"LOOKUP(J24,Sheet2!C3:C504,Sheet2!G3:G504)","v":8.01912842414443}]
[{"$nulls":8},"y =",{"$f":"LOOKUP(J24,Sheet2!C3:C504,Sheet2!H3:H504)","v":7.987674540992796}]
[]
[]
[]
[]
["Click each item below for suggestions and investigations"]
[null,null,"   Item 1"]
[null,null,"   Item 2"]
[null,null,"   Item 3"]
[null,null,"   Item 4"]
[null,null,"   Item 5"]
[null,null,"   Item 6"]
[null,null,"   Item 7"]
[null,null,"   Item 8"]
[null,null,"   Item 9"]
[]
[]
["To access/download all the DIGMath Apps for Calculus"]
["      Click this link:",null,"DIGMath for Calculus"]
[]
["Created by:  Sheldon P. Gordon   "]
["                      Farmingdale State College    "]
["Development of this module was supported by the "]
["NSF's Division of Undergraduate Education  "]
["under grants DUE-0310123 and DUE-0442160."]
[{"$nulls":9}," "]

{"sheet":"Sheet2","index":1,"n_rows":504,"n_cols":10,"rows_kept":504}
[null,null,"q","f","x = f(t)","y = g(t)","plot x","plot y","Tracing point"]
[]
[null,null,{"$f":"a","v":-1.5},{"$f":"m*C3+bb","v":4.5},{"$f":"D*SIN(D3)*COS(C3)/SIN(C3+D3)","v":-0.9799849932008909},{"$f":"D*SIN(C3)*SIN(D3)/SIN(C3+D3)","v":13.819179931051986},{"$f":"E3","v":-0.9799849932008909},{"$f":"F3","v":13.819179931051986}]
[null,null,{"$f":"C3+dt","v":-1.4870259481037924},4.487025948103792,-1.1558476672498663,13.765518412570778,{"$f":"IF(OR(ABS(E4)>xMax,ABS(F4)>yMax),G3,E4)","v":-1.1558476672498663},{"$f":"IF(OR(ABS(E4)>xMax,ABS(F4)>yMax),H3,F4)","v":13.765518412570778},{"$f":"Sheet1!J26","v":8.01912842414443},{"$f":"Sheet1!J27","v":7.987674540992796}]
[null,null,-1.4740518962075848,4.474051896207585,-1.3302588816883794,13.707312167481088,-1.3302588816883794,13.707312167481088]
["a =",null,-1.4610778443113772,4.461077844311378,-1.5031012113211206,13.64460038408686,-1.5031012113211206,13.64460038408686,0,0]
["b =",null,-1.4481037924151696,4.44810379241517,-1.6742582872300649,13.577425284119192,-1.6742582872300649,13.577425284119192,2,0]
[null,null,-1.435129740518962,4.435129740518962,-1.8436148751217678,13.505832094310067,-1.8436148751217678,13.505832094310067]
[null,null,-1.4221556886227544,4.422155688622754,-2.0110569529107187,13.429869015942506,-2.0110569529107187,13.429869015942506]
[null,null,-1.4091816367265468,4.409181636726547,-2.176471787486541,13.349587192398129,-2.176471787486541,13.349587192398129,0,0]
[null,null,-1.3962075848303392,4.396207584830339,-2.339748010613417,13.265040674724192,-2.339748010613417,13.265040674724192,1.4,{"$f":"3","v":3}]
["delta t = ",{"$f":"(Sheet1!D21-Sheet1!D20)/501","v":0.012974051896207584},-1.3832335329341316,4.383233532934131,-2.5007756939106036,13.176286385243019,-2.5007756939106036,13.176286385243019,{"$f":"D","v":2},0]
[null,null,-1.370259481037924,4.370259481037924,-2.659446422863482,13.083384079227946,-2.659446422863482,13.083384079227946]
[null,null,-1.3572854291417165,4.357285429141717,-2.8156533698153634,12.986396304671931,-2.8156533698153634,12.986396304671931]
["xMax =",20,-1.3443113772455089,4.344311377245509,-2.969291365890978,12.885388360176277,-2.969291365890978,12.885388360176277]
["yMax =",50,-1.3313373253493013,4.331337325349301,-3.1202569718031774,12.78042825098745,-3.1202569718031774,12.78042825098745]
[null,null,-1.3183632734530937,4.318363273453094,-3.268448547495091,12.671586643211274,-3.268448547495091,12.671586643211274]
[null,null,-1.305389221556886,4.3053892215568865,-3.413766320570904,12.55893681623563,-3.413766320570904,12.55893681623563]
[null,null,-1.2924151696606785,4.2924151696606785,-3.556112453469292,12.442554613394119,-3.556112453469292,12.442554613394119]
[null,null,-1.279441117764471,4.2794411177644704,-3.6953911093341993,12.322518390903436,-3.6953911093341993,12.322518390903436]
[null,null,-1.2664670658682633,4.266467065868263,-3.8315085165385283,12.198908965108611,-3.8315085165385283,12.198908965108611]
[null,null,-1.2534930139720557,4.253493013972056,-3.9643730318173622,12.071809558071934,-3.9643730318173622,12.071809558071934]
[null,null,-1.240518962075848,4.240518962075848,-4.0938952019683335,11.941305741542486,-4.0938952019683335,11.941305741542486]
[null,null,-1.2275449101796405,4.22754491017964,-4.21998782407751,11.807485379343749,-4.21998782407751,11.807485379343749]
[null,null,-1.214570858283433,4.214570858283433,-4.342566004230129,11.670438568217671,-4.342566004230129,11.670438568217671]
[null,null,-1.2015968063872253,4.201596806387226,-4.461547214666747,11.53025757716542,-4.461547214666747,11.53025757716542]
[null,null,-1.1886227544910177,4.188622754491018,-4.576851349346458,11.387036785325922,-4.576851349346458,11.387036785325922]
[null,null,-1.1756487025948101,4.17564870259481,-4.6884007778796555,11.240872618433738,-4.6884007778796555,11.240872618433738]
[null,null,-1.1626746506986025,4.1626746506986025,-4.7961203977938975,11.091863483898686,-4.7961203977938975,11.091863483898686]
[null,null,-1.149700598802395,4.149700598802395,-4.899937685097807,10.940109704551313,-4.899937685097807,10.940109704551313]
[null,null,-1.1367265469061874,4.136726546906187,-4.999782743109096,10.78571345109906,-4.999782743109096,10.78571345109906]
[null,null,-1.1237524950099798,4.123752495009979,-5.09558834951371,10.628778673338317,-5.09558834951371,10.628778673338317]
[null,null,-1.1107784431137722,4.110778443113772,-5.187290001624289,10.46941103016837,-5.187290001624289,10.46941103016837]
[null,null,-1.0978043912175646,4.097804391217565,-5.27482595980758,10.307717818454684,-5.27482595980758,10.307717818454684]
[null,null,-1.084830339321357,4.084830339321357,-5.3581372890517205,10.143807900789692,-5.3581372890517205,10.143807900789692]
[null,null,-1.0718562874251494,4.071856287425149,-5.437167898645267,9.977791632199402,-5.437167898645267,9.977791632199402]
[null,null,-1.0588822355289418,4.058882235528942,-5.511864579941118,9.809780785844952,-5.511864579941118,9.809780785844952]
[null,null,-1.0459081836327342,4.045908183632735,-5.582177042180022,9.639888477769349,-5.582177042180022,9.639888477769349]
[null,null,-1.0329341317365266,4.032934131736527,-5.648057946349725,9.468229090740405,-5.648057946349725,9.468229090740405]
[null,null,-1.019960079840319,4.019960079840319,-5.709462937056814,9.294918197240793,-5.709462937056814,9.294918197240793]
[null,null,-1.0069860279441114,4.006986027944111,-5.76635067238963,9.120072481656866,-5.76635067238963,9.120072481656866]
[null,null,-0.9940119760479038,3.994011976047904,-5.818682851752289,8.943809661718806,-5.818682851752289,8.943809661718806]
[null,null,-0.9810379241516962,3.981037924151696,-5.866424241651353,8.766248409245561,-5.866424241651353,8.766248409245561]
[null,null,-0.9680638722554886,3.9680638722554886,-5.909542699417267,8.587508270246929,-5.909542699417267,8.587508270246929]
[null,null,-0.955089820359281,3.955089820359281,-5.948009194844945,8.407709584437288,-5.948009194844945,8.407709584437288]
[null,null,-0.9421157684630734,3.9421157684630734,-5.9817978297388334,8.22697340421493,-5.9817978297388334,8.22697340421493]
[null,null,-0.9291417165668658,3.929141716566866,-6.010885855349295,8.045421413161547,-6.010885855349295,8.045421413161547]
[null,null,-0.9161676646706582,3.9161676646706582,-6.035253687688569,7.863175844116792,-6.035253687688569,7.863175844116792]
[null,null,-0.9031936127744506,3.9031936127744506,-6.054884920716024,7.6803593968830075,-6.054884920716024,7.6803593968830075]
[null,null,-0.890219560878243,3.890219560878243,-6.069766337383772,7.497095155615588,-6.069766337383772,7.497095155615588]
[null,null,-0.8772455089820355,3.8772455089820355,-6.0798879185352845,7.313506505954571,-6.0798879185352845,7.313506505954571]
[null,null,-0.8642714570858279,3.864271457085828,-6.085242849650937,7.129717051953238,-6.085242849650937,7.129717051953238]
[null,null,-0.8512974051896203,3.8512974051896203,-6.085827525436001,6.945850532859663,-6.085827525436001,6.945850532859663]
[null,null,-0.8383233532934127,3.8383233532934127,-6.081641552247962,6.762030739807253,-6.081641552247962,6.762030739807253]
[null,null,-0.8253493013972051,3.825349301397205,-6.07268774836156,6.578381432470346,-6.07268774836156,6.578381432470346]
[null,null,-0.8123752495009975,3.8123752495009975,-6.0589721420713225,6.395026255740992,-6.0589721420713225,6.395026255740992]
[null,null,-0.7994011976047899,3.79940119760479,-6.04050396763293,6.212088656483008,-6.04050396763293,6.212088656483008]
[null,null,-0.7864271457085823,3.7864271457085823,-6.017295659046093,6.029691800419369,-6.017295659046093,6.029691800419369]
[null,null,-0.7734530938123747,3.7734530938123747,-5.989362841683171,5.847958489208871,-5.989362841683171,5.847958489208871]
[null,null,-0.7604790419161671,3.760479041916167,-5.956724321769119,5.667011077767918,-5.956724321769119,5.667011077767918]
[null,null,-0.7475049900199595,3.7475049900199595,-5.919402073719905,5.486971391893067,-5.919402073719905,5.486971391893067]
[null,null,-0.7345309381237519,3.734530938123752,-5.87742122534787,5.307960646239835,-5.87742122534787,5.307960646239835]
[null,null,-0.7215568862275443,3.7215568862275443,-5.830810040944015,5.130099362712949,-5.830810040944015,5.130099362712949]
[null,null,-0.7085828343313367,3.7085828343313367,-5.779599902248612,4.953507289323005,-5.779599902248612,4.953507289323005]
[null,null,-0.6956087824351291,3.695608782435129,-5.723825287322934,4.778303319564172,-5.723825287322934,4.778303319564172]
[null,null,-0.6826347305389215,3.6826347305389215,-5.663523747336333,4.604605412367206,-5.663523747336333,4.604605412367206]
[null,null,-0.669660678642714,{"$f":"m*C67+bb","v":3.669660678642714},{"$f":"D*SIN(D67)*COS(C67)/SIN(C67+D67)","v":-5.598735881284307},{"$f":"D*SIN(C67)*SIN(D67)/SIN(C67+D67)","v":4.432530512681671},-5.598735881284307,4.432530512681671]
[null,null,{"$f":"C67+dt","v":-0.6566866267465064},3.6566866267465064,-5.529505308654569,4.262194472740853,{"$f":"IF(OR(ABS(E68)>xMax,ABS(F68)>yMax),G67,E68)","v":-5.529505308654569},{"$f":"IF(OR(ABS(E68)>xMax,ABS(F68)>yMax),H67,F68)","v":4.262194472740853}]
[null,null,-0.6437125748502988,3.6437125748502988,-5.455878640059501,4.0937119740623436,-5.455878640059501,4.0937119740623436]
[null,null,-0.6307385229540912,3.630738522954091,-5.377905445854812,3.9271964502368464,-5.377905445854812,3.9271964502368464]
[null,null,-0.6177644710578836,3.6177644710578836,-5.2956382227654855,3.7627600105571557,-5.2956382227654855,3.7627600105571557]
[null,null,-0.604790419161676,3.604790419161676,-5.209132358541495,3.6005133645387497,-5.209132358541495,3.6005133645387497]
[null,null,-0.5918163672654684,3.5918163672654684,-5.118446094667104,3.4405657473827995,-5.118446094667104,3.4405657473827995]
[null,null,-0.5788423153692608,3.578842315369261,-5.02364048714884,3.2830248464317933,-5.02364048714884,3.2830248464317933]
[null,null,-0.5658682634730532,3.565868263473053,-4.924779365408535,3.1279967286672727,-4.924779365408535,3.1279967286672727]
[null,null,-0.5528942115768456,3.5528942115768456,-4.821929289309128,2.975585769298505,-4.821929289309128,2.975585769298505]
[null,null,-0.539920159680638,3.539920159680638,-4.715159504342153,2.825894581490178,-4.715159504342153,2.825894581490178]
[null,null,-0.5269461077844304,3.5269461077844304,-4.604541895007084,2.679023947276406,-4.604541895007084,2.679023947276406]
[null,null,-0.5139720558882228,3.513972055888223,-4.490150936413917,2.535072749707584,-4.490150936413917,2.535072749707584]
[null,null,-0.5009980039920152,3.500998003992015,-4.372063644141592,2.394137906275761,-4.372063644141592,2.394137906275761]
[null,null,-0.4880239520958076,3.4880239520958076,-4.250359522386,2.2563143036633577,-4.250359522386,2.2563143036633577]
[null,null,-0.47504990019960003,3.4750499001996,-4.125120510432478,2.121694733859159,-4.125120510432478,2.121694733859159]
[null,null,-0.46207584830339243,3.4620758483033924,-3.996430927488859,1.990369831684594,-3.996430927488859,1.990369831684594]
[null,null,-0.44910179640718484,3.449101796407185,-3.864377415916181,1.8624280137723639,-3.864377415916181,1.8624280137723639]
[null,null,-0.43612774451097724,3.4361277445109772,-3.7290488828953077,1.737955419038502,-3.7290488828953077,1.737955419038502]
[null,null,-0.42315369261476965,3.4231536926147696,-3.5905364405687195,1.6170358506879434,-3.5905364405687195,1.6170358506879434]
[null,null,-0.41017964071856206,3.410179640718562,-3.4489333446977772,1.499750719792649,-3.4489333446977772,1.499750719792649]
[null,null,-0.39720558882235446,3.3972055888223545,-3.3043349318767556,1.3861789904802748,-3.3043349318767556,1.3861789904802748]
[null,null,-0.38423153692614687,3.384231536926147,-3.156838555345931,1.2763971267702838,-3.156838555345931,1.2763971267702838]
[null,null,-0.37125748502993927,3.3712574850299393,-3.0065435194469217,1.1704790410932984,-3.0065435194469217,1.1704790410932984]
[null,null,-0.3582834331337317,3.3582834331337317,-2.8535510127644206,1.0684960445283491,-2.8535510127644206,1.0684960445283491]
[null,null,-0.3453093812375241,3.345309381237524,-2.697964039999328,0.9705167987915295,-2.697964039999328,0.9705167987915295]
[null,null,-0.3323353293413165,3.3323353293413165,-2.5398873526191594,0.876607270008374,-2.5398873526191594,0.876607270008374]
[null,null,-0.3193612774451089,3.319361277445109,-2.37942737833241,0.7868306843010887,-2.37942737833241,0.7868306843010887]
[null,null,-0.3063872255489013,3.3063872255489013,-2.2166921494343637,0.7012474852205327,-2.2166921494343637,0.7012474852205327]
[null,null,-0.2934131736526937,3.2934131736526937,-2.051791230072586,0.6199152930516117,-2.051791230072586,0.6199152930516117]
[null,null,-0.2804391217564861,3.280439121756486,-1.8848356424810782,0.5428888660194813,-1.8848356424810782,0.5428888660194813]
[null,null,-0.2674650698602785,3.2674650698602785,-1.7159377922327441,0.47022006342267797,-1.7159377922327441,0.47022006342267797]
[null,null,-0.2544910179640709,3.254491017964071,-1.5452113925605067,0.40195781071800174,-1.5452113925605067,0.40195781071800174]
[null,null,-0.24151696606786333,3.2415169660678633,-1.3727713877980159,0.3381480665806526,-1.3727713877980159,0.3381480665806526]
[null,null,-0.22854291417165573,3.2285429141716557,-1.1987338759915045,0.278833791961804,-1.1987338759915045,0.278833791961804]
[null,null,-0.21556886227544814,3.215568862275448,-1.023216030734882,0.22405492116444103,-1.023216030734882,0.22405492116444103]
[null,null,-0.20259481037924054,3.2025948103792405,-0.8463360222807033,0.17384833495693944,-0.8463360222807033,0.17384833495693944]
[null,null,-0.18962075848303295,3.189620758483033,-0.668212937980115,0.1282478357424871,-0.668212937980115,0.1282478357424871]
[null,null,-0.17664670658682535,3.1766467065868254,-0.48896670210535725,0.08728412480106419,-0.48896670210535725,0.08728412480106419]
[null,null,-0.16367265469061776,3.1636726546906178,-0.30871799510878906,0.05098478161930592,-0.30871799510878906,0.05098478161930592]
[null,null,-0.15069860279441016,3.15069860279441,-0.12758817237280565,0.019374245322163166,-0.12758817237280565,0.019374245322163166]
[null,null,-0.13772455089820257,3.1377245508982026,0.05430081749465249,-0.007526201781137148,0.05430081749465249,-0.007526201781137148]
[null,null,-0.12475049900199499,3.124750499001995,0.23682651476398928,-0.029698448525753852,0.23682651476398928,-0.029698448525753852]
[null,null,-0.11177644710578741,3.1117764471057874,0.4198660310319637,-0.04712756708486872,0.4198660310319637,-0.04712756708486872]
[null,null,-0.09880239520957983,3.09880239520958,0.6032961319583119,-0.059801823020089406,0.6032961319583119,-0.059801823020089406]
[null,null,-0.08582834331337225,3.085828343313372,0.786993320235277,-0.06771268318185149,0.786993320235277,-0.06771268318185149]
[null,null,-0.07285429141716467,3.0728542914171646,0.9708339187341867,-0.07085482145450063,0.9708339187341867,-0.07085482145450063]
[null,null,-0.059880239520957085,3.059880239520957,1.1546941537730968,-0.06922612234218689,1.1546941537730968,-0.06922612234218689]
[null,null,-0.046906187624749504,3.0469061876247494,1.338450238449443,-0.06282768239315668,1.338450238449443,-0.06282768239315668]
[null,null,-0.03393213572854192,3.033932135728542,1.52197845598159,-0.051663809461483905,1.52197845598159,-0.051663809461483905]
[null,null,-0.02095808383233434,3.020958083832334,1.705155243003177,-0.03574201980673684,1.705155243003177,-0.03574201980673684]
[null,null,-7.984031936126755E-3,3.0079840319361266,1.8878572727541651,-0.015073033033533807,1.8878572727541651,-0.015073033033533807]
[null,null,0.004990019960080829,2.995009980039919,2.0699615381125933,0.010329235125605494,2.0699615381125933,0.010329235125605494]
[null,null,0.017964071856288413,2.9820359281437114,2.2513454344111303,0.040447682179253944,2.2513454344111303,0.040447682179253944]
{"$rows_left_out":385}
{"sheet":"Defining Function","index":2,"n_rows":12,"n_cols":1,"rows_kept":12}
["                                                     Defining a Function in Excel"]
[]
["Computers have very specific rules you must follow when defining a function.  If you don't, the program will either not work at all or will work incorrectly."]
[]
["1. The Variable used should be the one named in the instruction, usually x, though sometimes y, t, Q (for an angle theta), "]
[" or even x and y (for a function of two variables). "]
[]
["2.  Order of Operations:  There five arithmetic operations, addition (+), subtraction (-), multiplication (*), division (/), and  exponentiation or power (^).  When computers see any of these operation symbols, they perform the indicated steps in a very particular order.  First, the power is done.  Second, products and quotients of adjacent terms is done.  Third, and last, sums and differences of adjacent terms are done.  So, in 10*x^3 + 5*x – 7, say with x = 2, the first pass only calculates 2^3 and ignores the multiplications and the sums and differences to calculate 2^3 = 8.  The second pass looks at 10*8 + 5*2 – 7 and only does the multiplications, so it produces 80 + 10 -  7.  The third pass looks at the +’s and –‘s to produce 80 + 10 – 7 = 83.  "]
[]
["3.    Parentheses  If you need an operation involving more than two adjacent terms, as in Ö4^3 + 6^2, the computer would take the square root of  4 to produce 2^3 + 6^2;  it would then cube the 2 and square the 6 to produce 8 + 36; and finally it would add the 8 and the 36 to get 44.  If you actually wanted the square root of the entire expression, you would need to use parentheses, as in Ö(4^3 + 6^2) to tell the computer to do all the operations inside the parentheses before taking the square root.  Therefore, it would calculate (4^3 + 6^2) = 64 + 36 = 100 and then take the square root of Ö100  =  10."]
[]
["4.  Built-In Functions  Computer programs have built-in functions for most common algebraic functions.  In Excel, the square root function is denoted by SQRT(…), so SQRT(100) = 10.  Alternatively, you could enter it as 100^.5 or 100^(1/2); notice that parentheses are needed to have the ½ done first.  The common trig functions are SIN (…), COS (…), and TAN (…), where the arguments are automatically interpreted as being in radians, not degrees.  The logarithm to the base 10 is represented by LOG (…) and the logarithm with the base e, known as the natural logarithm, is LN (…). The corresponding exponential function with base e is EXP (x).  If x is the variable, then each of these would be SQRT (x), SIN (x), COS (x), TAN (x), LOG (x) (for log with base 10 ), LN (x) (for log with base e ), and EXP (x)."]

{"sheet":"Sheet3","index":3,"n_rows":0,"n_cols":0,"rows_kept":0}