{"text_format":"3","workbook":"xlsx","n_sheets":3,"sheets":["English system","Metric system","Sheet2"],"not_rendered":{"charts":4,"images":6,"defined_names":15,"comments":2},"read":"whole","date_system":"1900"}

{"sheet":"English system","index":0,"n_rows":35,"n_cols":13,"rows_kept":35,"merged":[[28,2,28,4]]}
[null,"             A Bouncing Ball"]
[]
[null,"    This graphing utility produces the graph "]
[null,"        of the height H of a bouncing ball"]
[null,"               that is dropped from some"]
[null,null,"    initial height H0 "]
[null,"   using the English system of units with feet."]
[]
["What is the initial height H0 (in feet, 10 - 100)?"]
[null,null,{"$f":"E10","v":33},null,33]
[]
[]
["What percentage of the velocity is lost on each bounce (0 - 20%)?"]
[null,null,{"$f":"E14","v":7},"%",7]
[]
[{"$nulls":9},"Now trace a point along the path of the bouncing ball"]
[{"$nulls":11},119]
["Click each item below for suggestions and investigations",{"$nulls":9},"t =",{"$f":"L17*dt","v":5.95},"seconds"]
[null,"   Item 1",{"$nulls":8},"y =",{"$f":"LOOKUP(L$18,Sheet2!C3:C603,Sheet2!D3:D603)","v":{"v":18.915734739460582,"d":"18.92"}},"feet"]
[null,"   Item 2",{"$nulls":8},"v =",{"$f":"LOOKUP(L$18,Sheet2!C3:C603,Sheet2!F3:F603)","v":{"v":-19.216628783283575,"d":"-19.22"}},"ft/sec"]
[null,"   Item 3"]
[null,"   Item 4"]
[null,"   Item 5"]
[null,"   Item 6"]
[null,"   Item 7"]
[]
[]
["To access/download all the DIGMath Apps for Calculus"]
["      Click this link:",null,"DIGMath for Calculus"]
[]
["Created by:  Sheldon P. Gordon   "]
["                      Farmingdale State College    "]
["Development of this module was supported by the "]
["NSF's Division of Undergraduate Education  "]
["under grants DUE-0310123 and DUE-0442160."]

{"sheet":"Metric system","index":1,"n_rows":36,"n_cols":13,"rows_kept":36,"merged":[[29,2,29,4]]}
[null,"              A Bouncing Ball"]
[]
[null,"   This graphing utility produces the graph "]
[null,"          of the height H of a bouncing ball"]
[null,"               that is dropped from some"]
[null,null,"          initial height H0 "]
[null,"using the metric system of units with meters."]
[]
["What is the initial height H0 (in meters, 3 - 30)?"]
[null,null,{"$f":"E10","v":20},null,20]
[]
[]
["What percentage of the velocity is lost on each bounce (0 - 20%)?"]
[null,null,{"$f":"E14","v":10},"%",10]
[]
[{"$nulls":9},"Now trace a point along the path of the bouncing ball"]
[{"$nulls":10},127,115]
["Click each item below for suggestions and investigations",{"$nulls":9},"t =",{"$f":"K17*dtt","v":{"v":5.291666666666666,"d":"5.29"}},"seconds"]
[null,"   Item 1",{"$nulls":8},"y =",{"$f":"LOOKUP(L$18,Sheet2!J3:J603,Sheet2!K3:K603)","v":{"v":7.481766907149172,"d":"7.48"}},"meters"]
[null,"   Item 2",{"$nulls":8},"v =",{"$f":"LOOKUP(L$18,Sheet2!J3:J603,Sheet2!M3:M603)","v":{"v":-13.831919240875699,"d":"-13.83"}},"m/sec"]
[null,"   Item 3"]
[null,"   Item 4"]
[null,"   Item 5"]
[null,"   Item 6"]
[null,"   Item 7"]
[]
[]
[]
["To access/download all the DIGMath Apps for Calculus"]
["     Click this link:",null,"DIGMath for Calculus"]
[]
["Created by:  Sheldon P. Gordon   "]
["                      Farmingdale State College    "]
["Development of this module was supported by the "]
["NSF's Division of Undergraduate Education  "]
["under grants DUE-0310123 and DUE-0442160."]

{"sheet":"Sheet2","index":2,"n_rows":603,"n_cols":29,"rows_kept":603}
["English system",null,"t","y",null,"v",null,"Metric system",null,"t","y",null,"v",null,"English System",{"$nulls":7},"Metric System"]
[null,null,"First bounce",{"$nulls":6},"First bounce",{"$nulls":4},"t0","tfinal","t1 =",{"$f":"s/4","v":1.4361406616345072},"v1 =",{"$f":"df*s*8","v":42.73954609024293},0,null,"t0","tfinal","t1 =",{"$f":"SQRT(2*H00/gg)","v":2.0203050891044216},"v1 =",{"$f":"dff*gg*Z2","v":17.819090885900998},0]
[null,null,{"$f":"O4","v":0},{"$f":"h0","v":33},0.5,0,{"$nulls":3},{"$f":"W3","v":0},{"$f":"H00","v":20},0.5,0,null,0,0,"t2 =",{"$f":"R2+df*s/2","v":4.10736229227469},"v2 =",{"$f":"T2*df","v":39.747777863925926},0,null,0,0,"t2 =",{"$f":"Z2+2*AB2/gg","v":5.65685424949238},"v2 =",{"$f":"dff*AB2","v":16.0371817973109},0]
["sq rt(H0) =",{"$f":"SQRT(h0)","v":5.744562646538029},{"$f":"C3+Sheet2!B$12","v":0.05},{"$f":"IF(C4<=R$2,h0-16*C4^2,IF(AND(C4>R$2,C4<=R$3),T$2*(C4-R$2)-16*(C4-R$2)^2,IF(AND(C4>R$3,C4<=R$4),T$3*(C4-R$3)-16*(C4-R$3)^2,IF(AND(C4>R$4,C4<=R$5),T$4*(C4-R$4)-16*(C4-R$4)^2,IF(AND(C4>R$5,C4<=R$6),T$5*(C4-R$5)-16*(C4-R$5)^2,IF(AND(C4>R$6,C4<=R$7),T$6*(C4-R$6)-16*(C4-R$6)^2,IF(AND(C4>R$7,C4<=R$8),T$7*(C4-R$7)-16*(C4-R$7)^2,0)))))))","v":32.96},0.5,{"$f":"IF(C4<=R$2,-32*C4,IF(AND(C4>R$2,C4<=R$3),T$2-32*(C4-R$2),IF(AND(C4>R$3,C4<=R$4),T$3-32*(C4-R$3),IF(AND(C4>R$4,C4<=R$5),T$4-32*(C4-R$4),IF(AND(C4>R$5,C4<=R$6),T$5-32*(C4-R$5),IF(AND(C4>R$6,C4<=R$7),T$6-32*(C4-R$6),IF(AND(C4>R$7,C4<=R$8),T$7-32*(C4-R$7),0)))))))","v":-1.6},null,"sq rt(H00) =",{"$f":"SQRT(2*H00/9.6)","v":2.041241452319315},{"$f":"J3+Sheet2!I$12","v":0.041666666666666664},{"$f":"IF(J4<=Z$2,H00-4.8*J4^2,IF(AND(J4>Z$2,J4<=Z$3),AB$2*(J4-Z$2)-4.8*(J4-Z$2)^2,IF(AND(J4>Z$3,J4<=Z$4),AB$3*(J4-Z$3)-4.8*(J4-Z$3)^2,IF(AND(J4>Z$4,J4<=Z$5),AB$4*(J4-Z$4)-4.8*(J4-Z$4)^2,IF(AND(J4>Z$5,J4<=Z$6),AB$5*(J4-Z$5)-4.8*(J4-Z$5)^2,IF(AND(J4>Z$6,J4<=Z$7),AB$6*(J4-Z$6)-4.8*(J4-Z$6)^2,IF(AND(J4>Z$7,J4<=Z$8),AB$7*(J4-Z$7)-4.8*(J4-Z$7)^2,0)))))))","v":{"v":19.991666666666667,"d":"19.99"}},0.5,{"$f":"IF(J4<=Z$2,-gg*J4,IF(AND(J4>Z$2,J4<=Z$3),AB$2-gg*(J4-Z$2),IF(AND(J4>Z$3,J4<=Z$4),AB$3-gg*(J4-Z$3),IF(AND(J4>Z$4,J4<=Z$5),AB$4-gg*(J4-Z$4),IF(AND(J4>Z$5,J4<=Z$6),AB$5-gg*(J4-Z$5),IF(AND(J4>Z$6,J4<=Z$7),AB$6-gg*(J4-Z$6),IF(AND(J4>Z$7,J4<=Z$8),AB$7-gg*(J4-Z$7),0)))))))","v":-0.4083333333333333},null,0,0,"t3 =",{"$f":"R3+df^2*s/2","v":6.591598408770061},"v3 =",36.96543341345111,0,null,0,0,"t3 =",8.929748493841544,"v3 =",14.433463617579811,0]
["df =",{"$f":"1-frac/100","v":0.9299999999999999},{"$f":"C4+Sheet2!B$12","v":0.1},32.84,0.5,-3.2,null,"dff =",{"$f":"1-frac0/100","v":0.9},{"$f":"J4+Sheet2!I$12","v":0.08333333333333333},{"v":19.966666666666665,"d":"19.97"},0.5,-0.8166666666666667,null,null,0,"t4 =",{"$f":"R4+df^3*s/2","v":8.901937997110755},"v4 =",34.37785307450953,0,null,null,0,"t4 =",11.875353313755792,"v4 =",12.990117255821831,0]
[null,null,{"$f":"C5+Sheet2!B$12","v":0.15000000000000002},32.64,0.5,-4.800000000000001,null,"g =",9.8,{"$f":"J5+Sheet2!I$12","v":0.125},{"v":19.925,"d":"19.93"},0.5,-1.225,{"$nulls":3},"t5 =",{"$f":"R5+df^4*s/2","v":11.0505538142676},"v5 =",31.971403359293863,0,{"$nulls":3},"t5 =",14.526397651678614,"v5 =",11.691105530239648,0]
[null,null,{"$f":"C6+Sheet2!B$12","v":0.2},32.36,0.5,-6.4,{"$nulls":3},{"$f":"J6+Sheet2!I$12","v":0.16666666666666666},{"v":19.866666666666667,"d":"19.87"},0.5,-1.6333333333333333,{"$nulls":3},"t6 =",{"$f":"R6+df^5*s/2","v":13.048766524223465},"v6 =",29.73340512414329,0,{"$nulls":3},"t6 =",16.912337555809156,"v6 =",10.521994977215684,0]
[null,null,{"$f":"C7+Sheet2!B$12","v":0.25},{"v":32,"d":"32.00"},0.5,-8,{"$nulls":3},{"$f":"J7+Sheet2!I$12","v":0.20833333333333331},{"v":19.791666666666668,"d":"19.79"},0.5,-2.0416666666666665,{"$nulls":3},"t7 =",{"$f":"R7+df^6*s/2","v":14.90710434448242},"v7 =",27.652066765453256,0,{"$nulls":3},"t7 =",19.059683469526643,"v7 =",9.469795479494115,0]
[null,null,{"$f":"C8+Sheet2!B$12","v":0.3},31.56,0.5,-9.6,{"$nulls":3},{"$f":"J8+Sheet2!I$12","v":0.24999999999999997},{"v":19.7,"d":"19.70"},0.5,-2.4499999999999997,{"$nulls":4},30,null,null,0,{"$nulls":4},25,null,null,0]
[null,null,{"$f":"C9+Sheet2!B$12","v":0.35},31.04,0.5,-11.2,{"$nulls":3},{"$f":"J9+Sheet2!I$12","v":0.29166666666666663},{"v":19.59166666666667,"d":"19.59"},0.5,-2.8583333333333334]
[null,null,{"$f":"C10+Sheet2!B$12","v":0.39999999999999997},30.44,0.5,-12.799999999999999,{"$nulls":3},{"$f":"J10+Sheet2!I$12","v":0.3333333333333333},{"v":19.466666666666665,"d":"19.47"},0.5,-3.2666666666666666]
["delta t = ",0.05,{"$f":"C11+Sheet2!B$12","v":0.44999999999999996},29.76,0.5,-14.399999999999999,null,"delta t = ",{"$f":"25/600","v":0.041666666666666664},{"$f":"J11+Sheet2!I$12","v":0.375},{"v":19.325,"d":"19.33"},0.5,-3.6750000000000003]
[null,null,{"$f":"C12+Sheet2!B$12","v":0.49999999999999994},{"v":29,"d":"29.00"},0.5,-15.999999999999998,{"$nulls":3},{"$f":"J12+Sheet2!I$12","v":0.4166666666666667},{"v":19.166666666666668,"d":"19.17"},0.5,-4.083333333333334]
[null,null,{"$f":"C13+Sheet2!B$12","v":0.5499999999999999},28.16,0.5,-17.599999999999998,{"$nulls":3},{"$f":"J13+Sheet2!I$12","v":0.45833333333333337},{"v":18.991666666666667,"d":"18.99"},0.5,-4.491666666666667]
[null,null,{"$f":"C14+Sheet2!B$12","v":0.6},{"v":27.240000000000002,"d":"27.24"},0.5,-19.2,{"$nulls":3},{"$f":"J14+Sheet2!I$12","v":0.5},{"v":18.8,"d":"18.80"},0.5,-4.9]
[null,"t1",{"$f":"C15+Sheet2!B$12","v":0.65},26.24,0.5,-20.8,null,null,"t1",{"$f":"J15+Sheet2!I$12","v":0.5416666666666666},{"v":18.59166666666667,"d":"18.59"},0.5,-5.308333333333334]
[null,null,{"$f":"C16+Sheet2!B$12","v":0.7000000000000001},{"v":25.159999999999997,"d":"25.16"},0.5,-22.400000000000002,{"$nulls":3},{"$f":"J16+Sheet2!I$12","v":0.5833333333333333},{"v":18.366666666666667,"d":"18.37"},0.5,-5.716666666666667]
[null,null,{"$f":"C17+Sheet2!B$12","v":0.7500000000000001},{"v":23.999999999999996,"d":"24.00"},0.5,-24.000000000000004,{"$nulls":3},{"$f":"J17+Sheet2!I$12","v":0.6249999999999999},{"v":18.125,"d":"18.13"},0.5,-6.124999999999999]
[null,null,{"$f":"C18+Sheet2!B$12","v":0.8000000000000002},{"v":22.759999999999998,"d":"22.76"},0.5,-25.600000000000005,{"$nulls":3},{"$f":"J18+Sheet2!I$12","v":0.6666666666666665},{"v":17.866666666666667,"d":"17.87"},0.5,-6.533333333333332]
[null,null,{"$f":"C19+Sheet2!B$12","v":0.8500000000000002},{"v":21.439999999999994,"d":"21.44"},0.5,-27.200000000000006,{"$nulls":3},{"$f":"J19+Sheet2!I$12","v":0.7083333333333331},{"v":17.59166666666667,"d":"17.59"},0.5,-6.9416666666666655]
[null,null,{"$f":"C20+Sheet2!B$12","v":0.9000000000000002},{"v":20.039999999999992,"d":"20.04"},0.5,-28.800000000000008,{"$nulls":3},{"$f":"J20+Sheet2!I$12","v":0.7499999999999998},{"v":17.3,"d":"17.30"},0.5,-7.349999999999999]
[null,null,{"$f":"C21+Sheet2!B$12","v":0.9500000000000003},{"v":18.55999999999999,"d":"18.56"},0.5,-30.40000000000001,{"$nulls":3},{"$f":"J21+Sheet2!I$12","v":0.7916666666666664},{"v":16.991666666666667,"d":"16.99"},0.5,-7.758333333333331]
[null,null,{"$f":"C22+Sheet2!B$12","v":1.0000000000000002},{"v":16.999999999999993,"d":"17.00"},0.5,-32.00000000000001,{"$nulls":3},{"$f":"J22+Sheet2!I$12","v":0.833333333333333},{"v":16.666666666666668,"d":"16.67"},0.5,-8.166666666666664]
[null,null,{"$f":"C23+Sheet2!B$12","v":1.0500000000000003},{"v":15.359999999999992,"d":"15.36"},0.5,-33.60000000000001,{"$nulls":3},{"$f":"J23+Sheet2!I$12","v":0.8749999999999997},{"v":16.325000000000003,"d":"16.33"},0.5,-8.574999999999998]
[null,null,{"$f":"C24+Sheet2!B$12","v":1.1000000000000003},{"v":13.63999999999999,"d":"13.64"},0.5,-35.20000000000001,{"$nulls":3},{"$f":"J24+Sheet2!I$12","v":0.9166666666666663},{"v":15.96666666666667,"d":"15.97"},0.5,-8.98333333333333]
[null,null,{"$f":"C25+Sheet2!B$12","v":1.1500000000000004},{"v":11.839999999999986,"d":"11.84"},0.5,-36.80000000000001,{"$nulls":3},{"$f":"J25+Sheet2!I$12","v":0.9583333333333329},{"v":15.59166666666667,"d":"15.59"},0.5,-9.391666666666664]
[null,null,{"$f":"C26+Sheet2!B$12","v":1.2000000000000004},{"v":9.959999999999983,"d":"9.96"},0.5,-38.40000000000001,{"$nulls":3},{"$f":"J26+Sheet2!I$12","v":0.9999999999999996},{"v":15.200000000000005,"d":"15.20"},0.5,-9.799999999999997]
[null,null,{"$f":"C27+Sheet2!B$12","v":1.2500000000000004},{"v":7.999999999999982,"d":"8.00"},0.5,-40.000000000000014,{"$nulls":3},{"$f":"J27+Sheet2!I$12","v":1.0416666666666663},{"v":14.791666666666671,"d":"14.79"},0.5,-10.20833333333333]
[null,null,{"$f":"C28+Sheet2!B$12","v":1.3000000000000005},{"v":5.9599999999999795,"d":"5.96"},0.5,-41.600000000000016,{"$nulls":3},{"$f":"J28+Sheet2!I$12","v":1.083333333333333},{"v":14.36666666666667,"d":"14.37"},0.5,-10.616666666666665]
[null,null,{"$f":"C29+Sheet2!B$12","v":1.3500000000000005},{"v":3.8399999999999785,"d":"3.84"},0.5,-43.20000000000002,{"$nulls":3},{"$f":"J29+Sheet2!I$12","v":1.1249999999999998},{"v":13.925000000000002,"d":"13.93"},0.5,-11.024999999999999]
[null,null,{"$f":"C30+Sheet2!B$12","v":1.4000000000000006},{"v":1.6399999999999757,"d":"1.64"},0.5,-44.80000000000002,{"$nulls":3},{"$f":"J30+Sheet2!I$12","v":1.1666666666666665},{"v":13.466666666666669,"d":"13.47"},0.5,-11.433333333333334]
[null,null,{"$f":"C31+Sheet2!B$12","v":1.4500000000000006},{"v":0.5892685306934123,"d":"0.59"},0.5,42.29604726254714,{"$nulls":3},{"$f":"J31+Sheet2!I$12","v":1.2083333333333333},{"v":12.991666666666667,"d":"12.99"},0.5,-11.841666666666667]
[null,null,{"$f":"C32+Sheet2!B$12","v":1.5000000000000007},{"v":2.6640708938207713,"d":"2.66"},0.5,40.69604726254714,{"$nulls":3},{"$f":"J32+Sheet2!I$12","v":1.25},{"v":12.5,"d":"12.50"},0.5,-12.25]
[null,null,{"$f":"C33+Sheet2!B$12","v":1.5500000000000007},{"v":4.65887325694813,"d":"4.66"},0.5,39.09604726254714,{"$nulls":3},{"$f":"J33+Sheet2!I$12","v":1.2916666666666667},{"v":11.991666666666667,"d":"11.99"},0.5,-12.658333333333335]
[null,null,{"$f":"C34+Sheet2!B$12","v":1.6000000000000008},{"v":6.5736756200754884,"d":"6.57"},0.5,37.49604726254714,{"$nulls":3},{"$f":"J34+Sheet2!I$12","v":1.3333333333333335},{"v":11.466666666666665,"d":"11.47"},0.5,-13.066666666666668]
[null,"t2",{"$f":"C35+Sheet2!B$12","v":1.6500000000000008},{"v":8.408477983202847,"d":"8.41"},0.5,35.896047262547135,null,null,"t2",{"$f":"J35+Sheet2!I$12","v":1.3750000000000002},{"v":10.924999999999997,"d":"10.93"},0.5,-13.475000000000003]
[null,null,{"$f":"C36+Sheet2!B$12","v":1.7000000000000008},{"v":10.163280346330206,"d":"10.16"},0.5,34.296047262547134,{"$nulls":3},{"$f":"J36+Sheet2!I$12","v":1.416666666666667},{"v":10.366666666666664,"d":"10.37"},0.5,-13.883333333333336]
[null,null,{"$f":"C37+Sheet2!B$12","v":1.7500000000000009},{"v":11.838082709457563,"d":"11.84"},0.5,32.69604726254713,{"$nulls":3},{"$f":"J37+Sheet2!I$12","v":1.4583333333333337},{"v":9.791666666666663,"d":"9.79"},0.5,-14.291666666666671]
[null,null,{"$f":"C38+Sheet2!B$12","v":1.800000000000001},{"v":13.432885072584922,"d":"13.43"},0.5,31.09604726254713,{"$nulls":3},{"$f":"J38+Sheet2!I$12","v":1.5000000000000004},{"v":9.199999999999994,"d":"9.20"},0.5,-14.700000000000005]
[null,null,{"$f":"C39+Sheet2!B$12","v":1.850000000000001},{"v":14.947687435712279,"d":"14.95"},0.5,29.49604726254713,{"$nulls":3},{"$f":"J39+Sheet2!I$12","v":1.5416666666666672},{"v":8.59166666666666,"d":"8.59"},0.5,-15.10833333333334]
[null,null,{"$f":"C40+Sheet2!B$12","v":1.900000000000001},{"v":16.382489798839636,"d":"16.38"},0.5,27.89604726254713,{"$nulls":3},{"$f":"J40+Sheet2!I$12","v":1.583333333333334},{"v":7.966666666666658,"d":"7.97"},0.5,-15.516666666666673]
[null,null,{"$f":"C41+Sheet2!B$12","v":1.950000000000001},{"v":17.737292161966995,"d":"17.74"},0.5,26.296047262547127,{"$nulls":3},{"$f":"J41+Sheet2!I$12","v":1.6250000000000007},{"v":7.32499999999999,"d":"7.32"},0.5,-15.925000000000008]
[null,null,{"$f":"C42+Sheet2!B$12","v":2.000000000000001},{"v":19.012094525094348,"d":"19.01"},0.5,24.696047262547133,{"$nulls":3},{"$f":"J42+Sheet2!I$12","v":1.6666666666666674},{"v":6.666666666666655,"d":"6.67"},0.5,-16.333333333333343]
[null,null,{"$f":"C43+Sheet2!B$12","v":2.0500000000000007},{"v":20.2068968882217,"d":"20.21"},0.5,23.09604726254714,{"$nulls":3},{"$f":"J43+Sheet2!I$12","v":1.7083333333333341},{"v":5.991666666666655,"d":"5.99"},0.5,-16.741666666666674]
[null,null,{"$f":"C44+Sheet2!B$12","v":2.1000000000000005},{"v":21.321699251349052,"d":"21.32"},0.5,21.496047262547144,{"$nulls":3},{"$f":"J44+Sheet2!I$12","v":1.7500000000000009},{"v":5.2999999999999865,"d":"5.30"},0.5,-17.15000000000001]
[null,null,{"$f":"C45+Sheet2!B$12","v":2.1500000000000004},{"v":22.356501614476407,"d":"22.36"},0.5,19.89604726254715,{"$nulls":3},{"$f":"J45+Sheet2!I$12","v":1.7916666666666676},{"v":4.591666666666651,"d":"4.59"},0.5,-17.558333333333344]
[null,null,{"$f":"C46+Sheet2!B$12","v":2.2},{"v":23.311303977603764,"d":"23.31"},0.5,18.296047262547155,{"$nulls":3},{"$f":"J46+Sheet2!I$12","v":1.8333333333333344},{"v":3.8666666666666494,"d":"3.87"},0.5,-17.96666666666668]
[null,null,{"$f":"C47+Sheet2!B$12","v":2.25},{"v":24.186106340731115,"d":"24.19"},0.5,16.69604726254716,{"$nulls":3},{"$f":"J47+Sheet2!I$12","v":1.875000000000001},{"v":3.1249999999999822,"d":"3.12"},0.5,-18.37500000000001]
[null,null,{"$f":"C48+Sheet2!B$12","v":2.3},{"v":24.980908703858468,"d":"24.98"},0.5,15.096047262547167,{"$nulls":3},{"$f":"J48+Sheet2!I$12","v":1.9166666666666679},{"v":2.366666666666646,"d":"2.37"},0.5,-18.783333333333346]
[null,null,{"$f":"C49+Sheet2!B$12","v":2.3499999999999996},{"v":25.69571106698583,"d":"25.70"},0.5,13.496047262547172,{"$nulls":3},{"$f":"J49+Sheet2!I$12","v":1.9583333333333346},{"v":1.5916666666666437,"d":"1.59"},0.5,-19.19166666666668]
[null,null,{"$f":"C50+Sheet2!B$12","v":2.3999999999999995},{"v":26.330513430113182,"d":"26.33"},0.5,11.896047262547178,{"$nulls":3},{"$f":"J50+Sheet2!I$12","v":2.0000000000000013},{"v":0.7999999999999758,"d":"0.80"},0.5,-19.600000000000016]
[null,"t3",{"$f":"C51+Sheet2!B$12","v":2.4499999999999993},{"v":26.885315793240537,"d":"26.89"},0.5,10.296047262547184,null,null,"t3",{"$f":"J51+Sheet2!I$12","v":2.041666666666668},{"v":0.3784535704673391,"d":"0.38"},0.5,17.609747425790985]
[null,{"$f":"R4","v":6.591598408770061},{"$f":"C52+Sheet2!B$12","v":2.499999999999999},{"v":27.3601181563679,"d":"27.36"},0.5,8.69604726254719,null,null,{"$f":"Z3","v":5.65685424949238},{"$f":"J52+Sheet2!I$12","v":2.0833333333333344},{"v":1.1040377263549797,"d":"1.10"},0.5,17.201414092457654]
[null,null,{"$f":"C53+Sheet2!B$12","v":2.549999999999999},{"v":27.754920519495254,"d":"27.75"},0.5,7.096047262547195,{"$nulls":3},{"$f":"J53+Sheet2!I$12","v":2.125000000000001},{"v":1.8129552155759536,"d":"1.81"},0.5,16.793080759124322]
[null,null,{"$f":"C54+Sheet2!B$12","v":2.5999999999999988},{"v":28.069722882622617,"d":"28.07"},0.5,5.496047262547201,{"$nulls":3},{"$f":"J54+Sheet2!I$12","v":2.1666666666666674},{"v":2.505206038130261,"d":"2.51"},0.5,16.38474742579099]
[null,null,{"$f":"C55+Sheet2!B$12","v":2.6499999999999986},{"v":28.304525245749975,"d":"28.30"},0.5,3.8960472625472065,{"$nulls":3},{"$f":"J55+Sheet2!I$12","v":2.208333333333334},{"v":3.1807901940179018,"d":"3.18"},0.5,15.976414092457658]
[null,null,{"$f":"C56+Sheet2!B$12","v":2.6999999999999984},{"v":28.45932760887733,"d":"28.46"},0.5,2.296047262547212,{"$nulls":3},{"$f":"J56+Sheet2!I$12","v":2.2500000000000004},{"v":3.839707683238876,"d":"3.84"},0.5,15.568080759124324]
[null,null,{"$f":"C57+Sheet2!B$12","v":2.7499999999999982},{"v":28.534129972004695,"d":"28.53"},0.5,0.6960472625472178,{"$nulls":3},{"$f":"J57+Sheet2!I$12","v":2.291666666666667},{"v":4.481958505793184,"d":"4.48"},0.5,15.159747425790993]
[null,null,{"$f":"C58+Sheet2!B$12","v":2.799999999999998},{"v":28.528932335132055,"d":"28.53"},0.5,-0.9039527374527765,{"$nulls":3},{"$f":"J58+Sheet2!I$12","v":2.3333333333333335},{"v":5.107542661680825,"d":"5.11"},0.5,14.751414092457662]
[null,null,{"$f":"C59+Sheet2!B$12","v":2.849999999999998},{"v":28.443734698259412,"d":"28.44"},0.5,-2.503952737452771,{"$nulls":3},{"$f":"J59+Sheet2!I$12","v":2.375},{"v":5.7164601509018,"d":"5.72"},0.5,14.34308075912433]
[null,null,{"$f":"C60+Sheet2!B$12","v":2.8999999999999977},{"v":28.27853706138678,"d":"28.28"},0.5,-4.103952737452765,{"$nulls":3},{"$f":"J60+Sheet2!I$12","v":2.4166666666666665},{"v":6.308710973456108,"d":"6.31"},0.5,13.934747425790999]
[null,null,{"$f":"C61+Sheet2!B$12","v":2.9499999999999975},{"v":28.033339424514146,"d":"28.03"},0.5,-5.703952737452759,{"$nulls":3},{"$f":"J61+Sheet2!I$12","v":2.458333333333333},{"v":6.88429512934375,"d":"6.88"},0.5,13.526414092457667]
[null,null,{"$f":"C62+Sheet2!B$12","v":2.9999999999999973},{"v":27.7081417876415,"d":"27.71"},0.5,-7.303952737452754,{"$nulls":3},{"$f":"J62+Sheet2!I$12","v":2.4999999999999996},{"v":7.443212618564726,"d":"7.44"},0.5,13.118080759124334]
[null,"t4",{"$f":"C63+Sheet2!B$12","v":3.049999999999997},{"v":27.302944150768866,"d":"27.30"},0.5,-8.903952737452748,null,null,"t4",{"$f":"J63+Sheet2!I$12","v":2.541666666666666},{"v":7.985463441119033,"d":"7.99"},0.5,12.709747425791]
[null,{"$f":"R5","v":8.901937997110755},{"$f":"C64+Sheet2!B$12","v":3.099999999999997},{"v":26.81774651389624,"d":"26.82"},0.5,-10.503952737452742,null,null,{"$f":"Z4","v":8.929748493841544},{"$f":"J64+Sheet2!I$12","v":2.5833333333333326},{"v":8.511047597006675,"d":"8.51"},0.5,12.30141409245767]
[null,null,{"$f":"C65+Sheet2!B$12","v":3.149999999999997},{"v":26.252548877023592,"d":"26.25"},0.5,-12.103952737452737,{"$nulls":3},{"$f":"J65+Sheet2!I$12","v":2.624999999999999},{"v":9.019965086227652,"d":"9.02"},0.5,11.893080759124338]
[null,null,{"$f":"C66+Sheet2!B$12","v":3.1999999999999966},{"v":25.60735124015096,"d":"25.61"},0.5,-13.703952737452731,{"$nulls":3},{"$f":"J66+Sheet2!I$12","v":2.6666666666666656},{"v":9.51221590878196,"d":"9.51"},0.5,11.484747425791006]
[null,null,{"$f":"C67+Sheet2!B$12","v":3.2499999999999964},{"$f":"IF(C68<=R$2,h0-16*C68^2,IF(AND(C68>R$2,C68<=R$3),T$2*(C68-R$2)-16*(C68-R$2)^2,IF(AND(C68>R$3,C68<=R$4),T$3*(C68-R$3)-16*(C68-R$3)^2,IF(AND(C68>R$4,C68<=R$5),T$4*(C68-R$4)-16*(C68-R$4)^2,IF(AND(C68>R$5,C68<=R$6),T$5*(C68-R$5)-16*(C68-R$5)^2,IF(AND(C68>R$6,C68<=R$7),T$6*(C68-R$6)-16*(C68-R$6)^2,IF(AND(C68>R$7,C68<=R$8),T$7*(C68-R$7)-16*(C68-R$7)^2,0)))))))","v":{"v":24.882153603278333,"d":"24.88"}},0.5,{"$f":"IF(C68<=R$2,-32*C68,IF(AND(C68>R$2,C68<=R$3),T$2-32*(C68-R$2),IF(AND(C68>R$3,C68<=R$4),T$3-32*(C68-R$3),IF(AND(C68>R$4,C68<=R$5),T$4-32*(C68-R$4),IF(AND(C68>R$5,C68<=R$6),T$5-32*(C68-R$5),IF(AND(C68>R$6,C68<=R$7),T$6-32*(C68-R$6),IF(AND(C68>R$7,C68<=R$8),T$7-32*(C68-R$7),0)))))))","v":-15.303952737452725},{"$nulls":3},{"$f":"J67+Sheet2!I$12","v":2.708333333333332},{"$f":"IF(J68<=Z$2,H00-4.8*J68^2,IF(AND(J68>Z$2,J68<=Z$3),AB$2*(J68-Z$2)-4.8*(J68-Z$2)^2,IF(AND(J68>Z$3,J68<=Z$4),AB$3*(J68-Z$3)-4.8*(J68-Z$3)^2,IF(AND(J68>Z$4,J68<=Z$5),AB$4*(J68-Z$4)-4.8*(J68-Z$4)^2,IF(AND(J68>Z$5,J68<=Z$6),AB$5*(J68-Z$5)-4.8*(J68-Z$5)^2,IF(AND(J68>Z$6,J68<=Z$7),AB$6*(J68-Z$6)-4.8*(J68-Z$6)^2,IF(AND(J68>Z$7,J68<=Z$8),AB$7*(J68-Z$7)-4.8*(J68-Z$7)^2,0)))))))","v":{"v":9.987800064669601,"d":"9.99"}},0.5,{"$f":"IF(J68<=Z$2,-gg*J68,IF(AND(J68>Z$2,J68<=Z$3),AB$2-gg*(J68-Z$2),IF(AND(J68>Z$3,J68<=Z$4),AB$3-gg*(J68-Z$3),IF(AND(J68>Z$4,J68<=Z$5),AB$4-gg*(J68-Z$4),IF(AND(J68>Z$5,J68<=Z$6),AB$5-gg*(J68-Z$5),IF(AND(J68>Z$6,J68<=Z$7),AB$6-gg*(J68-Z$6),IF(AND(J68>Z$7,J68<=Z$8),AB$7-gg*(J68-Z$7),0)))))))","v":11.076414092457675}]
[null,null,{"$f":"C68+Sheet2!B$12","v":3.2999999999999963},{"v":24.07695596640569,"d":"24.08"},0.5,-16.90395273745272,{"$nulls":3},{"$f":"J68+Sheet2!I$12","v":2.7499999999999987},{"v":10.446717553890577,"d":"10.45"},0.5,10.668080759124344]
[null,null,{"$f":"C69+Sheet2!B$12","v":3.349999999999996},{"v":23.19175832953306,"d":"23.19"},0.5,-18.503952737452714,{"$nulls":3},{"$f":"J69+Sheet2!I$12","v":2.791666666666665},{"v":10.888968376444886,"d":"10.89"},0.5,10.25974742579101]
[null,null,{"$f":"C70+Sheet2!B$12","v":3.399999999999996},{"v":22.226560692660435,"d":"22.23"},0.5,-20.10395273745271,{"$nulls":3},{"$f":"J70+Sheet2!I$12","v":2.8333333333333317},{"v":11.31455253233253,"d":"11.31"},0.5,9.851414092457679]
[null,null,{"$f":"C71+Sheet2!B$12","v":3.4499999999999957},{"v":21.181363055787813,"d":"21.18"},0.5,-21.703952737452703,{"$nulls":3},{"$f":"J71+Sheet2!I$12","v":2.8749999999999982},{"v":11.723470021553506,"d":"11.72"},0.5,9.443080759124348]
[null,null,{"$f":"C72+Sheet2!B$12","v":3.4999999999999956},{"v":20.05616541891517,"d":"20.06"},0.5,-23.303952737452697,{"$nulls":3},{"$f":"J72+Sheet2!I$12","v":2.9166666666666647},{"v":12.115720844107816,"d":"12.12"},0.5,9.034747425791014]
[null,null,{"$f":"C73+Sheet2!B$12","v":3.5499999999999954},{"v":18.850967782042545,"d":"18.85"},0.5,-24.90395273745269,{"$nulls":3},{"$f":"J73+Sheet2!I$12","v":2.9583333333333313},{"v":12.49130499999546,"d":"12.49"},0.5,8.626414092457683]
[null,"t5",{"$f":"C74+Sheet2!B$12","v":3.599999999999995},{"v":17.56577014516992,"d":"17.57"},0.5,-26.503952737452686,null,null,"t5",{"$f":"J74+Sheet2!I$12","v":2.999999999999998},{"v":12.850222489216435,"d":"12.85"},0.5,8.218080759124351]
[null,{"$f":"R6","v":11.0505538142676},{"$f":"C75+Sheet2!B$12","v":3.649999999999995},{"v":16.20057250829727,"d":"16.20"},0.5,-28.10395273745268,null,null,{"$f":"Z5","v":11.875353313755792},{"$f":"J75+Sheet2!I$12","v":3.0416666666666643},{"v":13.192473311770744,"d":"13.19"},0.5,7.80974742579102]
[null,null,{"$f":"C76+Sheet2!B$12","v":3.699999999999995},{"v":14.75537487142465,"d":"14.76"},0.5,-29.703952737452674,{"$nulls":3},{"$f":"J76+Sheet2!I$12","v":3.083333333333331},{"v":13.518057467658387,"d":"13.52"},0.5,7.401414092457687]
[null,null,{"$f":"C77+Sheet2!B$12","v":3.7499999999999947},{"v":13.23017723455203,"d":"13.23"},0.5,-31.30395273745267,{"$nulls":3},{"$f":"J77+Sheet2!I$12","v":3.1249999999999973},{"v":13.826974956879365,"d":"13.83"},0.5,6.993080759124355]
[null,null,{"$f":"C78+Sheet2!B$12","v":3.7999999999999945},{"v":11.624979597679385,"d":"11.62"},0.5,-32.90395273745266,{"$nulls":3},{"$f":"J78+Sheet2!I$12","v":3.166666666666664},{"v":14.119225779433677,"d":"14.12"},0.5,6.584747425791024]
[null,null,{"$f":"C79+Sheet2!B$12","v":3.8499999999999943},{"v":9.93978196080677,"d":"9.94"},0.5,-34.50395273745266,{"$nulls":3},{"$f":"J79+Sheet2!I$12","v":3.2083333333333304},{"v":14.39480993532132,"d":"14.39"},0.5,6.176414092457691]
{"$rows_left_out":523}