{"text_format":"3","workbook":"xlsx","n_sheets":4,"sheets":["y' agrees","y' and y\" agree","Sheet3","Sheet4"],"not_rendered":{"charts":2,"images":2,"defined_names":7,"comments":2},"read":"whole","date_system":"1900"}

{"sheet":"y' agrees","index":0,"n_rows":53,"n_cols":6,"rows_kept":53,"merged":[[46,2,46,4]]}
[null,"            Cubic Splines","     Cubic Splines"]
[null," When y' Agrees at Nodes"]
[]
[null,"            This DIGMath module illustrates "]
[null,"           the notion of using cubic splines"]
[null," to create a smooth curve made up of a series"]
[null,"      of cubic curves that will pass through"]
[null,"     any set of points and where the slopes"]
[null,"   agree at the points where the cubics meet."]
[]
[]
["How many points (3 - 19)?",{"$nulls":3},{"$f":"2*F12+5","v":15},5]
[]
["Enter the coordinates in the cells below:"]
["    with the x's in ASCENDING order:"]
{"$rows_left_out":39}
{"sheet":"y' and y\" agree","index":1,"n_rows":46,"n_cols":6,"rows_kept":46,"merged":[[39,2,39,4]]}
[null,"            Cubic Splines","        Cubic Splines"]
[null,"When y' and y\" Agree at Nodes"]
[]
[null,"               This DIGMath module illustrates "]
[null,"              the notion of using cubic splines"]
[null,"     to create a smooth curve made up of a series"]
[null,"       of cubic curves that will pass through any"]
[null," set of points and where both the first and second"]
[null,"     derivatives agree where the cubics connect."]
[]
[]
[null,"How many points (4 - 10)?",null,null,{"$f":"F12","v":6},6]
[]
["Enter the coordinates in the cells below:"]
["    with the x's in ASCENDING order:"]
{"$rows_left_out":32}
{"sheet":"Sheet3","index":2,"n_rows":45,"n_cols":33,"rows_kept":45}
[null,"x","y",null,"First cubic",null,null,"Second cubic",null,null,"Third cubic",null,null,"Fourth cubic",null,null,"Fifth cubic",null,null,"Sixth cubic",null,null,"Seventh cubic",null,null,"Eighth cubic",null,null,"Eighth cubic"]
[1,{"$f":"'y'' agrees'!B17","v":0},{"$f":"'y'' agrees'!C17","v":4},null,"m =",{"$f":"(C3-C2)/(B3-B2)","v":{"v":2.5,"d":"2.500"}},null,"m =",{"$f":"F4+2*F10*$B4+3*F11*$B4^2","v":{"v":4.5,"d":"4.500"}},null,"m =",{"$f":"I4+2*I10*$I5+3*I11*$I5^2","v":{"v":-2.186666666666665,"d":"-2.187"}},null,"m =",{"$f":"L4+2*L10*L6+3*L11*L6^2","v":{"v":5.813333333333335,"d":"5.813"}},null,"m =",{"$f":"O4+2*O10*O6+3*O11*O6^2","v":{"v":-11.113333333333328,"d":"-11.113"}},null,"m =",{"$f":"R4+2*R10*R6+3*R11*R6^2","v":{"v":1.2577777777777825,"d":"1.258"}},null,"m =",{"$f":"U4+2*U10*U6+3*U11*U6^2","v":{"v":-4.639259259259258,"d":"-4.639"}},null,"m =",{"$f":"X4+2*X10*X6+3*X11*X6^2","v":{"v":5.424444444444446,"d":"5.424"}},null,"m =",{"$f":"AA4+2*AA10*AA6+3*AA11*AA6^2","v":{"$error":"#DIV/0!"}}]
[2,{"$f":"'y'' agrees'!B18","v":2},{"$f":"'y'' agrees'!C18","v":9},null,"a=",{"$f":"C2","v":{"v":4,"d":"4.000"}},null,"a=",{"$f":"$C4","v":{"v":16,"d":"16.000"}},null,"a=",{"$f":"$C6","v":{"v":12,"d":"12.000"}},null,"a=",{"$f":"$C8","v":{"v":16,"d":"16.000"}},null,"a=",{"$f":"$C10","v":{"v":6,"d":"6.000"}},null,"a=",{"$f":"$C12","v":{"v":11,"d":"11.000"}},null,"a=",{"$f":"$C14","v":{"v":8,"d":"8.000"}},null,"a=",{"$f":"$C16","v":{"v":5,"d":"5.000"}},null,"a=",{"$f":"$C18","v":{"v":5,"d":"5.000"}}]
[3,{"$f":"IF(A4<=n,'y'' agrees'!B19,\"\")","v":4},{"$f":"'y'' agrees'!C19","v":16},null,"b=",{"$f":"F2","v":{"v":2.5,"d":"2.500"}},null,"b=",{"$f":"I2","v":{"v":4.5,"d":"4.500"}},null,"b=",{"$f":"L2","v":{"v":-2.186666666666665,"d":"-2.187"}},null,"b=",{"$f":"O2","v":{"v":5.813333333333335,"d":"5.813"}},null,"b=",{"$f":"R2","v":{"v":-11.113333333333328,"d":"-11.113"}},null,"b=",{"$f":"U2","v":{"v":1.2577777777777825,"d":"1.258"}},null,"b=",{"$f":"X2","v":{"v":-4.639259259259258,"d":"-4.639"}},null,"b=",{"$f":"AA2","v":{"v":5.424444444444446,"d":"5.424"}},null,"b=",{"$f":"AD2","v":{"$error":"#DIV/0!"}}]
[4,{"$f":"IF(A5<=n,'y'' agrees'!B20,\"\")","v":7},{"$f":"'y'' agrees'!C20","v":18},null,"d0 =",{"$f":"$B3-$B2","v":{"v":2,"d":"2.000"}},null,"d0 =",{"$f":"$B5-$B4","v":{"v":3,"d":"3.000"}},null,"d0 =",{"$f":"$B7-$B6","v":{"v":3,"d":"3.000"}},null,"d0 =",{"$f":"$B9-$B8","v":{"v":2,"d":"2.000"}},null,"d0 =",{"$f":"$B11-$B10","v":{"v":3,"d":"3.000"}},null,"d0 =",{"$f":"$B13-$B12","v":{"v":3,"d":"3.000"}},null,"d0 =",{"$f":"$B15-$B14","v":{"v":2,"d":"2.000"}},null,"d0 =",{"$f":"$B17-$B16","v":{"v":0,"d":"0.000"}},null,"d0 =",{"$f":"$B19-$B18","v":{"v":0,"d":"0.000"}}]
[5,{"$f":"IF(A6<=n,'y'' agrees'!B21,\"\")","v":9},{"$f":"'y'' agrees'!C21","v":12},null,"d1 =",{"$f":"$B4-$B2","v":{"v":4,"d":"4.000"}},null,"d1 =",{"$f":"$B6-$B4","v":{"v":5,"d":"5.000"}},null,"d1 =",{"$f":"$B8-$B6","v":{"v":6,"d":"6.000"}},null,"d1 =",{"$f":"$B10-$B8","v":{"v":5,"d":"5.000"}},null,"d1 =",{"$f":"$B12-$B10","v":{"v":5,"d":"5.000"}},null,"d1 =",{"$f":"$B14-$B12","v":{"v":5,"d":"5.000"}},null,"d1 =",{"$f":"$B16-$B14","v":{"v":5,"d":"5.000"}},null,"d1 =",{"$f":"$B18-$B16","v":{"v":0,"d":"0.000"}},null,"d1 =",{"$f":"$B20-$B18","v":{"v":0,"d":"0.000"}}]
[6,{"$f":"IF($A7<=n,'y'' agrees'!B22,LOOKUP(n,A$2:A$20,B$2:B$20))","v":12},{"$f":"IF($A7<=n,'y'' agrees'!C22,LOOKUP(n,A$2:A$20,C$2:C$20))","v":8},null,"dd =",{"$f":"F5^2*F6^2*(F6-F5)","v":{"v":128,"d":"128.000"}},{"$f":"IF(F7=0,\"No Solution\",\"\")","v":""},"dd =",{"$f":"I5^2*I6^2*(I6-I5)","v":{"v":450,"d":"450.000"}},{"$f":"IF(I7=0,\"No Solution\",\"\")","v":""},"dd =",{"$f":"L5^2*L6^2*(L6-L5)","v":{"v":972,"d":"972.000"}},{"$f":"IF(L7=0,\"No Solution\",\"\")","v":""},"dd =",{"$f":"O5^2*O6^2*(O6-O5)","v":{"v":300,"d":"300.000"}},{"$f":"IF(O7=0,\"No Solution\",\"\")","v":""},"dd =",{"$f":"R5^2*R6^2*(R6-R5)","v":{"v":450,"d":"450.000"}},{"$f":"IF(R7=0,\"No Solution\",\"\")","v":""},"dd =",{"$f":"U5^2*U6^2*(U6-U5)","v":{"v":450,"d":"450.000"}},{"$f":"IF(U7=0,\"No Solution\",\"\")","v":""},"dd =",{"$f":"X5^2*X6^2*(X6-X5)","v":{"v":300,"d":"300.000"}},{"$f":"IF(X7=0,\"No Solution\",\"\")","v":""},"dd =",{"$f":"AA5^2*AA6^2*(AA6-AA5)","v":{"v":0,"d":"0.000"}},{"$f":"IF(AA7=0,\"No Solution\",\"\")","v":"No Solution"},"dd =",{"$f":"AD5^2*AD6^2*(AD6-AD5)","v":{"v":0,"d":"0.000"}},{"$f":"IF(AD7=0,\"No Solution\",\"\")","v":"No Solution"}]
[7,{"$f":"IF($A8<=n,'y'' agrees'!B23,LOOKUP(n,A$2:A$20,B$2:B$20))","v":15},{"$f":"IF($A8<=n,'y'' agrees'!C23,LOOKUP(n,A$2:A$20,C$2:C$20))","v":16},null,"e0 =",{"$f":"C3-C2-F2*F5","v":{"v":0,"d":"0.000"}},null,"e0 =",{"$f":"$C5-$C4-I2*I5","v":{"v":-11.5,"d":"-11.500"}},null,"e0 =",{"$f":"$C7-$C6-L2*L5","v":{"v":2.559999999999995,"d":"2.560"}},null,"e0 =",{"$f":"$C9-$C8-O2*O5","v":{"v":-5.6266666666666705,"d":"-5.627"}},null,"e0 =",{"$f":"$C11-$C10-R2*R5","v":{"v":30.339999999999982,"d":"30.340"}},null,"e0 =",{"$f":"$C13-$C12-U2*U5","v":{"v":-1.7733333333333476,"d":"-1.773"}},null,"e0 =",{"$f":"$C15-$C14-X2*X5","v":{"v":2.2785185185185153,"d":"2.279"}},null,"e0 =",{"$f":"$C17-$C16-AA2*AA5","v":{"v":0,"d":"0.000"}},null,"e0 =",{"$f":"$C19-$C18-AD2*AD5","v":{"$error":"#DIV/0!"}}]
[8,{"$f":"IF($A9<=n,'y'' agrees'!B24,LOOKUP(n,A$2:A$20,B$2:B$20))","v":17},{"$f":"IF($A9<=n,'y'' agrees'!C24,LOOKUP(n,A$2:A$20,C$2:C$20))","v":22},null,"e1 =",{"$f":"C4-C2-F2*F6","v":{"v":2,"d":"2.000"}},null,"e1 =",{"$f":"$C6-$C4-I2*I6","v":{"v":-26.5,"d":"-26.500"}},null,"e1 =",{"$f":"$C8-$C6-L2*L6","v":{"v":17.11999999999999,"d":"17.120"}},null,"e1 =",{"$f":"$C10-$C8-O2*O6","v":{"v":-39.06666666666668,"d":"-39.067"}},null,"e1 =",{"$f":"$C12-$C10-R2*R6","v":{"v":60.56666666666664,"d":"60.567"}},null,"e1 =",{"$f":"$C14-$C12-U2*U6","v":{"v":-9.288888888888913,"d":"-9.289"}},null,"e1 =",{"$f":"$C16-$C14-X2*X6","v":{"v":20.19629629629629,"d":"20.196"}},null,"e1 =",{"$f":"$C18-$C16-AA2*AA6","v":{"v":0,"d":"0.000"}},null,"e1 =",{"$f":"$C20-$C18-AD2*AD6","v":{"$error":"#DIV/0!"}}]
[9,{"$f":"IF($A10<=n,'y'' agrees'!B25,LOOKUP(n,A$2:A$20,B$2:B$20))","v":20},{"$f":"IF($A10<=n,'y'' agrees'!C25,LOOKUP(n,A$2:A$20,C$2:C$20))","v":6},null,"c=",{"$f":"(F8*F6^3-F9*F5^3)/F7","v":-0.125},null,"c=",{"$f":"(I8*I6^3-I9*I5^3)/I7","v":-1.6044444444444443},null,"c=",{"$f":"(L8*L6^3-L9*L5^3)/L7","v":0.09333333333333249},null,"c=",{"$f":"(O8*O6^3-O9*O5^3)/O7","v":-1.302666666666668},null,"c=",{"$f":"(R8*R6^3-R9*R5^3)/R7","v":4.793777777777774},null,"c=",{"$f":"(U8*U6^3-U9*U5^3)/U7","v":0.0647407407407382},null,"c=",{"$f":"(X8*X6^3-X9*X5^3)/X7","v":0.4108148148148136},null,"c=",{"$f":"(AA8*AA6^3-AA9*AA5^3)/AA7","v":{"$error":"#DIV/0!"}},null,"c=",{"$f":"(AD8*AD6^3-AD9*AD5^3)/AD7","v":{"$error":"#DIV/0!"}}]
[10,{"$f":"IF($A11<=n,'y'' agrees'!B26,LOOKUP(n,A$2:A$20,B$2:B$20))","v":23},{"$f":"IF($A11<=n,'y'' agrees'!C26,LOOKUP(n,A$2:A$20,C$2:C$20))","v":3},null,"d=",{"$f":"(F9*F5^2-F8*F6^2)/F7","v":{"v":0.0625,"d":"0.063"}},null,"d=",{"$f":"(I9*I5^2-I8*I6^2)/I7","v":{"v":0.10888888888888888,"d":"0.109"}},null,"d=",{"$f":"(L9*L5^2-L8*L6^2)/L7","v":{"v":0.0637037037037038,"d":"0.064"}},null,"d=",{"$f":"(O9*O5^2-O8*O6^2)/O7","v":{"v":-0.05199999999999979,"d":"-0.052"}},null,"d=",{"$f":"(R9*R5^2-R8*R6^2)/R7","v":{"v":-0.47422222222222166,"d":"-0.474"}},null,"d=",{"$f":"(U9*U5^2-U8*U6^2)/U7","v":{"v":-0.08725925925925895,"d":"-0.087"}},null,"d=",{"$f":"(X9*X5^2-X8*X6^2)/X7","v":{"v":0.07940740740740758,"d":"0.079"}},null,"d=",{"$f":"(AA9*AA5^2-AA8*AA6^2)/AA7","v":{"$error":"#DIV/0!"}},null,"d=",{"$f":"(AD9*AD5^2-AD8*AD6^2)/AD7","v":{"$error":"#DIV/0!"}}]
[11,{"$f":"IF($A12<=n,'y'' agrees'!B27,LOOKUP(n,A$2:A$20,B$2:B$20))","v":25},{"$f":"IF($A12<=n,'y'' agrees'!C27,LOOKUP(n,A$2:A$20,C$2:C$20))","v":11}]
[12,{"$f":"IF($A13<=n,'y'' agrees'!B28,LOOKUP(n,A$2:A$20,B$2:B$20))","v":28},{"$f":"IF($A13<=n,'y'' agrees'!C28,LOOKUP(n,A$2:A$20,C$2:C$20))","v":13},null,"coordinates:",null,null,"coordinates:",null,null,"coordinates:",null,null,"coordinates:",null,null,"coordinates:",null,null,"coordinates:",null,null,"coordinates:",null,null,"coordinates:",null,null,"coordinates:"]
[13,{"$f":"IF($A14<=n,'y'' agrees'!B29,LOOKUP(n,A$2:A$20,B$2:B$20))","v":30},{"$f":"IF($A14<=n,'y'' agrees'!C29,LOOKUP(n,A$2:A$20,C$2:C$20))","v":8},null,{"$f":"$B2","v":0},{"$f":"F$11*E14^3+F$10*E14^2+F$4*E14+F$3","v":{"v":4,"d":"4.000"}},null,{"$f":"$B4","v":4},{"$f":"C4","v":{"v":16,"d":"16.000"}},null,{"$f":"$B6","v":9},{"$f":"$C6","v":{"v":12,"d":"12.000"}},null,{"$f":"$B8","v":15},{"$f":"$C8","v":{"v":16,"d":"16.000"}},null,{"$f":"$B10","v":20},{"$f":"$C10","v":{"v":6,"d":"6.000"}},null,{"$f":"$B12","v":25},{"$f":"$C12","v":{"v":11,"d":"11.000"}},null,{"$f":"$B14","v":30},{"$f":"$C14","v":{"v":8,"d":"8.000"}},null,{"$f":"$B16","v":35},{"$f":"$C16","v":{"v":5,"d":"5.000"}},null,{"$f":"$B18","v":35},{"$f":"$C18","v":{"v":5,"d":"5.000"}}]
[14,{"$f":"IF($A15<=n,'y'' agrees'!B30,LOOKUP(n,A$2:A$20,B$2:B$20))","v":32},{"$f":"IF($A15<=n,'y'' agrees'!C30,LOOKUP(n,A$2:A$20,C$2:C$20))","v":1},null,{"$f":"E14+($B4-$B2)/3","v":1.3333333333333333},{"$f":"F$11*E15^3+F$10*E15^2+F$4*E15+F$3","v":{"v":7.2592592592592595,"d":"7.259"}},null,{"$f":"H14+($B6-$B4)/3","v":{"v":5.666666666666667,"d":"5.667"}},{"$f":"I$11*(H15-H$14)^3+I$10*(H15-H$14)^2+I$4*(H15-H$14)+I$3","v":{"v":19.54732510288066,"d":"19.547"}},null,{"$f":"K14+($B8-$B6)/3","v":{"v":11,"d":"11.000"}},{"$f":"L$11*(K15-K$14)^3+L$10*(K15-K$14)^2+L$4*(K15-K$14)+L$3","v":{"v":8.50962962962963,"d":"8.510"}},null,{"$f":"N14+($B10-$B8)/3","v":{"v":16.666666666666668,"d":"16.667"}},{"$f":"O$11*(N15-N$14)^3+O$10*(N15-N$14)^2+O$4*(N15-N$14)+O$3","v":{"v":21.82962962962963,"d":"21.830"}},null,{"$f":"Q14+($B12-$B10)/3","v":{"v":21.666666666666668,"d":"21.667"}},{"$f":"R$11*(Q15-Q$14)^3+R$10*(Q15-Q$14)^2+R$4*(Q15-Q$14)+R$3","v":{"v":-1.4016460905349764,"d":"-1.402"}},null,{"$f":"T14+($B14-$B12)/3","v":{"v":26.666666666666668,"d":"26.667"}},{"$f":"U$11*(T15-T$14)^3+U$10*(T15-T$14)^2+U$4*(T15-T$14)+U$3","v":{"v":12.872153635116602,"d":"12.872"}},null,{"$f":"W14+(X6)/3","v":{"v":31.666666666666668,"d":"31.667"}},{"$f":"X$11*(W15-W$14)^3+X$10*(W15-W$14)^2+X$4*(W15-W$14)+X$3","v":{"v":1.776680384087788,"d":"1.777"}},null,{"$f":"Z14+(AA6)/3","v":{"v":35,"d":"35.000"}},{"$f":"AA$11*(Z15-Z$14)^3+AA$10*(Z15-Z$14)^2+AA$4*(Z15-Z$14)+AA$3","v":{"$error":"#DIV/0!"}},null,{"$f":"AC14+(AD6)/3","v":{"v":35,"d":"35.000"}},{"$f":"AD$11*(AC15-AC$14)^3+AD$10*(AC15-AC$14)^2+AD$4*(AC15-AC$14)+AD$3","v":{"$error":"#DIV/0!"}}]
{"$rows_left_out":31}
{"sheet":"Sheet4","index":3,"n_rows":43,"n_cols":30,"rows_kept":43}
{"$rows_empty":24}
[null,"x","y",null,"First cubic",null,null,"Second cubic",null,null,"Third cubic",null,null,"Fourth cubic",null,null,"Fifth cubic",null,null,"Sixth cubic",null,null,"Seventh cubic",null,null,"Eighth cubic",null,null,"Ninth cubic"]
[1,{"$f":"'y'' and y\" agree'!B17","v":0},{"$f":"'y'' and y\" agree'!C17","v":4},null,"dx =",{"$f":"B27-B26","v":1},null,"dx=",{"$f":"$B28-$B27","v":2},null,"dx=",{"$f":"$B29-$B28","v":4},null,"dx=",{"$f":"$B30-$B29","v":2},null,"dx=",{"$f":"$B31-$B30","v":2},null,"dx=",{"$f":"$B32-$B31","v":0},null,"dx=",{"$f":"$B33-$B32","v":0},null,"dx=",{"$f":"$B34-$B33","v":0},null,"dx=",{"$f":"$B35-$B34","v":0}]
[2,{"$f":"'y'' and y\" agree'!B18","v":1},{"$f":"'y'' and y\" agree'!C18","v":10}]
[3,{"$f":"IF(A28<=nn,'y'' and y\" agree'!B19,\"\")","v":3},{"$f":"'y'' and y\" agree'!C19","v":18}]
[4,{"$f":"IF(A29<=nn,'y'' and y\" agree'!B20,\"\")","v":7},{"$f":"IF($A29<=nn,'y'' and y\" agree'!C20,LOOKUP(nn,A$26:A$45,C$26:C$45))","v":16}]
[5,{"$f":"IF($A30<=nn,'y'' and y\" agree'!B21,LOOKUP(nn,Sheet3!A$26:A$45,Sheet3!B$26:B$45))","v":9},{"$f":"IF($A30<=nn,'y'' and y\" agree'!C21,LOOKUP(nn,A$26:A$45,C$26:C$45))","v":23}]
[6,{"$f":"IF($A31<=nn,'y'' and y\" agree'!B22,LOOKUP(nn,Sheet3!A$26:A$45,Sheet3!B$26:B$45))","v":11},{"$f":"IF($A31<=nn,'y'' and y\" agree'!C22,LOOKUP(nn,A$26:A$45,C$26:C$45))","v":22},null,"a =",{"$f":"-F32/F26","v":{"v":-0.5,"d":"-0.500"}},null,"a =",{"$f":"(C28-C27)/I26^3-F43/2/I26-F42/I26^2","v":{"v":0.25,"d":"0.250"}},null,"a=",{"$f":"($C29-$C28)/L26^3-I43/2/L26-I42/L26^2","v":{"v":-0.3125,"d":"-0.313"}},null,"a=",{"$f":"($C30-$C29)/O26^3-L43/2/O26-L42/O26^2","v":{"v":5,"d":"5.000"}},null,"a=",{"$f":"($C31-$C30)/R26^3-O43/2/R26-O42/R26^2","v":{"v":-22.5,"d":"-22.500"}},null,"a=",{"$f":"($C32-$C31)/U26^3-R43/2/U26-R42/U26^2","v":{"$error":"#DIV/0!"}},null,"a=",{"$f":"($C33-$C32)/X26^3-U43/2/X26-U42/X26^2","v":{"$error":"#DIV/0!"}},null,"a=",{"$f":"($C34-$C33)/AA26^3-X43/2/AA26-X42/AA26^2","v":{"$error":"#DIV/0!"}},null,"a=",{"$f":"($C35-$C34)/AD26^3-AA43/2/AD26-AA42/AD26^2","v":{"$error":"#DIV/0!"}}]
[7,{"$f":"IF($A32<=nn,'y'' and y\" agree'!B23,LOOKUP(nn,Sheet3!A$26:A$45,Sheet3!B$26:B$45))","v":11},{"$f":"IF($A32<=nn,'y'' and y\" agree'!C23,LOOKUP(nn,A$26:A$45,C$26:C$45))","v":22},null,"b =",{"$f":"(C28-2*C27+C26)/2/F26/(B28-B27)","v":{"v":0.5,"d":"0.500"}},null,"b =",{"$f":"F43/2","v":{"v":-1.25,"d":"-1.250"}},null,"b=",{"$f":"I43/2","v":{"v":0.25,"d":"0.250"}},null,"b=",{"$f":"L43/2","v":{"v":-3.5,"d":"-3.500"}},null,"b=",{"$f":"O43/2","v":{"v":26.5,"d":"26.500"}},null,"b=",{"$f":"R43/2","v":{"v":-108.5,"d":"-108.500"}},null,"b=",{"$f":"U43/2","v":{"$error":"#DIV/0!"}},null,"b=",{"$f":"X43/2","v":{"$error":"#DIV/0!"}},null,"b=",{"$f":"AA43/2","v":{"$error":"#DIV/0!"}}]
[8,{"$f":"IF($A33<=nn,'y'' and y\" agree'!B24,LOOKUP(nn,Sheet3!A$26:A$45,Sheet3!B$26:B$45))","v":11},{"$f":"IF($A33<=nn,'y'' and y\" agree'!C24,LOOKUP(nn,A$26:A$45,C$26:C$45))","v":22},null,"c =",{"$f":"(C27-C26)/F26","v":6},null,"c =",{"$f":"F42","v":{"v":5.5,"d":"5.500"}},null,"c=",{"$f":"I42","v":{"v":3.5,"d":"3.500"}},null,"c=",{"$f":"L42","v":{"v":-9.5,"d":"-9.500"}},null,"c=",{"$f":"O42","v":{"v":36.5,"d":"36.500"}},null,"c=",{"$f":"R42","v":{"v":-127.5,"d":"-127.500"}},null,"c=",{"$f":"U42","v":{"$error":"#DIV/0!"}},null,"c=",{"$f":"X42","v":{"$error":"#DIV/0!"}},null,"c=",{"$f":"AA42","v":{"$error":"#DIV/0!"}}]
[9,{"$f":"IF($A34<=nn,'y'' and y\" agree'!B25,LOOKUP(nn,Sheet3!A$26:A$45,Sheet3!B$26:B$45))","v":11},{"$f":"IF($A34<=nn,'y'' and y\" agree'!C25,LOOKUP(nn,A$26:A$45,C$26:C$45))","v":22},null," d =",{"$f":"C26","v":{"v":4,"d":"4.000"}},null," d =",{"$f":"C27","v":{"v":10,"d":"10.000"}},null,"d=",{"$f":"C28","v":{"v":18,"d":"18.000"}},null,"d=",{"$f":"$C29","v":{"v":16,"d":"16.000"}},null,"d=",{"$f":"$C30","v":{"v":23,"d":"23.000"}},null,"d=",{"$f":"$C31","v":{"v":22,"d":"22.000"}},null,"d=",{"$f":"$C32","v":{"v":22,"d":"22.0"}},null,"d=",{"$f":"$C33","v":{"v":22,"d":"22.0"}},null,"d=",{"$f":"$C34","v":{"v":22,"d":"22.0"}}]
[10,{"$f":"IF($A35<=nn,'y'' and y\" agree'!B26,LOOKUP(nn,Sheet3!A$26:A$45,Sheet3!B$26:B$45))","v":11},{"$f":"IF($A35<=nn,'y'' and y\" agree'!C26,LOOKUP(nn,A$26:A$45,C$26:C$45))","v":22}]
[{"$nulls":4},"coordinates:",null,null,"coordinates:",null,null,"coordinates:",null,null,"coordinates:",null,null,"coordinates:",null,null,"coordinates:",null,null,"coordinates:",null,null,"coordinates:",null,null,"coordinates:"]
[{"$nulls":4},{"$f":"$B26","v":0},{"$f":"F$31*(E37-$B$26)^3+F$32*(E37-$B$26)^2+F$33*(E37-$B$26)+F$34","v":{"v":4,"d":"4.000"}},null,{"$f":"$B27","v":1},{"$f":"I$31*(H37-$B$27)^3+I$32*(H37-$B$27)^2+I$33*(H37-$B$27)+I$34","v":{"v":10,"d":"10.000"}},null,{"$f":"$B28","v":3},{"$f":"L$31*(K37-$B$28)^3+L$32*(K37-$B$28)^2+L$33*(K37-$B$28)+L$34","v":{"v":18,"d":"18.000"}},null,{"$f":"$B29","v":7},{"$f":"O$31*(N37-$B$29)^3+O$32*(N37-$B$29)^2+O$33*(N37-$B$29)+O$34","v":{"v":16,"d":"16.000"}},null,{"$f":"$B30","v":9},{"$f":"R$31*(Q37-$B$30)^3+R$32*(Q37-$B$30)^2+R$33*(Q37-$B$30)+R$34","v":{"v":23,"d":"23.000"}},null,{"$f":"$B31","v":11},{"$f":"U$31*(T37-$B$31)^3+U$32*(T37-$B$31)^2+U$33*(T37-$B$31)+U$34","v":{"$error":"#DIV/0!"}},null,{"$f":"$B32","v":11},{"$f":"X$31*(W37-$B$32)^3+X$32*(W37-$B$32)^2+X$33*(W37-$B$32)+X$34","v":{"$error":"#DIV/0!"}},null,{"$f":"$B33","v":11},{"$f":"AA$31*(Z37-$B$33)^3+AA$32*(Z37-$B$33)^2+AA$33*(Z37-$B$33)+AA$34","v":{"$error":"#DIV/0!"}},null,{"$f":"$B34","v":11},{"$f":"AD$31*(AC37-$B$34)^3+AD$32*(AC37-$B$34)^2+AD$33*(AC37-$B$34)+AD$34","v":{"$error":"#DIV/0!"}}]
[{"$nulls":4},{"$f":"E37+($B27-$B26)/3","v":0.3333333333333333},{"$f":"F$31*(E38-$B$26)^3+F$32*(E38-$B$26)^2+F$33*(E38-$B$26)+F$34","v":{"v":6.037037037037037,"d":"6.037"}},null,{"$f":"H37+($B28-$B27)/3","v":1.6666666666666665},{"$f":"I$31*(H38-$B$27)^3+I$32*(H38-$B$27)^2+I$33*(H38-$B$27)+I$34","v":{"v":13.185185185185185,"d":"13.185"}},null,{"$f":"K37+(L$26)/3","v":4.333333333333333},{"$f":"L$31*(K38-$B$28)^3+L$32*(K38-$B$28)^2+L$33*(K38-$B$28)+L$34","v":{"v":22.37037037037037,"d":"22.370"}},null,{"$f":"N37+(O$26)/3","v":7.666666666666667},{"$f":"O$31*(N38-$B$29)^3+O$32*(N38-$B$29)^2+O$33*(N38-$B$29)+O$34","v":{"v":9.592592592592592,"d":"9.593"}},null,{"$f":"Q37+(R$26)/3","v":9.666666666666666},{"$f":"R$31*(Q38-$B$30)^3+R$32*(Q38-$B$30)^2+R$33*(Q38-$B$30)+R$34","v":{"v":52.444444444444414,"d":"52.444"}},null,{"$f":"T37+(U$26)/3","v":11},{"$f":"U$31*(T38-$B$31)^3+U$32*(T38-$B$31)^2+U$33*(T38-$B$31)+U$34","v":{"$error":"#DIV/0!"}},null,{"$f":"W37+(X$26)/3","v":11},{"$f":"X$31*(W38-$B$32)^3+X$32*(W38-$B$32)^2+X$33*(W38-$B$32)+X$34","v":{"$error":"#DIV/0!"}},null,{"$f":"Z37+(AA$26)/3","v":11},{"$f":"AA$31*(Z38-$B$33)^3+AA$32*(Z38-$B$33)^2+AA$33*(Z38-$B$33)+AA$34","v":{"$error":"#DIV/0!"}},null,{"$f":"AC37+(AD$26)/3","v":11},{"$f":"AD$31*(AC38-$B$34)^3+AD$32*(AC38-$B$34)^2+AD$33*(AC38-$B$34)+AD$34","v":{"$error":"#DIV/0!"}}]
{"$rows_left_out":5}