{"text_format":"3","workbook":"xlsx","n_sheets":3,"sheets":["Sheet1","Sheet2","Sheet3"],"not_rendered":{"charts":2,"images":3,"macros":1,"defined_names":16,"comments":1},"read":"whole","date_system":"1900"}

{"sheet":"Sheet1","index":0,"n_rows":38,"n_cols":17,"rows_kept":38}
["         Largest Cylinder in a Cone Problem"]
[]
[null,"   This DIGMath module lets you investigate "]
[null,"             the calculus problem of finding"]
[null,"     the dimensions of the largest cylinder"]
[null,"that can be inscribed in a right circular cone."]
[]
[]
[]
["What is the radius R of the cone?"]
[null,"    (1 - 25 cubic units)",null,null," R =",{"$f":"D12","v":20}]
[{"$nulls":3},20]
[]
[]
["What is the height H of the cone?",{"$nulls":10},"The graph of the volume function = ",null,null,"pr2(R - r) H/R"]
[null,"      (1 - 25 units)",null,null,"           H =",{"$f":"D17/2","v":6}]
[{"$nulls":3},12]
[{"$nulls":11},"Select the radius r of the inscribed cylinder =",{"$nulls":3},{"$f":"O20/10","v":9.1},"units"]
[]
[{"$f":"\"With a radius of \"&TEXT(x0,\"0.0\") &\" units, \"","v":"With a radius of 9.1 units, "},{"$nulls":13},91,{"$f":"Sheet2!H7+O20*(Sheet2!H8-Sheet2!H7)/100","v":22.795}]
[{"$f":"\"   the height of the can is \"&TEXT(HH*(RR-r0)/RR,\"0.0\") &\" units\"","v":"   the height of the can is 3.3 units"},{"$nulls":11},"   The volume of this cylinder is V =",null,null,{"$f":"PI()*x0^2*(RR-r0)*HH/RR","v":{"v":850.7077905951304,"d":"851"}},"cubic units"]
[]
[{"$nulls":12},"  The value of the derivative is V' = ",null,null,{"$f":"Sheet2!I36","v":{"v":108.92215889261176,"d":"109"}}]
[]
["Click each item below for suggestions and investigations"]
[null,null,"   Item 1"]
[null,null,"   Item 2"]
[null,null,"   Item 3"]
[]
[]
["To access/download all the DIGMath Apps for Calculus"]
["       Click this link:",null,"DIGMath for Calculus"]
[]
["Created by:  Sheldon P. Gordon   "]
["                      Farmingdale State College    "]
["Development of this module was supported by the "]
["NSF's Division of Undergraduate Education  "]
["under grants DUE-0310123 and DUE-0442160."]

{"sheet":"Sheet2","index":1,"n_rows":253,"n_cols":10,"rows_kept":253}
[null,"r","V","V'",null,null,"xl=",0.5,{"$f":"LOOKUP(Sheet1!P20,Sheet2!B3:B1002,Sheet2!C3:C1002)+LOOKUP(Sheet1!P20,Sheet2!B3:B1002,Sheet2!D3:D1002)*(H1-Sheet1!P20)","v":13496.388551744447},"\"=yl"]
[{"$nulls":6},"xr=",25,{"$f":"LOOKUP(Sheet1!P20,Sheet2!B3:B1003,Sheet2!C3:C1003)+LOOKUP(Sheet1!P20,Sheet2!B3:B1003,Sheet2!D3:D1003)*(H2-Sheet1!P20)","v":-1334.8076589637353},"\"=yR"]
[0,0.5,{"$f":"PI()*B3^2*(RR-B3)*HH/RR","v":{"v":4.594579255875073,"d":"5"}},{"$f":"PI()*(2*RR*B3-3*B3^2)*HH/RR","v":18.142697574481055}]
[1,{"$f":"B3+dx","v":{"v":0.598,"d":"0.60"}},{"$f":"IF(PI()*B4^2*(RR-B4)*HH/RR<0,0,PI()*B4^2*(RR-B4)*HH/RR)","v":{"v":6.539130365552543,"d":"7"}},21.532967392795463]
[2,{"v":0.696,"d":"0.70"},{"v":8.813266759739292,"d":"9"},24.86892787058873,null,null,"delta x = ",{"$f":"(xMax-xMin)/250","v":0.098}]
[3,{"v":0.7939999999999999,"d":"0.79"},{"v":11.411666123064244,"d":"11"},28.15057900786087]
[4,{"v":0.8919999999999999,"d":"0.89"},{"v":14.329006140156329,"d":"14"},31.377920804611858,null,null,"xMin =",0.5,{"$f":"C3","v":4.594579255875073}]
[5,{"v":0.9899999999999999,"d":"0.99"},{"v":17.559964495644476,"d":"18"},34.550953260841716,null,null,"xMax =",25,{"$f":"C83","v":764.3667361921531}]
[6,{"v":1.0879999999999999,"d":"1.09"},{"v":21.09921887415761,"d":"21"},37.66967637655044]
[7,{"v":1.186,"d":"1.19"},{"v":24.94144696032468,"d":"25"},40.734090151738016]
[8,{"v":1.284,"d":"1.28"},{"v":29.081326438774585,"d":"29"},43.74419458640447,null,null,"Point"]
[9,{"v":1.3820000000000001,"d":"1.38"},{"v":33.513534994136265,"d":"34"},46.69998968054978,null,null,{"$f":"x0","v":9.1},0]
[10,{"v":1.4800000000000002,"d":"1.48"},{"v":38.23275031103866,"d":"38"},49.60147543417396]
[11,{"v":1.5780000000000003,"d":"1.58"},{"v":43.233650074110685,"d":"43"},52.44865184727699,null,null,"Horizontal Line"]
[12,{"v":1.6760000000000004,"d":"1.68"},{"v":48.51091196798126,"d":"49"},55.24151891985889,null,null,0,0]
[13,{"v":1.7740000000000005,"d":"1.77"},{"v":54.05921367727933,"d":"54"},57.98007665191966,null,null,{"$f":"G12","v":9.1},0]
[14,{"v":1.8720000000000006,"d":"1.87"},{"v":59.87323288663384,"d":"60"},60.66432504345928]
[15,{"v":1.9700000000000006,"d":"1.97"},{"v":65.94764728067369,"d":"66"},63.29426409447776,null,null,"Diagnonal Line"]
[16,{"v":2.0680000000000005,"d":"2.07"},{"v":72.27713454402779,"d":"72"},65.8698938049751,null,null,0,200]
[17,{"v":2.1660000000000004,"d":"2.17"},{"v":78.85637236132509,"d":"79"},68.39121417495132,null,null,997,0]
[18,{"v":2.2640000000000002,"d":"2.26"},{"v":85.68003841719454,"d":"86"},70.85822520440638]
[19,{"v":2.362,"d":"2.36"},{"v":92.74281039626503,"d":"93"},73.27092689334032]
[20,2.46,{"v":100.03936598316552,"d":"100"},75.62931924175311,null,null,"Point on curve",null,"y'"]
[21,{"v":2.558,"d":"2.56"},{"v":107.56438286252492,"d":"108"},77.93340224964477,null,null,"x=",{"$f":"G12*H5","v":0.8918}]
[22,{"v":2.6559999999999997,"d":"2.66"},{"v":115.3125387189722,"d":"115"},80.18317591701526,null,"x0 =",{"$f":"r0","v":9.1},{"$f":"LOOKUP(x0,B3:B84,C3:C84)","v":775.8595934899868},{"$f":"LOOKUP(x0,B3:B84,D3:D84)","v":116.79228956946278}]
[23,{"v":2.7539999999999996,"d":"2.75"},{"v":123.27851123713621,"d":"123"},82.37864024386465,null,"y0 =",{"$f":"IF(Sheet1!$P$21<0,0,Sheet1!$P$21)","v":{"v":850.7077905951304,"d":"851"}},0,0]
[24,{"v":2.8519999999999994,"d":"2.85"},{"v":131.45697810164594,"d":"131"},84.5197952301929]
[25,{"v":2.9499999999999993,"d":"2.95"},{"v":139.84261699713028,"d":"140"},86.606640876,null,null,{"$f":"(x0+2*h)*y0","v":17949.934381557254}]
[26,{"v":3.047999999999999,"d":"3.05"},{"v":148.43010560821824,"d":"148"},88.63917718128596]
[27,{"v":3.145999999999999,"d":"3.15"},{"v":157.21412161953862,"d":"157"},90.6174041460508,null,null,{"$f":"PI()*r0^2*(RR-r0)*HH/RR","v":850.7077905951304},{"$f":"r0^2*HH","v":496.8599999999999}]
[28,{"v":3.243999999999999,"d":"3.24"},{"v":166.18934271572047,"d":"166"},92.5413217702945,{"$nulls":3},{"$f":"(RR-r0)/RR","v":0.545}]
[29,{"v":3.3419999999999987,"d":"3.34"},{"v":175.35044658139265,"d":"175"},94.41093005401704,{"$nulls":3},{"$f":"RR","v":20}]
[30,{"v":3.4399999999999986,"d":"3.44"},{"v":184.6921109011841,"d":"185"},96.22622899721846,{"$nulls":3},{"$f":"r0","v":9.1}]
[31,{"v":3.5379999999999985,"d":"3.54"},{"v":194.20901335972377,"d":"194"},97.98721859989875,null,null,"x","y","y'"]
[32,{"v":3.6359999999999983,"d":"3.64"},{"v":203.89583164164054,"d":"204"},99.6938988620579,null,null,{"$f":"x0","v":9.1},0,0]
[33,{"v":3.733999999999998,"d":"3.73"},{"v":213.7472434315634,"d":"214"},101.34626978369593,null,null,{"$f":"x0","v":9.1},{"$f":"PI()*x0^2*(RR-x0)*HH/RR","v":850.7077905951304},{"$f":"PI()*(2*RR*x0-3*x0^2)*HH/RR","v":108.92215889261176}]
[34,{"v":3.831999999999998,"d":"3.83"},{"v":223.75792641412121,"d":"224"},102.94433136481277]
[35,{"v":3.929999999999998,"d":"3.93"},{"v":233.9225582739429,"d":"234"},104.48808360540852]
[36,{"v":4.027999999999998,"d":"4.03"},{"v":244.23581669565755,"d":"244"},105.97752650548314]
[37,{"v":4.125999999999998,"d":"4.13"},{"v":254.69237936389396,"d":"255"},107.41266006503656]
[38,{"v":4.2239999999999975,"d":"4.22"},{"v":265.2869239632811,"d":"265"},108.79348428406888]
[39,{"v":4.321999999999997,"d":"4.32"},{"v":276.0141281784477,"d":"276"},110.11999916258007]
[40,{"v":4.419999999999997,"d":"4.42"},{"v":286.86866969402297,"d":"287"},111.39220470057012]
[41,{"v":4.517999999999997,"d":"4.52"},{"v":297.84522619463576,"d":"298"},112.61010089803904]
[42,{"v":4.615999999999997,"d":"4.62"},{"v":308.93847536491495,"d":"309"},113.77368775498678]
[43,{"v":4.713999999999997,"d":"4.71"},{"v":320.1430948894894,"d":"320"},114.88296527141344]
[44,{"v":4.811999999999997,"d":"4.81"},{"v":331.4537624529882,"d":"331"},115.93793344731894]
[45,{"v":4.909999999999997,"d":"4.91"},{"v":342.86515574004017,"d":"343"},116.9385922827033]
[46,{"v":5.0079999999999965,"d":"5.01"},{"v":354.3719524352744,"d":"354"},117.88494177756652]
[47,{"v":5.105999999999996,"d":"5.11"},{"v":365.96883022331957,"d":"366"},118.77698193190858]
[48,{"v":5.203999999999996,"d":"5.20"},{"v":377.6504667888047,"d":"378"},119.61471274572958]
[49,{"v":5.301999999999996,"d":"5.30"},{"v":389.4115398163588,"d":"389"},120.39813421902936]
[50,{"v":5.399999999999996,"d":"5.40"},{"v":401.24672699061085,"d":"401"},121.12724635180803]
[51,{"v":5.497999999999996,"d":"5.50"},{"v":413.15070599618946,"d":"413"},121.80204914406559]
[52,{"v":5.595999999999996,"d":"5.60"},{"v":425.11815451772384,"d":"425"},122.42254259580196]
[53,{"v":5.6939999999999955,"d":"5.69"},{"v":437.1437502398429,"d":"437"},122.98872670701724]
[54,{"v":5.791999999999995,"d":"5.79"},{"v":449.22217084717556,"d":"449"},123.50060147771134]
[55,{"v":5.889999999999995,"d":"5.89"},{"v":461.34809402435076,"d":"461"},123.95816690788433]
[56,{"v":5.987999999999995,"d":"5.99"},{"v":473.5161974559972,"d":"474"},124.3614229975362]
[57,{"v":6.085999999999995,"d":"6.09"},{"v":485.721158826744,"d":"486"},124.71036974666688]
[58,{"v":6.183999999999995,"d":"6.18"},{"v":497.9576558212201,"d":"498"},125.00500715527646]
[59,{"v":6.281999999999995,"d":"6.28"},{"v":510.2203661240545,"d":"510"},125.24533522336495]
[60,{"v":6.379999999999995,"d":"6.38"},{"v":522.5039674198758,"d":"523"},125.43135395093222]
[61,{"v":6.477999999999994,"d":"6.48"},{"v":534.8031373933134,"d":"535"},125.56306333797836]
[62,{"v":6.575999999999994,"d":"6.58"},{"v":547.112553728996,"d":"547"},125.64046338450342]
[63,{"v":6.673999999999994,"d":"6.67"},{"v":559.4268941115523,"d":"559"},125.66355409050728]
[64,{"v":6.771999999999994,"d":"6.77"},{"v":571.7408362256117,"d":"572"},{"$f":"PI()*(2*RR*B67-3*B67^2)*HH/RR","v":125.63233545599005}]
[65,{"$f":"B67+dx","v":{"v":6.869999999999994,"d":"6.87"}},{"$f":"IF(PI()*B68^2*(RR-B68)*HH/RR<0,0,PI()*B68^2*(RR-B68)*HH/RR)","v":{"v":584.0490577558027,"d":"584"}},125.54680748095163]
[66,{"v":6.967999999999994,"d":"6.97"},{"v":596.3462363867545,"d":"596"},125.40697016539211]
[67,{"v":7.065999999999994,"d":"7.07"},{"v":608.6270498030958,"d":"609"},125.21282350931149]
[68,{"v":7.1639999999999935,"d":"7.16"},{"v":620.8861756894557,"d":"621"},124.96436751270963]
[69,{"v":7.261999999999993,"d":"7.26"},{"v":633.1182917304633,"d":"633"},124.66160217558672]
[70,{"v":7.359999999999993,"d":"7.36"},{"v":645.3180756107471,"d":"645"},124.30452749794267]
[71,{"v":7.457999999999993,"d":"7.46"},{"v":657.4802050149362,"d":"657"},123.89314347977742]
[72,{"v":7.555999999999993,"d":"7.56"},{"v":669.5993576276597,"d":"670"},123.4274501210911]
[73,{"v":7.653999999999993,"d":"7.65"},{"v":681.6702111335464,"d":"682"},122.90744742188365]
[74,{"v":7.751999999999993,"d":"7.75"},{"v":693.6874432172253,"d":"694"},122.33313538215498]
[75,{"v":7.8499999999999925,"d":"7.85"},{"v":705.645731563325,"d":"706"},121.70451400190527]
[76,{"v":7.947999999999992,"d":"7.95"},{"v":717.5397538564748,"d":"718"},121.02158328113433]
[77,{"v":8.045999999999992,"d":"8.05"},{"v":729.3641877813037,"d":"729"},120.2843432198423]
[78,{"v":8.143999999999993,"d":"8.14"},{"v":741.1137110224405,"d":"741"},119.49279381802913]
[79,{"v":8.241999999999994,"d":"8.24"},{"v":752.783001264514,"d":"753"},118.64693507569476]
[80,{"v":8.339999999999995,"d":"8.34"},{"v":764.3667361921531,"d":"764"},117.74676699283937]
[null,{"v":8.437999999999995,"d":"8.44"},{"v":775.8595934899868,"d":"776"},116.79228956946278]
[null,{"v":8.535999999999996,"d":"8.54"},{"v":787.2562508426441,"d":"787"},115.783502805565]
[null,{"v":8.633999999999997,"d":"8.63"},{"v":798.5513859347541,"d":"799"},114.72040670114616]
[null,{"v":8.731999999999998,"d":"8.73"},{"v":809.7396764509452,"d":"810"},113.60300125620617]
[null,{"v":8.829999999999998,"d":"8.83"},{"v":820.815800075847,"d":"821"},112.43128647074498]
[null,{"v":8.927999999999999,"d":"8.93"},{"v":831.7744344940878,"d":"832"},111.20526234476274]
[null,{"v":9.026,"d":"9.03"},{"v":842.610257390297,"d":"843"},109.92492887825927]
[null,{"v":9.124,"d":"9.12"},{"v":853.3179464491031,"d":"853"},108.59028607123473]
[null,{"v":9.222000000000001,"d":"9.22"},{"v":863.8921793551353,"d":"864"},107.20133392368905]
[null,{"v":9.320000000000002,"d":"9.32"},{"v":874.3276337930226,"d":"874"},105.75807243562217]
[null,{"v":9.418000000000003,"d":"9.42"},{"v":884.6189874473941,"d":"885"},104.26050160703426]
[null,{"v":9.516000000000004,"d":"9.52"},{"v":894.7609180028779,"d":"895"},102.7086214379251]
[null,{"v":9.614000000000004,"d":"9.61"},{"v":904.7481031441037,"d":"905"},101.10243192829486]
[null,{"v":9.712000000000005,"d":"9.71"},{"v":914.5752205556998,"d":"915"},99.44193307814348]
[null,{"v":9.810000000000006,"d":"9.81"},{"v":924.2369479222964,"d":"924"},97.7271248874709]
[null,{"v":9.908000000000007,"d":"9.91"},{"v":933.7279629285209,"d":"934"},95.95800735627729]
[null,{"v":10.006000000000007,"d":"10.01"},{"v":943.042943259003,"d":"943"},94.13458048456246]
[null,{"v":10.104000000000008,"d":"10.10"},{"v":952.1765665983716,"d":"952"},92.25684427232646]
[null,{"v":10.202000000000009,"d":"10.20"},{"v":961.1235106312555,"d":"961"},90.32479871956942]
[null,{"v":10.30000000000001,"d":"10.30"},{"v":969.8784530422836,"d":"970"},88.3384438262912]
[null,{"v":10.39800000000001,"d":"10.40"},{"v":978.4360715160849,"d":"978"},86.29777959249186]
[null,{"v":10.496000000000011,"d":"10.50"},{"v":986.7910437372884,"d":"987"},84.20280601817136]
[null,{"v":10.594000000000012,"d":"10.59"},{"v":994.938047390523,"d":"995"},82.05352310332968]
[null,{"v":10.692000000000013,"d":"10.69"},{"v":1002.8717601604174,"d":"1003"},79.84993084796695]
[null,{"v":10.790000000000013,"d":"10.79"},{"v":1010.586859731601,"d":"1011"},77.592029252083]
[null,{"v":10.888000000000014,"d":"10.89"},{"v":1018.0780237887022,"d":"1018"},75.27981831567799]
[null,{"v":10.986000000000015,"d":"10.99"},{"v":1025.3399300163503,"d":"1025"},72.91329803875179]
[null,{"v":11.084000000000016,"d":"11.08"},{"v":1032.367256099174,"d":"1032"},70.49246842130444]
[null,{"v":11.182000000000016,"d":"11.18"},{"v":1039.1546797218023,"d":"1039"},68.01732946333598]
[null,{"v":11.280000000000017,"d":"11.28"},{"v":1045.6968785688641,"d":"1046"},65.4878811648464]
[null,{"v":11.378000000000018,"d":"11.38"},{"v":1051.9885303249887,"d":"1052"},62.9041235258356]
[null,{"v":11.476000000000019,"d":"11.48"},{"v":1058.0243126748042,"d":"1058"},60.26605654630377]
[null,{"v":11.57400000000002,"d":"11.57"},{"v":1063.7989033029405,"d":"1064"},57.573680226250744]
[null,{"v":11.67200000000002,"d":"11.67"},{"v":1069.306979894026,"d":"1069"},54.82699456567654]
[null,{"v":11.770000000000021,"d":"11.77"},{"v":1074.5432201326896,"d":"1075"},52.025999564581284]
[null,{"v":11.868000000000022,"d":"11.87"},{"v":1079.5023017035603,"d":"1080"},49.17069522296486]
[null,{"v":11.966000000000022,"d":"11.97"},{"v":1084.1789022912671,"d":"1084"},46.261081540827256]
{"$rows_left_out":134}
{"sheet":"Sheet3","index":2,"n_rows":1003,"n_cols":2,"rows_kept":1003}
[{"$f":"xMin","v":0.5},{"$f":"9","v":9}]
[{"$f":"A1+dx","v":0.598},{"$f":"9","v":9}]
[0.696,{"$f":"9","v":9}]
[0.7939999999999999,{"$f":"9","v":9}]
[0.8919999999999999,{"$f":"9","v":9}]
[0.9899999999999999,{"$f":"9","v":9}]
[1.0879999999999999,{"$f":"9","v":9}]
[1.186,{"$f":"9","v":9}]
[1.284,{"$f":"9","v":9}]
[1.3820000000000001,{"$f":"9","v":9}]
[1.4800000000000002,{"$f":"9","v":9}]
[1.5780000000000003,{"$f":"9","v":9}]
[1.6760000000000004,{"$f":"9","v":9}]
[1.7740000000000005,{"$f":"9","v":9}]
[1.8720000000000006,{"$f":"9","v":9}]
[1.9700000000000006,{"$f":"9","v":9}]
[2.0680000000000005,{"$f":"9","v":9}]
[2.1660000000000004,{"$f":"9","v":9}]
[2.2640000000000002,{"$f":"9","v":9}]
[2.362,{"$f":"9","v":9}]
[2.46,{"$f":"9","v":9}]
[2.558,{"$f":"9","v":9}]
[2.6559999999999997,{"$f":"9","v":9}]
[2.7539999999999996,{"$f":"9","v":9}]
[2.8519999999999994,{"$f":"9","v":9}]
[2.9499999999999993,{"$f":"9","v":9}]
[3.047999999999999,{"$f":"9","v":9}]
[3.145999999999999,{"$f":"9","v":9}]
[3.243999999999999,{"$f":"9","v":9}]
[3.3419999999999987,{"$f":"9","v":9}]
[3.4399999999999986,{"$f":"9","v":9}]
[3.5379999999999985,{"$f":"9","v":9}]
[3.6359999999999983,{"$f":"9","v":9}]
[3.733999999999998,{"$f":"9","v":9}]
[3.831999999999998,{"$f":"9","v":9}]
[3.929999999999998,{"$f":"9","v":9}]
[4.027999999999998,{"$f":"9","v":9}]
[4.125999999999998,{"$f":"9","v":9}]
[4.2239999999999975,{"$f":"9","v":9}]
[4.321999999999997,{"$f":"9","v":9}]
[4.419999999999997,{"$f":"9","v":9}]
[4.517999999999997,{"$f":"9","v":9}]
[4.615999999999997,{"$f":"9","v":9}]
[4.713999999999997,{"$f":"9","v":9}]
[4.811999999999997,{"$f":"9","v":9}]
[4.909999999999997,{"$f":"9","v":9}]
[5.0079999999999965,{"$f":"9","v":9}]
[5.105999999999996,{"$f":"9","v":9}]
[5.203999999999996,{"$f":"9","v":9}]
[5.301999999999996,{"$f":"9","v":9}]
[5.399999999999996,{"$f":"9","v":9}]
[5.497999999999996,{"$f":"9","v":9}]
[5.595999999999996,{"$f":"9","v":9}]
[5.6939999999999955,{"$f":"9","v":9}]
[5.791999999999995,{"$f":"9","v":9}]
[5.889999999999995,{"$f":"9","v":9}]
[5.987999999999995,{"$f":"9","v":9}]
[6.085999999999995,{"$f":"9","v":9}]
[6.183999999999995,{"$f":"9","v":9}]
[6.281999999999995,{"$f":"9","v":9}]
[6.379999999999995,{"$f":"9","v":9}]
[6.477999999999994,{"$f":"9","v":9}]
[6.575999999999994,{"$f":"9","v":9}]
[6.673999999999994,{"$f":"9","v":9}]
[6.771999999999994,{"$f":"9","v":9}]
[{"$f":"A65+dx","v":6.869999999999994},{"$f":"9","v":9}]
[6.967999999999994,{"$f":"9","v":9}]
[7.065999999999994,{"$f":"9","v":9}]
[7.1639999999999935,{"$f":"9","v":9}]
[7.261999999999993,{"$f":"9","v":9}]
[7.359999999999993,{"$f":"9","v":9}]
[7.457999999999993,{"$f":"9","v":9}]
[7.555999999999993,{"$f":"9","v":9}]
[7.653999999999993,{"$f":"9","v":9}]
[7.751999999999993,{"$f":"9","v":9}]
[7.8499999999999925,{"$f":"9","v":9}]
[7.947999999999992,{"$f":"9","v":9}]
[8.045999999999992,{"$f":"9","v":9}]
[8.143999999999993,{"$f":"9","v":9}]
[8.241999999999994,{"$f":"9","v":9}]
[8.339999999999995,{"$f":"9","v":9}]
[8.437999999999995,{"$f":"9","v":9}]
[8.535999999999996,{"$f":"9","v":9}]
[8.633999999999997,{"$f":"9","v":9}]
[8.731999999999998,{"$f":"9","v":9}]
[8.829999999999998,{"$f":"9","v":9}]
[8.927999999999999,{"$f":"9","v":9}]
[9.026,{"$f":"9","v":9}]
[9.124,{"$f":"9","v":9}]
[9.222000000000001,{"$f":"9","v":9}]
[9.320000000000002,{"$f":"9","v":9}]
[9.418000000000003,{"$f":"9","v":9}]
[9.516000000000004,{"$f":"9","v":9}]
[9.614000000000004,{"$f":"9","v":9}]
[9.712000000000005,{"$f":"9","v":9}]
[9.810000000000006,{"$f":"9","v":9}]
[9.908000000000007,{"$f":"9","v":9}]
[10.006000000000007,{"$f":"9","v":9}]
[10.104000000000008,{"$f":"9","v":9}]
[10.202000000000009,{"$f":"9","v":9}]
[10.30000000000001,{"$f":"9","v":9}]
[10.39800000000001,{"$f":"9","v":9}]
[10.496000000000011,{"$f":"9","v":9}]
[10.594000000000012,{"$f":"9","v":9}]
[10.692000000000013,{"$f":"9","v":9}]
[10.790000000000013,{"$f":"9","v":9}]
[10.888000000000014,{"$f":"9","v":9}]
[10.986000000000015,{"$f":"9","v":9}]
[11.084000000000016,{"$f":"9","v":9}]
[11.182000000000016,{"$f":"9","v":9}]
[11.280000000000017,{"$f":"9","v":9}]
[11.378000000000018,{"$f":"9","v":9}]
[11.476000000000019,{"$f":"9","v":9}]
[11.57400000000002,{"$f":"9","v":9}]
[11.67200000000002,{"$f":"9","v":9}]
[11.770000000000021,{"$f":"9","v":9}]
[11.868000000000022,{"$f":"9","v":9}]
[11.966000000000022,{"$f":"9","v":9}]
[12.064000000000023,{"$f":"9","v":9}]
[12.162000000000024,{"$f":"9","v":9}]
{"$rows_left_out":883}