{"text_format":"3","workbook":"xlsx","n_sheets":4,"sheets":["Sheet1","Sheet2","Sheet3","Defining Function"],"not_rendered":{"charts":1,"images":1,"macros":1,"defined_names":11,"comments":1},"read":"whole","date_system":"1900"}

{"sheet":"Sheet1","index":0,"n_rows":41,"n_cols":18,"rows_kept":41,"merged":[[34,2,34,3]]}
[null,"Delta-Epsilon Definition of Limits"]
[]
[null,"    This graphing utility lets you investigate "]
[null,null,"the delta-epsilon definition"]
[null,null,"  of the limit of a function"]
[{"$nulls":3},"y = f(x)"]
[null,"         as x approaches a point x = x0.  "]
[]
[]
["  Enter the function in terms of x:     f(x) = ",{"$nulls":4},"x^2+2"]
[]
[]
["Now enter the \"display\" interval for x:  "]
[null,null,"xMin =",0]
[null,null,"xMax =",2.2]
[]
["         Next enter the limit point x0  =",{"$nulls":3},1]
[null,{"$f":"IF(OR(x0>=xMax,x0<=xMin),\"Either use a point inside the interval or expand the interval\",\"\")","v":""}]
[]
[null,"and the presumed limiting value L =",{"$nulls":3},3,{"$nulls":6},"The graph of the function y =",null,null,{"$f":"F10","v":"x^2+2"}]
[]
[]
[null,"     What is the value for epsilon e =",{"$nulls":3},0.8,{"$nulls":6},"The limit as x → x0 exists and is equal to L"]
[{"$nulls":13},"if, for any e > 0 (the vertical height above and below the limiting point)"]
[{"$nulls":13},"there exists a d > 0 (a horizontal distance either side of x0)"]
["Click each item below for suggestions and investigations",{"$nulls":12},"such that the curve remains within the horizontal band"]
[null,"   Item 1",{"$nulls":12},"from  x0 - d  to  x0 + d"]
[null,"   Item 2"]
[null,"   Item 3",{"$nulls":10},"   Select the horozontal distance d  = ±",{"$nulls":3},{"$f":"dd","v":0.19},"from x0"]
[null,"   Item 4"]
[{"$nulls":14},19,{"$f":"D14+O31*(D15-D14)/100","v":0.41800000000000004}]
[]
[]
["To access/download all the DIGMath Apps for Calculus"]
["      Click this link:",null,"DIGMath for Calculus"]
[]
["Created by:  Sheldon P. Gordon   "]
["                      Farmingdale State College    "]
["Development of this module was supported by the "]
["NSF's Division of Undergraduate Education  "]
["under grants DUE-0310123 and DUE-0442160."]

{"sheet":"Sheet2","index":1,"n_rows":1004,"n_cols":13,"rows_kept":1004}
["x","f(x)","slope",null,null,"xl=",{"$f":"IF(Sheet1!$P$31<Sheet1!D14+80*Sheet2!G5,Sheet1!D14,Sheet1!P31-80*Sheet2!G5)","v":0},{"$f":"LOOKUP(Sheet1!P31,Sheet2!A3:A1002,Sheet2!B3:B1002)+LOOKUP(Sheet1!P31,Sheet2!A3:A1002,Sheet2!C3:C1002)*(G1-Sheet1!P31)","v":1.8207052003663144},"\"=yl"]
[{"$nulls":5},"xr=",{"$f":"IF(Sheet1!$P$31>Sheet1!D15-80*Sheet2!G5,Sheet1!D15,Sheet1!P31+80*Sheet2!G5)","v":1.2936218905472638},{"$f":"LOOKUP(Sheet1!P31,Sheet2!A3:A1003,Sheet2!B3:B1003)+LOOKUP(Sheet1!P31,Sheet2!A3:A1003,Sheet2!C3:C1003)*(G2-Sheet1!P31)","v":2.9109517091161377},"\"=yR"]
[{"$f":"Sheet1!D14","v":{"v":0,"d":"0.00"}},{"$f":"x^2+2","v":2},{"$f":"(B4-B3)/Sheet2!$G$5","v":0.010945273631834344}]
[{"$f":"A3+Sheet2!G$5","v":{"v":0.010945273631840797,"d":"0.01"}},2.000119799014876,{"$f":"(B5-B4)/Sheet2!$G$5","v":0.032835820895543606}]
[{"$f":"A4+Sheet2!G$5","v":{"v":0.021890547263681594,"d":"0.02"}},2.0004791960595036,{"$f":"(B6-B5)/Sheet2!$G$5","v":0.05472636815917172},null,null,"delta x = ",{"$f":"(Sheet1!D15-Sheet1!D14)/201","v":0.010945273631840797}]
[{"$f":"A5+Sheet2!G$5","v":{"v":0.032835820895522394,"d":"0.03"}},2.0010781911338826,{"$f":"(B7-B6)/Sheet2!$G$5","v":0.07661691542292155}]
[{"$f":"A6+Sheet2!G$5","v":{"v":0.04378109452736319,"d":"0.04"}},2.001916784238014,{"$f":"(B8-B7)/Sheet2!$G$5","v":0.09850746268654967},null,null,"x0 =",{"$f":"x0","v":1}]
[{"$f":"A7+Sheet2!G$5","v":{"v":0.05472636815920398,"d":"0.05"}},2.0029949753718967,{"$f":"(B9-B8)/Sheet2!$G$5","v":0.12039800995025894},null,null,"L =",{"$f":"L","v":3}]
[{"$f":"A8+Sheet2!G$5","v":{"v":0.06567164179104477,"d":"0.07"}},2.0043127645355314,{"$f":"(B10-B9)/Sheet2!$G$5","v":0.14228855721392764}]
[{"$f":"A9+Sheet2!G$5","v":{"v":0.07661691542288557,"d":"0.08"}},2.0058701517289177,{"$f":"(B11-B10)/Sheet2!$G$5","v":0.16417910447759632},null,"upper line"]
[{"$f":"A10+Sheet2!G$5","v":{"v":0.08756218905472636,"d":"0.09"}},2.0076671369520556,{"$f":"(B12-B11)/Sheet2!$G$5","v":0.18606965174130558},null,null,"xMin =",{"$f":"xMin","v":0},{"$f":"L+E","v":3.8},"\"=L+E"]
[{"$f":"A11+Sheet2!G$5","v":{"v":0.09850746268656715,"d":"0.10"}},2.0097037202049455,{"$f":"(B13-B12)/Sheet2!$G$5","v":0.20796019900497426},null,null,"xMax -",{"$f":"xMax","v":2.2},{"$f":"L+E","v":3.8}]
[{"$f":"A12+Sheet2!G$5","v":{"v":0.10945273631840795,"d":"0.11"}},2.011979901487587,{"$f":"(B14-B13)/Sheet2!$G$5","v":0.22985074626864296},null,"lower line"]
[{"$f":"A13+Sheet2!G$5","v":{"v":0.12039800995024874,"d":"0.12"}},2.01449568079998,{"$f":"(B15-B14)/Sheet2!$G$5","v":0.2517412935323522},null,null,"xMin =",{"$f":"xMin","v":0},{"$f":"L-E","v":2.2},"\"=L-E"]
[{"$f":"A14+Sheet2!G$5","v":{"v":0.13134328358208955,"d":"0.13"}},2.0172510581421252,{"$f":"(B16-B15)/Sheet2!$G$5","v":0.27363184079602093},null,null,"xMax -",{"$f":"xMax","v":2.2},{"$f":"L-E","v":2.2}]
[{"$f":"A15+Sheet2!G$5","v":{"v":0.14228855721393036,"d":"0.14"}},2.020246033514022,{"$f":"(B17-B16)/Sheet2!$G$5","v":0.2955223880596896},null,"left line"]
[{"$f":"A16+Sheet2!G$5","v":{"v":0.15323383084577116,"d":"0.15"}},2.0234806069156703,{"$f":"(B18-B17)/Sheet2!$G$5","v":0.31741293532339887},null,null,"x0 - d =",{"$f":"x0-d","v":0.81},{"$f":"L-E","v":2.2},"\"= L-E",null,{"$f":"x0","v":1},{"$f":"d","v":0.19},{"$f":"x0-d","v":0.81}]
[{"$f":"A17+Sheet2!G$5","v":{"v":0.16417910447761197,"d":"0.16"}},2.0269547783470707,{"$f":"(B19-B18)/Sheet2!$G$5","v":0.33930348258706755},null,null,"x0 - d =",{"$f":"G17","v":0.81},{"$f":"L+E","v":3.8},"\"= L+E",{"$nulls":3},{"$f":"x0+d","v":1.19}]
[{"$f":"A18+Sheet2!G$5","v":{"v":0.17512437810945278,"d":"0.18"}},2.0306685478082227,{"$f":"(B20-B19)/Sheet2!$G$5","v":0.36119402985073623},null,"right line"]
[{"$f":"A19+Sheet2!G$5","v":{"v":0.18606965174129358,"d":"0.19"}},2.0346219152991263,{"$f":"(B21-B20)/Sheet2!$G$5","v":0.3830845771144455},null,null,"x0 + d =",{"$f":"x0+d","v":1.19},{"$f":"L-E","v":2.2},"\"= L-E"]
[{"$f":"A20+Sheet2!G$5","v":{"v":0.1970149253731344,"d":"0.20"}},2.038814880819782,{"$f":"(B22-B21)/Sheet2!$G$5","v":0.4049751243780736},null,null,"x0 + d =",{"$f":"G20","v":1.19},{"$f":"L+E","v":3.8},"\"= L+E"]
[{"$f":"A21+Sheet2!G$5","v":{"v":0.2079601990049752,"d":"0.21"}},2.0432474443701887,{"$f":"(B23-B22)/Sheet2!$G$5","v":0.42686567164182343}]
[{"$f":"A22+Sheet2!G$5","v":{"v":0.218905472636816,"d":"0.22"}},2.047919605950348,{"$f":"(B24-B23)/Sheet2!$G$5","v":0.4487562189054516}]
[{"$f":"A23+Sheet2!G$5","v":{"v":0.2298507462686568,"d":"0.23"}},2.0528313655602584,{"$f":"(B25-B24)/Sheet2!$G$5","v":0.47064676616916085}]
[{"$f":"A24+Sheet2!G$5","v":{"v":0.24079601990049762,"d":"0.24"}},2.057982723199921,{"$f":"(B26-B25)/Sheet2!$G$5","v":0.4925373134328295},null,"dMax =",{"$f":"MIN(xMax-x0,x0-xMin)","v":1}]
[{"$f":"A25+Sheet2!G$5","v":{"v":0.25174129353233843,"d":"0.25"}},2.063373678869335,{"$f":"(B27-B26)/Sheet2!$G$5","v":0.5144278606965388}]
[{"$f":"A26+Sheet2!G$5","v":{"v":0.2626865671641792,"d":"0.26"}},2.069004232568501,{"$f":"(B28-B27)/Sheet2!$G$5","v":0.5363184079601669},null,"dd =",{"$f":"Sheet1!O31/100*dMax","v":0.19}]
[{"$f":"A27+Sheet2!G$5","v":{"v":0.27363184079602,"d":"0.27"}},2.074874384297418,{"$f":"(B29-B28)/Sheet2!$G$5","v":0.5582089552239168}]
[{"$f":"A28+Sheet2!G$5","v":{"v":0.28457711442786077,"d":"0.28"}},2.080984134056088,{"$f":"(B30-B29)/Sheet2!$G$5","v":0.5800995024875448}]
[{"$f":"A29+Sheet2!G$5","v":{"v":0.29552238805970155,"d":"0.30"}},2.087333481844509,{"$f":"(B31-B30)/Sheet2!$G$5","v":0.6019900497512541}]
[{"$f":"A30+Sheet2!G$5","v":{"v":0.3064676616915423,"d":"0.31"}},2.0939224276626818,{"$f":"(B32-B31)/Sheet2!$G$5","v":0.6238805970149228}]
[{"$f":"A31+Sheet2!G$5","v":{"v":0.3174129353233831,"d":"0.32"}},2.1007509715106063,{"$f":"(B33-B32)/Sheet2!$G$5","v":0.6457711442785915}]
[{"$f":"A32+Sheet2!G$5","v":{"v":0.3283582089552239,"d":"0.33"}},2.1078191133882824,{"$f":"(B34-B33)/Sheet2!$G$5","v":0.6676616915423007}]
[{"$f":"A33+Sheet2!G$5","v":{"v":0.33930348258706466,"d":"0.34"}},2.1151268532957106,{"$f":"(B35-B34)/Sheet2!$G$5","v":0.6895522388059694}]
[{"$f":"A34+Sheet2!G$5","v":{"v":0.35024875621890544,"d":"0.35"}},2.1226741912328904,{"$f":"(B36-B35)/Sheet2!$G$5","v":0.7114427860696382}]
[{"$f":"A35+Sheet2!G$5","v":{"v":0.3611940298507462,"d":"0.36"}},2.1304611271998217,{"$f":"(B37-B36)/Sheet2!$G$5","v":0.7333333333333474}]
[{"$f":"A36+Sheet2!G$5","v":{"v":0.372139303482587,"d":"0.37"}},2.138487661196505,{"$f":"(B38-B37)/Sheet2!$G$5","v":0.7552238805970161}]
[{"$f":"A37+Sheet2!G$5","v":{"v":0.3830845771144278,"d":"0.38"}},2.14675379322294,{"$f":"(B39-B38)/Sheet2!$G$5","v":0.7771144278606847}]
[{"$f":"A38+Sheet2!G$5","v":{"v":0.39402985074626856,"d":"0.39"}},2.1552595232791267,{"$f":"(B40-B39)/Sheet2!$G$5","v":0.7990049751243534}]
[{"$f":"A39+Sheet2!G$5","v":{"v":0.40497512437810934,"d":"0.40"}},2.164004851365065,{"$f":"(B41-B40)/Sheet2!$G$5","v":0.8208955223880627}]
[{"$f":"A40+Sheet2!G$5","v":{"v":0.4159203980099501,"d":"0.42"}},2.172989777480755,{"$f":"(B42-B41)/Sheet2!$G$5","v":0.8427860696517719}]
[{"$f":"A41+Sheet2!G$5","v":{"v":0.4268656716417909,"d":"0.43"}},2.1822143016261975,{"$f":"(B43-B42)/Sheet2!$G$5","v":0.8646766169154001}]
[{"$f":"A42+Sheet2!G$5","v":{"v":0.4378109452736317,"d":"0.44"}},2.191678423801391,{"$f":"(B44-B43)/Sheet2!$G$5","v":0.8865671641791093}]
[{"$f":"A43+Sheet2!G$5","v":{"v":0.44875621890547246,"d":"0.45"}},2.2013821440063364,{"$f":"(B45-B44)/Sheet2!$G$5","v":0.9084577114427781}]
[{"$f":"A44+Sheet2!G$5","v":{"v":0.45970149253731324,"d":"0.46"}},2.2113254622410334,{"$f":"(B46-B45)/Sheet2!$G$5","v":0.9303482587064468}]
[{"$f":"A45+Sheet2!G$5","v":{"v":0.470646766169154,"d":"0.47"}},2.221508378505482,{"$f":"(B47-B46)/Sheet2!$G$5","v":0.952238805970156}]
[{"$f":"A46+Sheet2!G$5","v":{"v":0.4815920398009948,"d":"0.48"}},2.231930892799683,{"$f":"(B48-B47)/Sheet2!$G$5","v":0.9741293532338247}]
[{"$f":"A47+Sheet2!G$5","v":{"v":0.4925373134328356,"d":"0.49"}},2.242593005123635,{"$f":"(B49-B48)/Sheet2!$G$5","v":0.996019900497534}]
[{"$f":"A48+Sheet2!G$5","v":{"v":0.5034825870646764,"d":"0.50"}},2.2534947154773395,{"$f":"(B50-B49)/Sheet2!$G$5","v":1.0179104477612027}]
[{"$f":"A49+Sheet2!G$5","v":{"v":0.5144278606965172,"d":"0.51"}},2.2646360238607954,{"$f":"(B51-B50)/Sheet2!$G$5","v":1.0398009950248712}]
[{"$f":"A50+Sheet2!G$5","v":{"v":0.5253731343283581,"d":"0.53"}},2.276016930274003,{"$f":"(B52-B51)/Sheet2!$G$5","v":1.06169154228854}]
[{"$f":"A51+Sheet2!G$5","v":{"v":0.5363184079601989,"d":"0.54"}},2.287637434716962,{"$f":"(B53-B52)/Sheet2!$G$5","v":1.0835820895522492}]
[{"$f":"A52+Sheet2!G$5","v":{"v":0.5472636815920398,"d":"0.55"}},2.2994975371896733,{"$f":"(B54-B53)/Sheet2!$G$5","v":1.105472636815918}]
[{"$f":"A53+Sheet2!G$5","v":{"v":0.5582089552238806,"d":"0.56"}},2.311597237692136,{"$f":"(B55-B54)/Sheet2!$G$5","v":1.1273631840796272}]
[{"$f":"A54+Sheet2!G$5","v":{"v":0.5691542288557214,"d":"0.57"}},2.323936536224351,{"$f":"(B56-B55)/Sheet2!$G$5","v":1.149253731343296}]
[{"$f":"A55+Sheet2!G$5","v":{"v":0.5800995024875623,"d":"0.58"}},2.3365154327863173,{"$f":"(B57-B56)/Sheet2!$G$5","v":1.1711442786069646}]
[{"$f":"A56+Sheet2!G$5","v":{"v":0.5910447761194031,"d":"0.59"}},2.3493339273780354,{"$f":"(B58-B57)/Sheet2!$G$5","v":1.1930348258706334}]
[{"$f":"A57+Sheet2!G$5","v":{"v":0.6019900497512439,"d":"0.60"}},2.362392019999505,{"$f":"(B59-B58)/Sheet2!$G$5","v":1.2149253731343426}]
[{"$f":"A58+Sheet2!G$5","v":{"v":0.6129353233830848,"d":"0.61"}},2.3756897106507266,{"$f":"(B60-B59)/Sheet2!$G$5","v":1.2368159203980111}]
[{"$f":"A59+Sheet2!G$5","v":{"v":0.6238805970149256,"d":"0.62"}},2.3892269993317,{"$f":"(B61-B60)/Sheet2!$G$5","v":1.2587064676617206}]
[{"$f":"A60+Sheet2!G$5","v":{"v":0.6348258706467664,"d":"0.63"}},2.403003886042425,{"$f":"(B62-B61)/Sheet2!$G$5","v":1.2805970149253487}]
[{"$f":"A61+Sheet2!G$5","v":{"v":0.6457711442786073,"d":"0.65"}},2.4170203707829017,{"$f":"(B63-B62)/Sheet2!$G$5","v":1.302487562189058}]
[{"$f":"A62+Sheet2!G$5","v":{"v":0.6567164179104481,"d":"0.66"}},2.43127645355313,{"$f":"(B64-B63)/Sheet2!$G$5","v":1.3243781094527671}]
[{"$f":"A63+Sheet2!G$5","v":{"v":0.6676616915422889,"d":"0.67"}},2.4457721343531107,{"$f":"(B65-B64)/Sheet2!$G$5","v":1.3462686567163953}]
[{"$f":"A64+Sheet2!G$5","v":{"v":0.6786069651741298,"d":"0.68"}},2.4605074131828424,{"$f":"(B66-B65)/Sheet2!$G$5","v":1.3681592039801451}]
[{"$f":"A65+Sheet2!G$5","v":{"v":0.6895522388059706,"d":"0.69"}},2.4754822900423266,{"$f":"(B67-B66)/Sheet2!$G$5","v":1.3900497512437733}]
[{"$f":"A66+Sheet2!G$5","v":{"v":0.7004975124378114,"d":"0.70"}},{"$f":"x^2+2","v":2.490696764931562},{"$f":"(B68-B67)/Sheet2!$G$5","v":1.4119402985074418}]
[{"$f":"A67+Sheet2!G$5","v":{"v":0.7114427860696523,"d":"0.71"}},2.506150837850549,{"$f":"(B69-B68)/Sheet2!$G$5","v":1.4338308457711513}]
[{"$f":"A68+Sheet2!G$5","v":{"v":0.7223880597014931,"d":"0.72"}},2.521844508799288,{"$f":"(B70-B69)/Sheet2!$G$5","v":1.4557213930348605}]
[{"$f":"A69+Sheet2!G$5","v":{"v":0.733333333333334,"d":"0.73"}},2.537777777777779,{"$f":"(B71-B70)/Sheet2!$G$5","v":1.4776119402984886}]
[{"$f":"A70+Sheet2!G$5","v":{"v":0.7442786069651748,"d":"0.74"}},2.553950644786021,{"$f":"(B72-B71)/Sheet2!$G$5","v":1.4995024875621978}]
[{"$f":"A71+Sheet2!G$5","v":{"v":0.7552238805970156,"d":"0.76"}},2.570363109824015,{"$f":"(B73-B72)/Sheet2!$G$5","v":1.521393034825907}]
[{"$f":"A72+Sheet2!G$5","v":{"v":0.7661691542288565,"d":"0.77"}},2.5870151728917614,{"$f":"(B74-B73)/Sheet2!$G$5","v":1.5432835820895352}]
[{"$f":"A73+Sheet2!G$5","v":{"v":0.7771144278606973,"d":"0.78"}},2.603906833989259,{"$f":"(B75-B74)/Sheet2!$G$5","v":1.5651741293532444}]
[{"$f":"A74+Sheet2!G$5","v":{"v":0.7880597014925381,"d":"0.79"}},2.6210380931165083,{"$f":"(B76-B75)/Sheet2!$G$5","v":1.5870646766169132}]
[{"$f":"A75+Sheet2!G$5","v":{"v":0.799004975124379,"d":"0.80"}},2.6384089502735093,{"$f":"(B77-B76)/Sheet2!$G$5","v":1.6089552238806224}]
[{"$f":"A76+Sheet2!G$5","v":{"v":0.8099502487562198,"d":"0.81"}},2.6560194054602624,{"$f":"(B78-B77)/Sheet2!$G$5","v":1.6308457711442912}]
[{"$f":"A77+Sheet2!G$5","v":{"v":0.8208955223880606,"d":"0.82"}},2.673869458676767,{"$f":"(B79-B78)/Sheet2!$G$5","v":1.6527363184079598}]
[{"$f":"A78+Sheet2!G$5","v":{"v":0.8318407960199015,"d":"0.83"}},2.6919591099230233,{"$f":"(B80-B79)/Sheet2!$G$5","v":1.674626865671669}]
[{"$f":"A79+Sheet2!G$5","v":{"v":0.8427860696517423,"d":"0.84"}},2.7102883591990317,{"$f":"(B81-B80)/Sheet2!$G$5","v":1.6965174129352971}]
{"$rows_left_out":925}
{"sheet":"Sheet3","index":2,"n_rows":1003,"n_cols":2,"rows_kept":1003}
[{"$f":"xMin","v":0},{"$f":"9","v":9}]
[{"$f":"A1+dx","v":0.010945273631840797},{"$f":"9","v":9}]
[0.021890547263681594,{"$f":"9","v":9}]
[0.032835820895522394,{"$f":"9","v":9}]
[0.04378109452736319,{"$f":"9","v":9}]
[0.05472636815920398,{"$f":"9","v":9}]
[0.06567164179104477,{"$f":"9","v":9}]
[0.07661691542288557,{"$f":"9","v":9}]
[0.08756218905472636,{"$f":"9","v":9}]
[0.09850746268656715,{"$f":"9","v":9}]
[0.10945273631840795,{"$f":"9","v":9}]
[0.12039800995024874,{"$f":"9","v":9}]
[0.13134328358208955,{"$f":"9","v":9}]
[0.14228855721393036,{"$f":"9","v":9}]
[0.15323383084577116,{"$f":"9","v":9}]
[0.16417910447761197,{"$f":"9","v":9}]
[0.17512437810945278,{"$f":"9","v":9}]
[0.18606965174129358,{"$f":"9","v":9}]
[0.1970149253731344,{"$f":"9","v":9}]
[0.2079601990049752,{"$f":"9","v":9}]
[0.218905472636816,{"$f":"9","v":9}]
[0.2298507462686568,{"$f":"9","v":9}]
[0.24079601990049762,{"$f":"9","v":9}]
[0.25174129353233843,{"$f":"9","v":9}]
[0.2626865671641792,{"$f":"9","v":9}]
[0.27363184079602,{"$f":"9","v":9}]
[0.28457711442786077,{"$f":"9","v":9}]
[0.29552238805970155,{"$f":"9","v":9}]
[0.3064676616915423,{"$f":"9","v":9}]
[0.3174129353233831,{"$f":"9","v":9}]
[0.3283582089552239,{"$f":"9","v":9}]
[0.33930348258706466,{"$f":"9","v":9}]
[0.35024875621890544,{"$f":"9","v":9}]
[0.3611940298507462,{"$f":"9","v":9}]
[0.372139303482587,{"$f":"9","v":9}]
[0.3830845771144278,{"$f":"9","v":9}]
[0.39402985074626856,{"$f":"9","v":9}]
[0.40497512437810934,{"$f":"9","v":9}]
[0.4159203980099501,{"$f":"9","v":9}]
[0.4268656716417909,{"$f":"9","v":9}]
[0.4378109452736317,{"$f":"9","v":9}]
[0.44875621890547246,{"$f":"9","v":9}]
[0.45970149253731324,{"$f":"9","v":9}]
[0.470646766169154,{"$f":"9","v":9}]
[0.4815920398009948,{"$f":"9","v":9}]
[0.4925373134328356,{"$f":"9","v":9}]
[0.5034825870646764,{"$f":"9","v":9}]
[0.5144278606965172,{"$f":"9","v":9}]
[0.5253731343283581,{"$f":"9","v":9}]
[0.5363184079601989,{"$f":"9","v":9}]
[0.5472636815920398,{"$f":"9","v":9}]
[0.5582089552238806,{"$f":"9","v":9}]
[0.5691542288557214,{"$f":"9","v":9}]
[0.5800995024875623,{"$f":"9","v":9}]
[0.5910447761194031,{"$f":"9","v":9}]
[0.6019900497512439,{"$f":"9","v":9}]
[0.6129353233830848,{"$f":"9","v":9}]
[0.6238805970149256,{"$f":"9","v":9}]
[0.6348258706467664,{"$f":"9","v":9}]
[0.6457711442786073,{"$f":"9","v":9}]
[0.6567164179104481,{"$f":"9","v":9}]
[0.6676616915422889,{"$f":"9","v":9}]
[0.6786069651741298,{"$f":"9","v":9}]
[0.6895522388059706,{"$f":"9","v":9}]
[0.7004975124378114,{"$f":"9","v":9}]
[{"$f":"A65+dx","v":0.7114427860696523},{"$f":"9","v":9}]
[0.7223880597014931,{"$f":"9","v":9}]
[0.733333333333334,{"$f":"9","v":9}]
[0.7442786069651748,{"$f":"9","v":9}]
[0.7552238805970156,{"$f":"9","v":9}]
[0.7661691542288565,{"$f":"9","v":9}]
[0.7771144278606973,{"$f":"9","v":9}]
[0.7880597014925381,{"$f":"9","v":9}]
[0.799004975124379,{"$f":"9","v":9}]
[0.8099502487562198,{"$f":"9","v":9}]
[0.8208955223880606,{"$f":"9","v":9}]
[0.8318407960199015,{"$f":"9","v":9}]
[0.8427860696517423,{"$f":"9","v":9}]
[0.8537313432835831,{"$f":"9","v":9}]
[0.864676616915424,{"$f":"9","v":9}]
{"$rows_left_out":924}
{"sheet":"Defining Function","index":3,"n_rows":12,"n_cols":1,"rows_kept":12}
["                                                     Defining a Function in Excel"]
[]
["Computers have very specific rules you must follow when defining a function.  If you don't, the program will either not work at all or will work incorrectly."]
[]
["1. The Variable used should be the one named in the instruction, usually x, though sometimes y, t, Q (for an angle theta), "]
[" or even x and y (for a function of two variables). "]
[]
["2.  Order of Operations:  There five arithmetic operations, addition (+), subtraction (-), multiplication (*), division (/), and  exponentiation or power (^).  When computers see any of these operation symbols, they perform the indicated steps in a very particular order.  First, the power is done.  Second, products and quotients of adjacent terms is done.  Third, and last, sums and differences of adjacent terms are done.  So, in 10*x^3 + 5*x – 7, say with x = 2, the first pass only calculates 2^3 and ignores the multiplications and the sums and differences to calculate 2^3 = 8.  The second pass looks at 10*8 + 5*2 – 7 and only does the multiplications, so it produces 80 + 10 -  7.  The third pass looks at the +’s and –‘s to produce 80 + 10 – 7 = 83.  "]
[]
["3.    Parentheses  If you need an operation involving more than two adjacent terms, as in Ö4^3 + 6^2, the computer would take the square root of  4 to produce 2^3 + 6^2;  it would then cube the 2 and square the 6 to produce 8 + 36; and finally it would add the 8 and the 36 to get 44.  If you actually wanted the square root of the entire expression, you would need to use parentheses, as in Ö(4^3 + 6^2) to tell the computer to do all the operations inside the parentheses before taking the square root.  Therefore, it would calculate (4^3 + 6^2) = 64 + 36 = 100 and then take the square root of Ö100  =  10."]
[]
["4.  Built-In Functions  Computer programs have built-in functions for most common algebraic functions.  In Excel, the square root function is denoted by SQRT(…), so SQRT(100) = 10.  Alternatively, you could enter it as 100^.5 or 100^(1/2); notice that parentheses are needed to have the ½ done first.  The common trig functions are SIN (…), COS (…), and TAN (…), where the arguments are automatically interpreted as being in radians, not degrees.  The logarithm to the base 10 is represented by LOG (…) and the logarithm with the base e, known as the natural logarithm, is LN (…). The corresponding exponential function with base e is EXP (x).  If x is the variable, then each of these would be SQRT (x), SIN (x), COS (x), TAN (x), LOG (x) (for log with base 10 ), LN (x) (for log with base e ), and EXP (x)."]