{"text_format":"3","workbook":"xlsx","n_sheets":3,"sheets":["Deriv of Sine","Deriv of Cosine","Sheet3"],"not_rendered":{"charts":4,"images":2,"defined_names":1,"comments":2},"read":"whole","date_system":"1900"}

{"sheet":"Deriv of Sine","index":0,"n_rows":36,"n_cols":9,"rows_kept":36,"merged":[[29,2,29,3]]}
[null,"Derivative of the Sine Function"]
[]
[null,"  This graphing utility lets you investigate "]
[null,"     the derivative of the sine function"]
[null,"  based on the slope of the tangent line"]
[null,"   at any point from x = 0  to x = 2p."]
[]
[]
[]
[null,"   Select the point of tangency x0 =",{"$nulls":3},{"$f":"E12","v":2.1352}]
[]
[{"$nulls":3},34,{"$f":"Sheet3!G1+D12*(Sheet3!G2-Sheet3!G1)/100","v":2.1352}]
[]
[]
[null,"The slope of the tangent line at x0 = ",{"$nulls":3},{"$f":"E12","v":2.1352}]
[null,"    =  the derivative f '( x0) of the function = ",{"$nulls":4},{"$f":"LOOKUP(E12,Sheet3!A3:A1003,Sheet3!C3:C1003)","v":-0.5347408496923944},null,{"$f":"LOOKUP(F15,Sheet3!A3:A631,Sheet3!C3:C631)","v":-0.5347408496923944}]
[]
[]
[]
[]
[]
["Click each item below for suggestions and investigations"]
[null,null,"   Item 1"]
[null,null,"   Item 2"]
[null,null,"   Item 3"]
[]
[]
[]
["To access/download all the DIGMath Apps for Calculus"]
["     Click this link:",null,"DIGMath for Calculus"]
[]
["Created by:  Sheldon P. Gordon   "]
["                      Farmingdale State College    "]
["Development of this module was supported by the "]
["NSF's Division of Undergraduate Education  "]
["under grants DUE-0310123 and DUE-0442160."]

{"sheet":"Deriv of Cosine","index":1,"n_rows":36,"n_cols":7,"rows_kept":36,"merged":[[29,2,29,3]]}
["     Derivative of the Cosine Function"]
[]
[null,"This graphing utility lets you investigate "]
[null,"    the derivative of the cosine function"]
[null,"  based on the slope of the tangent line"]
[null,"   at any point from x = 0  to x = 2p."]
[]
[]
[]
[null,"   Select the point of tangency x0 =",{"$nulls":3},{"$f":"E12","v":2.7632}]
[]
[{"$nulls":3},44,{"$f":"Sheet3!G1+D12*(Sheet3!G2-Sheet3!G1)/100","v":2.7632}]
[]
[]
[null,"The slope of the tangent line at x0 = ",{"$nulls":3},{"$f":"E12","v":2.7632}]
[null,"    =  the derivative f '( x0) of the function = ",{"$nulls":4},{"$f":"-LOOKUP(E12,Sheet3!A3:A631,Sheet3!B3:B631)","v":-0.3723990394250693}]
[]
[]
[]
[]
[]
["Click each item below for suggestions and investigations"]
[null,null,"   Item 1"]
[null,null,"   Item 2"]
[null,null,"   Item 3"]
[]
[]
[]
["To access/download all the DIGMath Apps for Calculus"]
["     Click this link:",null,"DIGMath for Calculus"]
[]
["Created by:  Sheldon P. Gordon   "]
["                      Farmingdale State College    "]
["Development of this module was supported by the "]
["NSF's Division of Undergraduate Education  "]
["under grants DUE-0310123 and DUE-0442160."]

{"sheet":"Sheet3","index":2,"n_rows":632,"n_cols":11,"rows_kept":632}
["x","sine","slope","cosine","slope","xMin =",0,"xl=",{"$f":"IF('Deriv of Sine'!$E$12<Sheet3!G1+80*Sheet3!I5,Sheet3!G1,'Deriv of Sine'!E12-80*Sheet3!I5)","v":1.3352000000000002},{"$f":"LOOKUP('Deriv of Sine'!E12,Sheet3!A3:A631,Sheet3!B3:B631)+LOOKUP('Deriv of Sine'!E12,Sheet3!A3:A631,Sheet3!C3:C631)*(I1-'Deriv of Sine'!E12)","v":1.275470519887486},"\"=yl"]
[{"$nulls":5},"xMax =",6.28,"xr=",{"$f":"IF('Deriv of Sine'!$E$12>Sheet3!G2-80*Sheet3!I5,Sheet3!G2,'Deriv of Sine'!E12+80*Sheet3!I5)","v":2.9352},{"$f":"LOOKUP('Deriv of Sine'!E12,Sheet3!A3:A631,Sheet3!B3:B631)+LOOKUP('Deriv of Sine'!E12,Sheet3!A3:A631,Sheet3!C3:C631)*(I2-'Deriv of Sine'!E12)","v":0.41988516037965506},"\"=yR"]
[{"v":0,"d":"0.00"},{"$f":"SIN(A3)","v":0},{"$f":"(B4-B3)/Sheet3!$I$5","v":0.9999833334166665},{"$f":"COS(A3)","v":1},{"$f":"(D4-D3)/Sheet3!$I$5","v":-0.004999958333473664},null,null,"x0=",{"$f":"'Deriv of Sine'!F15","v":2.1352},"y0=",{"$f":"'Deriv of Sine'!I16","v":-0.5347408496923944}]
[{"$f":"A3+Sheet3!I$5","v":0.01},{"$f":"SIN(A4)","v":0.009999833334166664},{"$f":"(B5-B4)/Sheet3!$I$5","v":0.9998833359166416},{"$f":"COS(A4)","v":0.9999500004166653},{"$f":"(D5-D4)/Sheet3!$I$5","v":-0.014999375008750704}]
[{"$f":"A4+Sheet3!I$5","v":0.02},0.01999866669333308,{"$f":"(B6-B5)/Sheet3!$I$5","v":0.999683350916258},0.9998000066665778,{"$f":"(D6-D5)/Sheet3!$I$5","v":-0.024997291759021323},null,null,"delta x = ",0.01]
[{"$f":"A5+Sheet3!I$5","v":0.03},0.02999550020249566,{"$f":"(B7-B6)/Sheet3!$I$5","v":0.99938339841385},0.9995500337489875,{"$f":"(D7-D6)/Sheet3!$I$5","v":-0.034992708800962724}]
[{"$f":"A6+Sheet3!I$5","v":0.04},0.03998933418663416,{"$f":"(B8-B7)/Sheet3!$I$5","v":0.998983508404417},0.9992001066609779,{"$f":"(D8-D7)/Sheet3!$I$5","v":-0.04498462660116331}]
[{"$f":"A7+Sheet3!I$5","v":0.05},0.04997916927067833,{"$f":"(B9-B8)/Sheet3!$I$5","v":0.9984837208766272},0.9987502603949663,{"$f":"(D9-D8)/Sheet3!$I$5","v":-0.054972045976209305},null,"Derivative of Cosine:"]
[{"$f":"A8+Sheet3!I$5","v":{"v":0.060000000000000005,"d":"0.06"}},0.0599640064794446,{"$f":"(B10-B9)/Sheet3!$I$5","v":0.9978840858088166},0.9982005399352042,{"$f":"(D10-D9)/Sheet3!$I$5","v":-0.06495396819246047},null,null,"xl=",{"$f":"IF('Deriv of Cosine'!$E$12<Sheet3!G1+80*Sheet3!I5,Sheet3!G1,'Deriv of Cosine'!E12-80*Sheet3!I5)","v":1.9631999999999998},{"$f":"LOOKUP('Deriv of Cosine'!E12,Sheet3!A3:A631,Sheet3!D3:D631)+LOOKUP('Deriv of Cosine'!E12,Sheet3!A3:A631,Sheet3!E3:E631)*(I9-'Deriv of Cosine'!E12)","v":-0.6338707038701612},"\"=yl"]
[{"$f":"A9+Sheet3!I$5","v":0.07},0.06994284733753277,{"$f":"(B11-B10)/Sheet3!$I$5","v":0.9971846631639927},0.9975510002532796,{"$f":"(D11-D10)/Sheet3!$I$5","v":-0.07492939506601459},null,null,"xr=",{"$f":"IF('Deriv of Cosine'!$E$12>Sheet3!G2-80*Sheet3!I5,Sheet3!G2,'Deriv of Cosine'!E12+80*Sheet3!I5)","v":3.5632},{"$f":"LOOKUP('Deriv of Cosine'!E12,Sheet3!A3:A631,Sheet3!D3:D631)-LOOKUP('Deriv of Cosine'!E12,Sheet3!A3:A631,Sheet3!B3:B631)*(I10-'Deriv of Cosine'!E12)","v":-1.2259919417493828},"\"=yR"]
[{"$f":"A10+Sheet3!I$5","v":0.08},0.0799146939691727,{"$f":"(B12-B11)/Sheet3!$I$5","v":0.9963855228838344},0.9968017063026194,{"$f":"(D12-D11)/Sheet3!$I$5","v":-0.08489732906251657},null,null,"x0=",{"$f":"'Deriv of Cosine'!$F$15","v":2.7632},"y0=",{"$f":"'Deriv of Cosine'!$G$16","v":-0.3723990394250693}]
[{"$f":"A11+Sheet3!I$5","v":0.09},0.08987854919801104,{"$f":"(B13-B12)/Sheet3!$I$5","v":0.9954867448817101},0.9959527330119943,{"$f":"(D13-D12)/Sheet3!$I$5","v":-0.09485677339684528}]
[{"$f":"A12+Sheet3!I$5","v":{"v":0.09999999999999999,"d":"0.10"}},0.09983341664682814,{"$f":"(B14-B13)/Sheet3!$I$5","v":0.9944884190346656},0.9950041652780258,{"$f":"(D14-D13)/Sheet3!$I$5","v":-0.10480673213290048}]
[{"$f":"A13+Sheet3!I$5","v":{"v":0.10999999999999999,"d":"0.11"}},0.1097783008371748,{"$f":"(B15-B14)/Sheet3!$I$5","v":0.9933906451744551},0.9939560979566968,{"$f":"(D15-D14)/Sheet3!$I$5","v":-0.11474621028305654}]
[{"$f":"A14+Sheet3!I$5","v":{"v":0.11999999999999998,"d":"0.12"}},0.11971220728891935,{"$f":"(B16-B15)/Sheet3!$I$5","v":0.9921935330775483},0.9928086358538663,{"$f":"(D16-D15)/Sheet3!$I$5","v":-0.12467421390781608}]
[{"$f":"A15+Sheet3!I$5","v":{"v":0.12999999999999998,"d":"0.13"}},0.12963414261969483,{"$f":"(B17-B16)/Sheet3!$I$5","v":0.9908972024541635},0.9915618937147881,{"$f":"(D17-D16)/Sheet3!$I$5","v":-0.13458975021508612}]
[{"$f":"A16+Sheet3!I$5","v":{"v":0.13999999999999999,"d":"0.14"}},0.13954311464423647,{"$f":"(B18-B17)/Sheet3!$I$5","v":0.9895017829362751},0.9902159962126372,{"$f":"(D18-D17)/Sheet3!$I$5","v":-0.14449182765949864}]
[{"$f":"A17+Sheet3!I$5","v":0.15},0.14943813247359922,{"$f":"(B19-B18)/Sheet3!$I$5","v":0.9880074140646761},0.9887710779360422,{"$f":"(D19-D18)/Sheet3!$I$5","v":-0.15437945604153125}]
[{"$f":"A18+Sheet3!I$5","v":0.16},0.15931820661424598,{"$f":"(B20-B19)/Sheet3!$I$5","v":0.9864142452750052},0.9872272833756269,{"$f":"(D20-D19)/Sheet3!$I$5","v":-0.16425164660661684}]
[{"$f":"A19+Sheet3!I$5","v":0.17},0.16918234906699603,{"$f":"(B21-B20)/Sheet3!$I$5","v":0.9847224358828177},0.9855847669095608,{"$f":"(D21-D20)/Sheet3!$I$5","v":-0.17410741214393122}]
[{"$f":"A20+Sheet3!I$5","v":{"v":0.18000000000000002,"d":"0.18"}},0.1790295734258242,{"$f":"(B22-B21)/Sheet3!$I$5","v":0.9829321550676395},0.9838436927881214,{"$f":"(D22-D21)/Sheet3!$I$5","v":-0.18394576708511412}]
[{"$f":"A21+Sheet3!I$5","v":{"v":0.19000000000000003,"d":"0.19"}},0.1888588949765006,{"$f":"(B23-B22)/Sheet3!$I$5","v":0.9810435818560642},0.9820042351172703,{"$f":"(D23-D22)/Sheet3!$I$5","v":-0.19376572760286814}]
[{"$f":"A22+Sheet3!I$5","v":{"v":0.20000000000000004,"d":"0.20"}},0.19866933079506124,{"$f":"(B24-B23)/Sheet3!$I$5","v":0.9790569051038367},0.9800665778412416,{"$f":"(D24-D23)/Sheet3!$I$5","v":-0.2035663117093356}]
[{"$f":"A23+Sheet3!I$5","v":{"v":0.21000000000000005,"d":"0.21"}},0.2084598998460996,{"$f":"(B25-B24)/Sheet3!$I$5","v":0.9769723234769767},0.9780309147241483,{"$f":"(D25-D24)/Sheet3!$I$5","v":-0.2133465393542755}]
[{"$f":"A24+Sheet3!I$5","v":{"v":0.22000000000000006,"d":"0.22"}},0.21822962308086938,{"$f":"(B26-B25)/Sheet3!$I$5","v":0.9747900454319086},0.9758974493306055,{"$f":"(D26-D25)/Sheet3!$I$5","v":-0.22310543252307413}]
[{"$f":"A25+Sheet3!I$5","v":{"v":0.23000000000000007,"d":"0.23"}},0.22797752353518846,{"$f":"(B27-B26)/Sheet3!$I$5","v":0.9725102891946197},0.9736663950053748,{"$f":"(D27-D26)/Sheet3!$I$5","v":-0.2328420153345223}]
[{"$f":"A26+Sheet3!I$5","v":{"v":0.24000000000000007,"d":"0.24"}},0.23770262642713466,{"$f":"(B28-B27)/Sheet3!$I$5","v":0.9701332827388331},0.9713379748520296,{"$f":"(D28-D27)/Sheet3!$I$5","v":-0.24255531413848175}]
[{"$f":"A27+Sheet3!I$5","v":{"v":0.25000000000000006,"d":"0.25"}},0.247403959254523,{"$f":"(B29-B28)/Sheet3!$I$5","v":0.9676592637632181},0.9689124217106447,{"$f":"(D29-D28)/Sheet3!$I$5","v":-0.25224435761315167}]
[{"$f":"A28+Sheet3!I$5","v":{"v":0.26000000000000006,"d":"0.26"}},0.2570805518921552,{"$f":"(B30-B29)/Sheet3!$I$5","v":0.9650884796676029},0.9663899781345132,{"$f":"(D30-D29)/Sheet3!$I$5","v":-0.26190817686226886}]
[{"$f":"A29+Sheet3!I$5","v":{"v":0.2700000000000001,"d":"0.27"}},0.2667314366888312,{"$f":"(B31-B30)/Sheet3!$I$5","v":0.9624211875282618},0.9637708963658905,{"$f":"(D31-D30)/Sheet3!$I$5","v":-0.2715458055119635}]
[{"$f":"A30+Sheet3!I$5","v":{"v":0.2800000000000001,"d":"0.28"}},0.2763556485641138,{"$f":"(B32-B31)/Sheet3!$I$5","v":0.9596576540721824},0.9610554383107709,{"$f":"(D32-D31)/Sheet3!$I$5","v":-0.2811562798073708}]
[{"$f":"A31+Sheet3!I$5","v":{"v":0.2900000000000001,"d":"0.29"}},0.28595222510483564,{"$f":"(B33-B32)/Sheet3!$I$5","v":0.9567981556504013},0.9582438755126972,{"$f":"(D33-D32)/Sheet3!$I$5","v":-0.2907386387091204}]
[{"$f":"A32+Sheet3!I$5","v":{"v":0.3000000000000001,"d":"0.30"}},0.29552020666133966,{"$f":"(B34-B33)/Sheet3!$I$5","v":0.9538429782103952},0.955336489125606,{"$f":"(D34-D33)/Sheet3!$I$5","v":-0.30029192398925986}]
[{"$f":"A33+Sheet3!I$5","v":{"v":0.3100000000000001,"d":"0.31"}},0.3050586364434436,{"$f":"(B35-B34)/Sheet3!$I$5","v":0.9507924172674265},0.9523335698857134,{"$f":"(D35-D34)/Sheet3!$I$5","v":-0.3098151803272553}]
[{"$f":"A34+Sheet3!I$5","v":{"v":0.3200000000000001,"d":"0.32"}},0.3145665606161179,{"$f":"(B36-B35)/Sheet3!$I$5","v":0.9476467778750608},0.9492354180824408,{"$f":"(D36-D35)/Sheet3!$I$5","v":-0.3193074554053932}]
[{"$f":"A35+Sheet3!I$5","v":{"v":0.3300000000000001,"d":"0.33"}},0.3240430283948685,{"$f":"(B37-B36)/Sheet3!$I$5","v":0.944406374594603},0.9460423435283869,{"$f":"(D37-D36)/Sheet3!$I$5","v":-0.3287678000040706}]
[{"$f":"A36+Sheet3!I$5","v":{"v":0.34000000000000014,"d":"0.34"}},0.3334870921408145,{"$f":"(B38-B37)/Sheet3!$I$5","v":0.9410715314636997},0.9427546655283462,{"$f":"(D38-D37)/Sheet3!$I$5","v":-0.3381952680967304}]
[{"$f":"A37+Sheet3!I$5","v":{"v":0.35000000000000014,"d":"0.35"}},0.3428978074554515,{"$f":"(B39-B38)/Sheet3!$I$5","v":0.9376425819638601},0.9393727128473789,{"$f":"(D39-D38)/Sheet3!$I$5","v":-0.34758891694440797}]
[{"$f":"A38+Sheet3!I$5","v":{"v":0.36000000000000015,"d":"0.36"}},0.3522742332750901,{"$f":"(B40-B39)/Sheet3!$I$5","v":0.9341198689872043},0.9358968236779348,{"$f":"(D40-D39)/Sheet3!$I$5","v":-0.3569478071900445}]
[{"$f":"A39+Sheet3!I$5","v":{"v":0.37000000000000016,"d":"0.37"}},0.36161543196496215,{"$f":"(B41-B40)/Sheet3!$I$5","v":0.9305037448020692},0.9323273456060344,{"$f":"(D41-D40)/Sheet3!$I$5","v":-0.366271002952423}]
[{"$f":"A40+Sheet3!I$5","v":{"v":0.38000000000000017,"d":"0.38"}},0.37092046941298285,{"$f":"(B42-B41)/Sheet3!$I$5","v":0.9267945710178749},0.9286646355765101,{"$f":"(D42-D41)/Sheet3!$I$5","v":-0.3755575719197157}]
[{"$f":"A41+Sheet3!I$5","v":{"v":0.3900000000000002,"d":"0.39"}},0.3801884151231616,{"$f":"(B43-B42)/Sheet3!$I$5","v":0.9229927185489095},0.924909059857313,{"$f":"(D43-D42)/Sheet3!$I$5","v":-0.38480658544279844}]
[{"$f":"A42+Sheet3!I$5","v":{"v":0.4000000000000002,"d":"0.40"}},0.3894183423086507,{"$f":"(B44-B43)/Sheet3!$I$5","v":0.9190985675772367},0.921060994002885,{"$f":"(D44-D43)/Sheet3!$I$5","v":-0.3940171186279984}]
[{"$f":"A43+Sheet3!I$5","v":{"v":0.4100000000000002,"d":"0.41"}},0.39860932798442306,{"$f":"(B45-B44)/Sheet3!$I$5","v":0.9151125075147315},0.917120822816605,{"$f":"(D45-D44)/Sheet3!$I$5","v":-0.40318825042968687}]
[{"$f":"A44+Sheet3!I$5","v":{"v":0.4200000000000002,"d":"0.42"}},0.40776045305957037,{"$f":"(B46-B45)/Sheet3!$I$5","v":0.9110349369640613},0.9130889403123081,{"$f":"(D46-D45)/Sheet3!$I$5","v":-0.41231906374230576}]
[{"$f":"A45+Sheet3!I$5","v":{"v":0.4300000000000002,"d":"0.43"}},0.416870802429211,{"$f":"(B47-B46)/Sheet3!$I$5","v":0.9068662636788793},0.9089657496748851,{"$f":"(D47-D46)/Sheet3!$I$5","v":-0.4214086454921717}]
[{"$f":"A46+Sheet3!I$5","v":{"v":0.4400000000000002,"d":"0.44"}},0.4259394650659998,{"$f":"(B48-B47)/Sheet3!$I$5","v":0.9026069045230622},0.9047516632199634,{"$f":"(D48-D47)/Sheet3!$I$5","v":-0.43045608672865887}]
[{"$f":"A47+Sheet3!I$5","v":{"v":0.45000000000000023,"d":"0.45"}},0.4349655341112304,{"$f":"(B49-B48)/Sheet3!$I$5","v":0.8982572854289606},0.9004471023526768,{"$f":"(D49-D48)/Sheet3!$I$5","v":-0.43946048271515936}]
[{"$f":"A48+Sheet3!I$5","v":{"v":0.46000000000000024,"d":"0.46"}},0.44394810696552,{"$f":"(B50-B49)/Sheet3!$I$5","v":0.8938178413548492},0.8960524975255252,{"$f":"(D50-D49)/Sheet3!$I$5","v":-0.44842093301963315}]
[{"$f":"A49+Sheet3!I$5","v":{"v":0.47000000000000025,"d":"0.47"}},0.4528862853790685,{"$f":"(B51-B50)/Sheet3!$I$5","v":0.8892890162414624},0.8915682881953289,{"$f":"(D51-D50)/Sheet3!$I$5","v":-0.45733654160448056}]
[{"$f":"A50+Sheet3!I$5","v":{"v":0.48000000000000026,"d":"0.48"}},0.4617791755414831,{"$f":"(B52-B51)/Sheet3!$I$5","v":0.8846712629675124},0.886994922779284,{"$f":"(D52-D51)/Sheet3!$I$5","v":-0.4662064169162705}]
[{"$f":"A51+Sheet3!I$5","v":{"v":0.49000000000000027,"d":"0.49"}},0.47062588817115825,{"$f":"(B53-B52)/Sheet3!$I$5","v":0.8799650433044925},0.8823328586101213,{"$f":"(D53-D52)/Sheet3!$I$5","v":-0.4750296719748692}]
[{"$f":"A52+Sheet3!I$5","v":{"v":0.5000000000000002,"d":"0.50"}},0.47942553860420317,{"$f":"(B54-B53)/Sheet3!$I$5","v":0.8751708278704529},0.8775825618903726,{"$f":"(D54-D53)/Sheet3!$I$5","v":-0.483805424462147}]
[{"$f":"A53+Sheet3!I$5","v":{"v":0.5100000000000002,"d":"0.51"}},0.4881772468829077,{"$f":"(B55-B54)/Sheet3!$I$5","v":0.8702890960829213},0.8727445076457512,{"$f":"(D55-D54)/Sheet3!$I$5","v":-0.49253279681014117}]
[{"$f":"A54+Sheet3!I$5","v":{"v":0.5200000000000002,"d":"0.52"}},0.4968801378437369,{"$f":"(B56-B55)/Sheet3!$I$5","v":0.8653203361110251},0.8678191796776498,{"$f":"(D56-D55)/Sheet3!$I$5","v":-0.5012109162888856}]
[{"$f":"A55+Sheet3!I$5","v":{"v":0.5300000000000002,"d":"0.53"}},0.5055333412048472,{"$f":"(B57-B56)/Sheet3!$I$5","v":0.8602650448266136},0.8628070705147609,{"$f":"(D57-D56)/Sheet3!$I$5","v":-0.5098389150936855}]
[{"$f":"A56+Sheet3!I$5","v":{"v":0.5400000000000003,"d":"0.54"}},0.5141359916531133,{"$f":"(B58-B57)/Sheet3!$I$5","v":0.8551237277546142},0.857708681363824,{"$f":"(D58-D57)/Sheet3!$I$5","v":-0.5184159304318481}]
[{"$f":"A57+Sheet3!I$5","v":{"v":0.5500000000000003,"d":"0.55"}},0.5226872289306594,{"$f":"(B59-B58)/Sheet3!$I$5","v":0.8498968990224176},0.8525245220595056,{"$f":"(D59-D58)/Sheet3!$I$5","v":-0.5269411046089578}]
[{"$f":"A58+Sheet3!I$5","v":{"v":0.5600000000000003,"d":"0.56"}},0.5311861979208836,{"$f":"(B60-B59)/Sheet3!$I$5","v":0.8445850813085909},0.847255111013416,{"$f":"(D60-D59)/Sheet3!$I$5","v":-0.5354135851147412}]
[{"$f":"A59+Sheet3!I$5","v":{"v":0.5700000000000003,"d":"0.57"}},0.5396320487339695,{"$f":"(B61-B60)/Sheet3!$I$5","v":0.8391888057904251},0.8419009751622686,{"$f":"(D61-D60)/Sheet3!$I$5","v":-0.5438325247081766}]
[{"$f":"A60+Sheet3!I$5","v":{"v":0.5800000000000003,"d":"0.58"}},0.5480239367918738,{"$f":"(B62-B61)/Sheet3!$I$5","v":0.833708612091022},0.8364626499151868,{"$f":"(D62-D61)/Sheet3!$I$5","v":-0.552197081502348}]
[{"$f":"A61+Sheet3!I$5","v":{"v":0.5900000000000003,"d":"0.59"}},0.556361022912784,{"$f":"(B63-B62)/Sheet3!$I$5","v":0.8281450482251596},0.8309406791001633,{"$f":"(D63-D62)/Sheet3!$I$5","v":-0.5605064190485232}]
[{"$f":"A62+Sheet3!I$5","v":{"v":0.6000000000000003,"d":"0.60"}},0.5646424733950356,{"$f":"(B64-B63)/Sheet3!$I$5","v":0.8224986705445914},0.8253356149096781,{"$f":"(D64-D63)/Sheet3!$I$5","v":-0.5687597064198746}]
[{"$f":"A63+Sheet3!I$5","v":{"v":0.6100000000000003,"d":"0.61"}},0.5728674601004815,{"$f":"(B65-B64)/Sheet3!$I$5","v":0.8167700436823799},0.8196480178454794,{"$f":"(D65-D64)/Sheet3!$I$5","v":-0.5769561182945582}]
[{"$f":"A64+Sheet3!I$5","v":{"v":0.6200000000000003,"d":"0.62"}},0.5810351605373053,{"$f":"(B66-B65)/Sheet3!$I$5","v":0.810959740496453},0.8138784566625338,{"$f":"(D66-D65)/Sheet3!$I$5","v":-0.5850948350382135}]
[{"$f":"A65+Sheet3!I$5","v":{"v":0.6300000000000003,"d":"0.63"}},0.5891447579422698,{"$f":"(B67-B66)/Sheet3!$I$5","v":0.8050683420122495},0.8080275083121516,{"$f":"(D67-D66)/Sheet3!$I$5","v":-0.5931750427859206}]
[{"$f":"A66+Sheet3!I$5","v":{"v":0.6400000000000003,"d":"0.64"}},0.5971954413623923,{"$f":"(B68-B67)/Sheet3!$I$5","v":0.7990964373647547},0.8020957578842924,{"$f":"(D68-D67)/Sheet3!$I$5","v":-0.6011959335236794}]
[{"$f":"A67+Sheet3!I$5","v":{"v":0.6500000000000004,"d":"0.65"}},{"$f":"SIN(A68)","v":0.6051864057360399},{"$f":"(B69-B68)/Sheet3!$I$5","v":0.7930446237394251},{"$f":"COS(A68)","v":0.7960837985490556},{"$f":"(D69-D68)/Sheet3!$I$5","v":-0.6091567051690783}]
[{"$f":"A68+Sheet3!I$5","v":{"v":0.6600000000000004,"d":"0.66"}},0.6131168519734341,{"$f":"(B70-B69)/Sheet3!$I$5","v":0.786913506312581},0.7899922314973649,{"$f":"(D70-D69)/Sheet3!$I$5","v":-0.6170565616515855}]
[{"$f":"A69+Sheet3!I$5","v":{"v":0.6700000000000004,"d":"0.67"}},0.6209859870365599,{"$f":"(B71-B70)/Sheet3!$I$5","v":0.7807036981908877},0.783821665880849,{"$f":"(D71-D70)/Sheet3!$I$5","v":-0.6248947129921301}]
[{"$f":"A70+Sheet3!I$5","v":{"v":0.6800000000000004,"d":"0.68"}},0.6287930240184688,{"$f":"(B72-B71)/Sheet3!$I$5","v":0.7744158203499385},0.7775727187509277,{"$f":"(D72-D71)/Sheet3!$I$5","v":-0.6326703753821383}]
[{"$f":"A71+Sheet3!I$5","v":{"v":0.6900000000000004,"d":"0.69"}},0.6365371822219682,{"$f":"(B73-B72)/Sheet3!$I$5","v":0.7680505015723149},0.7712460149971063,{"$f":"(D73-D72)/Sheet3!$I$5","v":-0.640382771261816}]
[{"$f":"A72+Sheet3!I$5","v":{"v":0.7000000000000004,"d":"0.70"}},0.6442176872376913,{"$f":"(B74-B73)/Sheet3!$I$5","v":0.7616083783845595},0.7648421872844882,{"$f":"(D74-D73)/Sheet3!$I$5","v":-0.6480311293980301}]
[{"$f":"A73+Sheet3!I$5","v":{"v":0.7100000000000004,"d":"0.71"}},0.651833771021537,{"$f":"(B75-B74)/Sheet3!$I$5","v":0.755090094993649},0.7583618759905079,{"$f":"(D75-D74)/Sheet3!$I$5","v":-0.6556146849613143}]
[{"$f":"A74+Sheet3!I$5","v":{"v":0.7200000000000004,"d":"0.72"}},0.6593846719714734,{"$f":"(B76-B75)/Sheet3!$I$5","v":0.748496303222479},0.7518057291408947,{"$f":"(D76-D75)/Sheet3!$I$5","v":-0.6631326796024628}]
[{"$f":"A75+Sheet3!I$5","v":{"v":0.7300000000000004,"d":"0.73"}},0.6668696350036982,{"$f":"(B77-B76)/Sheet3!$I$5","v":0.7418276624447162},0.7451744023448701,{"$f":"(D77-D76)/Sheet3!$I$5","v":-0.6705843615282481}]
[{"$f":"A76+Sheet3!I$5","v":{"v":0.7400000000000004,"d":"0.74"}},0.6742879116281454,{"$f":"(B78-B77)/Sheet3!$I$5","v":0.7350848395189069},0.7384685587295876,{"$f":"(D78-D77)/Sheet3!$I$5","v":-0.6779689855767046}]
[{"$f":"A77+Sheet3!I$5","v":{"v":0.7500000000000004,"d":"0.75"}},0.6816387600233345,{"$f":"(B79-B78)/Sheet3!$I$5","v":0.7282685087217189},0.7316888688738206,{"$f":"(D79-D78)/Sheet3!$I$5","v":-0.6852858132915696}]
[{"$f":"A78+Sheet3!I$5","v":{"v":0.7600000000000005,"d":"0.76"}},0.6889214451105516,{"$f":"(B80-B79)/Sheet3!$I$5","v":0.72137935168054},0.7248360107409049,{"$f":"(D80-D79)/Sheet3!$I$5","v":-0.6925341129961793}]
[{"$f":"A79+Sheet3!I$5","v":{"v":0.7700000000000005,"d":"0.77"}},0.696135238627357,{"$f":"(B81-B80)/Sheet3!$I$5","v":0.7144180573053438},0.7179106696109431,{"$f":"(D81-D80)/Sheet3!$I$5","v":-0.6997131598665995}]
{"$rows_left_out":552}