{"text_format":"3","workbook":"xlsx","n_sheets":4,"sheets":["Sheet1","Sheet2","Sheet3","Defining Function"],"not_rendered":{"charts":1,"images":1,"macros":1,"defined_names":6,"comments":1},"read":"whole","date_system":"1900"}

{"sheet":"Sheet1","index":0,"n_rows":35,"n_cols":19,"rows_kept":35,"merged":[[28,2,28,3]]}
[null,null,"The Differential"]
[]
[null,"    This graphing utility lets you compare"]
[null,null,"the differential dy based on"]
[null,null,"the tangent line to the curve"]
[null,null,"   to the actual change Dy"]
[null,null,"           for any Dx"]
[null,null,"     at any desired point."]
[]
[]
["  Enter the function in terms of x:     f(x) = ",{"$nulls":4},"x^3-7*x+4"]
[]
[]
["Now enter the interval for x:  "]
[null,null,"xMin =",1]
[null,null,"xMax =",5]
[]
[]
[{"$nulls":12},"The graph of the function y =",null,null,{"$f":"F11","v":"x^3-7*x+4"}]
[]
["Click each item below for suggestions and investigations"]
[null,null,"   Item 1",{"$nulls":9},"             Select the point of tangency x0 =",{"$nulls":3},{"$f":"P24","v":3.64}]
[null,null,"   Item 2"]
[null,null,"   Item 3",{"$nulls":11},66,{"$f":"D15+O24*(D16-D15)/100","v":3.64}]
[]
[{"$nulls":12},"Enter the change Dx in x -- it must be smaller than ",{"$nulls":5},{"$f":"xMax-x0","v":1.3599999999999999}]
[{"$nulls":14},"Dx = ",0.6]
["To access/download all the DIGMath Apps for Calculus"]
["      Click this link:",null,"DIGMath for Calculus",{"$nulls":9},{"$f":"IF(OR(dxx>S26,dxx<0),\"It must be between 0 and \"&TEXT(S26,\"0.00\"),\"\")","v":""}]
[{"$nulls":12},"       The actual change Dy in the function  = ",{"$nulls":4},{"$f":"Sheet2!H2-Sheet2!H1","v":23.730997391103323}]
["Created by:  Sheldon P. Gordon   "]
["                      Farmingdale State College    ",{"$nulls":12}," The value of the differential dy = ",{"$nulls":3},{"$f":"Sheet2!H6-Sheet2!H5","v":19.640904949196837}]
["Development of this module was supported by the "]
["NSF's Division of Undergraduate Education  "]
["under grants DUE-0310123 and DUE-0442160."]

{"sheet":"Sheet2","index":1,"n_rows":1004,"n_cols":10,"rows_kept":1004}
["x","f(x)","slope",null,null,"xl=",{"$f":"x0","v":3.64},{"$f":"LOOKUP(x0,Sheet2!A3:A1002,Sheet2!B3:B1002)","v":26.66224947615973},"\"=yl"]
[{"$nulls":5},"xr=",{"$f":"x0+dxx","v":4.24},{"$f":"LOOKUP(G2,Sheet2!A3:A1003,Sheet2!B3:B1003)","v":50.39324686726305},"\"=yR","secant line"]
[{"$f":"Sheet1!D15","v":{"v":1,"d":"1.00"}},{"$f":"x^3-7*x+4","v":-2},{"$f":"(B4-B3)/Sheet2!$G$18","v":-3.987996019964129}]
[{"$f":"A3+Sheet2!G$18","v":{"v":1.003996003996004,"d":"1.00"}},-2.0159360480318247,{"$f":"(B5-B4)/Sheet2!$G$18","v":-3.9639241877003633}]
[{"$f":"A4+Sheet2!G$18","v":{"v":1.0079920079920082,"d":"1.01"}},-2.0317759049257322,{"$f":"(B6-B5)/Sheet2!$G$18","v":-3.93975654714949},null,null,"xL =",{"$f":"x0","v":3.64},{"$f":"H1","v":26.66224947615973},"\"=yl"]
[{"$f":"A5+Sheet2!G$18","v":{"v":1.0119880119880122,"d":"1.01"}},-2.0475191878314245,{"$f":"(B7-B6)/Sheet2!$G$18","v":-3.9154930983101766},null,null,"xR =",{"$f":"x0+dxx","v":4.24},{"$f":"H1+dxx*LOOKUP(x0,A3:A1002,C3:C1002)","v":46.30315442535657},"\"=yR","tangent line"]
[{"$f":"A6+Sheet2!G$18","v":{"v":1.0159840159840163,"d":"1.02"}},-2.063165513898598,{"$f":"(B8-B7)/Sheet2!$G$18","v":-3.891133841183978}]
[{"$f":"A7+Sheet2!G$18","v":{"v":1.0199800199800204,"d":"1.02"}},-2.0787145002769556,{"$f":"(B9-B8)/Sheet2!$G$18","v":-3.8666787757697834}]
[{"$f":"A8+Sheet2!G$18","v":{"v":1.0239760239760245,"d":"1.02"}},-2.0941657641161955,{"$f":"(B10-B9)/Sheet2!$G$18","v":-3.842127902068037},null,null,"Vertical lines"]
[{"$f":"A9+Sheet2!G$18","v":{"v":1.0279720279720286,"d":"1.03"}},-2.109518922566018,{"$f":"(B11-B10)/Sheet2!$G$18","v":-3.8174812200787382},null,null,"x =",{"$f":"G$2","v":4.24},0,"\"= y"]
[{"$f":"A10+Sheet2!G$18","v":{"v":1.0319680319680327,"d":"1.03"}},-2.1247735927761227,{"$f":"(B12-B11)/Sheet2!$G$18","v":-3.792738729801666},null,null,"x =",{"$f":"G$2","v":4.24},{"$f":"H2","v":50.39324686726305},"\"= y"]
[{"$f":"A11+Sheet2!G$18","v":{"v":1.0359640359640367,"d":"1.04"}},-2.1399293918962092,{"$f":"(B13-B12)/Sheet2!$G$18","v":-3.767900431237042}]
[{"$f":"A12+Sheet2!G$18","v":{"v":1.0399600399600408,"d":"1.04"}},-2.1549859370759776,{"$f":"(B14-B13)/Sheet2!$G$18","v":-3.7429663243850886},null,null,"x =",{"$f":"G$2","v":4.24},0,"\"= y"]
[{"$f":"A13+Sheet2!G$18","v":{"v":1.043956043956045,"d":"1.04"}},-2.169942845465129,{"$f":"(B15-B14)/Sheet2!$G$18","v":-3.717936409245361},null,null,"x =",{"$f":"G$2","v":4.24},{"$f":"H6","v":46.30315442535657},"\"= y"]
[{"$f":"A14+Sheet2!G$18","v":{"v":1.047952047952049,"d":"1.05"}},-2.184799734213362,{"$f":"(B16-B15)/Sheet2!$G$18","v":-3.692810685817637}]
[{"$f":"A15+Sheet2!G$18","v":{"v":1.051948051948053,"d":"1.05"}},-2.1995562204703756,{"$f":"(B17-B16)/Sheet2!$G$18","v":-3.667589154102806}]
[{"$f":"A16+Sheet2!G$18","v":{"v":1.0559440559440572,"d":"1.06"}},-2.2142119213858713,{"$f":"(B18-B17)/Sheet2!$G$18","v":-3.642271814099979}]
[{"$f":"A17+Sheet2!G$18","v":{"v":1.0599400599400612,"d":"1.06"}},-2.2287664541095475,{"$f":"(B19-B18)/Sheet2!$G$18","v":-3.616858665809822},null,null,"delta x = ",{"$f":"(Sheet1!D16-Sheet1!D15)/1001","v":3.996003996003996E-3}]
[{"$f":"A18+Sheet2!G$18","v":{"v":1.0639360639360653,"d":"1.06"}},-2.2432194357911053,{"$f":"(B20-B19)/Sheet2!$G$18","v":-3.591349709231669}]
[{"$f":"A19+Sheet2!G$18","v":{"v":1.0679320679320694,"d":"1.07"}},-2.257570483580243,{"$f":"(B21-B20)/Sheet2!$G$18","v":-3.565744944366409}]
[{"$f":"A20+Sheet2!G$18","v":{"v":1.0719280719280735,"d":"1.07"}},-2.271819214626662,{"$f":"(B22-B21)/Sheet2!$G$18","v":-3.5400443712133747}]
[{"$f":"A21+Sheet2!G$18","v":{"v":1.0759240759240776,"d":"1.08"}},-2.285965246080062,{"$f":"(B23-B22)/Sheet2!$G$18","v":-3.5142479897725667}]
[{"$f":"A22+Sheet2!G$18","v":{"v":1.0799200799200817,"d":"1.08"}},-2.3000081950901423,{"$f":"(B24-B23)/Sheet2!$G$18","v":-3.4883558000442068}]
[{"$f":"A23+Sheet2!G$18","v":{"v":1.0839160839160857,"d":"1.08"}},-2.3139476788066027,{"$f":"(B25-B24)/Sheet2!$G$18","v":-3.462367802028295}]
[{"$f":"A24+Sheet2!G$18","v":{"v":1.0879120879120898,"d":"1.09"}},-2.3277833143791433,{"$f":"(B26-B25)/Sheet2!$G$18","v":-3.436283995724387}]
[{"$f":"A25+Sheet2!G$18","v":{"v":1.091908091908094,"d":"1.09"}},-2.3415147189574625,{"$f":"(B27-B26)/Sheet2!$G$18","v":-3.410104381133594}]
[{"$f":"A26+Sheet2!G$18","v":{"v":1.095904095904098,"d":"1.10"}},-2.355141509691263,{"$f":"(B28-B27)/Sheet2!$G$18","v":-3.3838289582545826}]
[{"$f":"A27+Sheet2!G$18","v":{"v":1.099900099900102,"d":"1.10"}},-2.3686633037302425,{"$f":"(B29-B28)/Sheet2!$G$18","v":-3.3574577270880197}]
[{"$f":"A28+Sheet2!G$18","v":{"v":1.1038961038961062,"d":"1.10"}},-2.3820797182241007,{"$f":"(B30-B29)/Sheet2!$G$18","v":-3.330990687634127}]
[{"$f":"A29+Sheet2!G$18","v":{"v":1.1078921078921102,"d":"1.11"}},-2.3953903703225388,{"$f":"(B31-B30)/Sheet2!$G$18","v":-3.3044278398924605}]
[{"$f":"A30+Sheet2!G$18","v":{"v":1.1118881118881143,"d":"1.11"}},-2.408594877175256,{"$f":"(B32-B31)/Sheet2!$G$18","v":-3.2777691838630196}]
[{"$f":"A31+Sheet2!G$18","v":{"v":1.1158841158841184,"d":"1.12"}},-2.4216928559319513,{"$f":"(B33-B32)/Sheet2!$G$18","v":-3.251014719546472}]
[{"$f":"A32+Sheet2!G$18","v":{"v":1.1198801198801225,"d":"1.12"}},-2.434683923742327,{"$f":"(B34-B33)/Sheet2!$G$18","v":-3.2241644469417055}]
[{"$f":"A33+Sheet2!G$18","v":{"v":1.1238761238761266,"d":"1.12"}},-2.44756769775608,{"$f":"(B35-B34)/Sheet2!$G$18","v":-3.1972183660496096}]
[{"$f":"A34+Sheet2!G$18","v":{"v":1.1278721278721306,"d":"1.13"}},-2.4603437951229115,{"$f":"(B36-B35)/Sheet2!$G$18","v":-3.17017647686974}]
[{"$f":"A35+Sheet2!G$18","v":{"v":1.1318681318681347,"d":"1.13"}},-2.473011832992521,{"$f":"(B37-B36)/Sheet2!$G$18","v":-3.1430387794023185}]
[{"$f":"A36+Sheet2!G$18","v":{"v":1.1358641358641388,"d":"1.14"}},-2.485571428514608,{"$f":"(B38-B37)/Sheet2!$G$18","v":-3.1158052736477897}]
[{"$f":"A37+Sheet2!G$18","v":{"v":1.139860139860143,"d":"1.14"}},-2.498022198838875,{"$f":"(B39-B38)/Sheet2!$G$18","v":-3.0884759596043754}]
[{"$f":"A38+Sheet2!G$18","v":{"v":1.143856143856147,"d":"1.14"}},-2.5103637611150162,{"$f":"(B40-B39)/Sheet2!$G$18","v":-3.0610508372751877}]
[{"$f":"A39+Sheet2!G$18","v":{"v":1.147852147852151,"d":"1.15"}},-2.5225957324927393,{"$f":"(B41-B40)/Sheet2!$G$18","v":-3.0335299066566703}]
[{"$f":"A40+Sheet2!G$18","v":{"v":1.1518481518481551,"d":"1.15"}},-2.534717730121737,{"$f":"(B42-B41)/Sheet2!$G$18","v":-3.00591316775149}]
[{"$f":"A41+Sheet2!G$18","v":{"v":1.1558441558441592,"d":"1.16"}},-2.546729371151713,{"$f":"(B43-B42)/Sheet2!$G$18","v":-2.9782006205580913}]
[{"$f":"A42+Sheet2!G$18","v":{"v":1.1598401598401633,"d":"1.16"}},-2.5586302727323647,{"$f":"(B44-B43)/Sheet2!$G$18","v":-2.950392265077585}]
[{"$f":"A43+Sheet2!G$18","v":{"v":1.1638361638361674,"d":"1.16"}},-2.570420052013394,{"$f":"(B45-B44)/Sheet2!$G$18","v":-2.9224881013093054}]
[{"$f":"A44+Sheet2!G$18","v":{"v":1.1678321678321715,"d":"1.17"}},-2.5820983261445,{"$f":"(B46-B45)/Sheet2!$G$18","v":-2.894488129253251}]
[{"$f":"A45+Sheet2!G$18","v":{"v":1.1718281718281756,"d":"1.17"}},-2.593664712275382,{"$f":"(B47-B46)/Sheet2!$G$18","v":-2.8663923489103125}]
[{"$f":"A46+Sheet2!G$18","v":{"v":1.1758241758241796,"d":"1.18"}},-2.605118827555743,{"$f":"(B48-B47)/Sheet2!$G$18","v":-2.8382007602787103}]
[{"$f":"A47+Sheet2!G$18","v":{"v":1.1798201798201837,"d":"1.18"}},-2.6164602891352784,{"$f":"(B49-B48)/Sheet2!$G$18","v":-2.809913363359779}]
[{"$f":"A48+Sheet2!G$18","v":{"v":1.1838161838161878,"d":"1.18"}},-2.627688714163689,{"$f":"(B50-B49)/Sheet2!$G$18","v":-2.781530158153518}]
[{"$f":"A49+Sheet2!G$18","v":{"v":1.1878121878121919,"d":"1.19"}},-2.638803719790676,{"$f":"(B51-B50)/Sheet2!$G$18","v":-2.753051144659483}]
[{"$f":"A50+Sheet2!G$18","v":{"v":1.191808191808196,"d":"1.19"}},-2.649804923165939,{"$f":"(B52-B51)/Sheet2!$G$18","v":-2.7244763228778965}]
[{"$f":"A51+Sheet2!G$18","v":{"v":1.1958041958042,"d":"1.20"}},-2.660691941439177,{"$f":"(B53-B52)/Sheet2!$G$18","v":-2.695805692808758}]
[{"$f":"A52+Sheet2!G$18","v":{"v":1.1998001998002041,"d":"1.20"}},-2.6714643917600913,{"$f":"(B54-B53)/Sheet2!$G$18","v":-2.6670392544518458}]
[{"$f":"A53+Sheet2!G$18","v":{"v":1.2037962037962082,"d":"1.20"}},-2.6821218912783804,{"$f":"(B55-B54)/Sheet2!$G$18","v":-2.6381770078073816}]
[{"$f":"A54+Sheet2!G$18","v":{"v":1.2077922077922123,"d":"1.21"}},-2.6926640571437446,{"$f":"(B56-B55)/Sheet2!$G$18","v":-2.609218952875588}]
[{"$f":"A55+Sheet2!G$18","v":{"v":1.2117882117882164,"d":"1.21"}},-2.703090506505885,{"$f":"(B57-B56)/Sheet2!$G$18","v":-2.580165089655576}]
[{"$f":"A56+Sheet2!G$18","v":{"v":1.2157842157842205,"d":"1.22"}},-2.7134008565144985,{"$f":"(B58-B57)/Sheet2!$G$18","v":-2.5510154181482343}]
[{"$f":"A57+Sheet2!G$18","v":{"v":1.2197802197802246,"d":"1.22"}},-2.7235947243192866,{"$f":"(B59-B58)/Sheet2!$G$18","v":-2.5217699383533407}]
[{"$f":"A58+Sheet2!G$18","v":{"v":1.2237762237762286,"d":"1.22"}},-2.7336717270699493,{"$f":"(B60-B59)/Sheet2!$G$18","v":-2.4924286502708957}]
[{"$f":"A59+Sheet2!G$18","v":{"v":1.2277722277722327,"d":"1.23"}},-2.7436314819161867,{"$f":"(B61-B60)/Sheet2!$G$18","v":-2.4629915539004545}]
[{"$f":"A60+Sheet2!G$18","v":{"v":1.2317682317682368,"d":"1.23"}},-2.753473606007697,{"$f":"(B62-B61)/Sheet2!$G$18","v":-2.433458649242906}]
[{"$f":"A61+Sheet2!G$18","v":{"v":1.2357642357642409,"d":"1.24"}},-2.763197716494182,{"$f":"(B63-B62)/Sheet2!$G$18","v":-2.4038299362978055}]
[{"$f":"A62+Sheet2!G$18","v":{"v":1.239760239760245,"d":"1.24"}},-2.772803430525342,{"$f":"(B64-B63)/Sheet2!$G$18","v":-2.374105415064487}]
[{"$f":"A63+Sheet2!G$18","v":{"v":1.243756243756249,"d":"1.24"}},-2.7822903652508746,{"$f":"(B65-B64)/Sheet2!$G$18","v":-2.3442850855438384}]
[{"$f":"A64+Sheet2!G$18","v":{"v":1.2477522477522531,"d":"1.25"}},-2.7916581378204803,{"$f":"(B66-B65)/Sheet2!$G$18","v":-2.3143689477354163}]
[{"$f":"A65+Sheet2!G$18","v":{"v":1.2517482517482572,"d":"1.25"}},-2.8009063653838586,{"$f":"(B67-B66)/Sheet2!$G$18","v":-2.2843570016396644}]
[{"$f":"A66+Sheet2!G$18","v":{"v":1.2557442557442613,"d":"1.26"}},{"$f":"x^3-7*x+4","v":-2.8100346650907104},{"$f":"(B68-B67)/Sheet2!$G$18","v":-2.254249247256139}]
[{"$f":"A67+Sheet2!G$18","v":{"v":1.2597402597402654,"d":"1.26"}},-2.819042654090735,{"$f":"(B69-B68)/Sheet2!$G$18","v":-2.2240456845852834}]
[{"$f":"A68+Sheet2!G$18","v":{"v":1.2637362637362695,"d":"1.26"}},-2.827929949533633,{"$f":"(B70-B69)/Sheet2!$G$18","v":-2.193746313626432}]
[{"$f":"A69+Sheet2!G$18","v":{"v":1.2677322677322735,"d":"1.27"}},-2.8366961685691034,{"$f":"(B71-B70)/Sheet2!$G$18","v":-2.1633511343798064}]
[{"$f":"A70+Sheet2!G$18","v":{"v":1.2717282717282776,"d":"1.27"}},-2.845340928346845,{"$f":"(B72-B71)/Sheet2!$G$18","v":-2.1328601468467405}]
[{"$f":"A71+Sheet2!G$18","v":{"v":1.2757242757242817,"d":"1.28"}},-2.853863846016562,{"$f":"(B73-B72)/Sheet2!$G$18","v":-2.102273351024567}]
[{"$f":"A72+Sheet2!G$18","v":{"v":1.2797202797202858,"d":"1.28"}},-2.862264538727949,{"$f":"(B74-B73)/Sheet2!$G$18","v":-2.0715907469152866}]
[{"$f":"A73+Sheet2!G$18","v":{"v":1.2837162837162899,"d":"1.28"}},-2.8705426236307074,{"$f":"(B75-B74)/Sheet2!$G$18","v":-2.040812334518454}]
[{"$f":"A74+Sheet2!G$18","v":{"v":1.287712287712294,"d":"1.29"}},-2.8786977178745374,{"$f":"(B76-B75)/Sheet2!$G$18","v":-2.009938113834292}]
[{"$f":"A75+Sheet2!G$18","v":{"v":1.291708291708298,"d":"1.29"}},-2.88672943860914,{"$f":"(B77-B76)/Sheet2!$G$18","v":-1.9789680848619116}]
[{"$f":"A76+Sheet2!G$18","v":{"v":1.2957042957043021,"d":"1.30"}},-2.8946374029842126,{"$f":"(B78-B77)/Sheet2!$G$18","v":-1.9479022476026462}]
[{"$f":"A77+Sheet2!G$18","v":{"v":1.2997002997003062,"d":"1.30"}},-2.902421228149458,{"$f":"(B79-B78)/Sheet2!$G$18","v":-1.9167406020556068}]
[{"$f":"A78+Sheet2!G$18","v":{"v":1.3036963036963103,"d":"1.30"}},-2.910080531254575,{"$f":"(B80-B79)/Sheet2!$G$18","v":-1.8854831482205712}]
[{"$f":"A79+Sheet2!G$18","v":{"v":1.3076923076923144,"d":"1.31"}},-2.917614929449263,{"$f":"(B81-B80)/Sheet2!$G$18","v":-1.8541298860975393}]
{"$rows_left_out":925}
{"sheet":"Sheet3","index":2,"n_rows":1003,"n_cols":2,"rows_kept":1003}
[{"$f":"xMin","v":1},{"$f":"9","v":9}]
[{"$f":"A1+dx","v":1.003996003996004},{"$f":"9","v":9}]
[1.0079920079920082,{"$f":"9","v":9}]
[1.0119880119880122,{"$f":"9","v":9}]
[1.0159840159840163,{"$f":"9","v":9}]
[1.0199800199800204,{"$f":"9","v":9}]
[1.0239760239760245,{"$f":"9","v":9}]
[1.0279720279720286,{"$f":"9","v":9}]
[1.0319680319680327,{"$f":"9","v":9}]
[1.0359640359640367,{"$f":"9","v":9}]
[1.0399600399600408,{"$f":"9","v":9}]
[1.043956043956045,{"$f":"9","v":9}]
[1.047952047952049,{"$f":"9","v":9}]
[1.051948051948053,{"$f":"9","v":9}]
[1.0559440559440572,{"$f":"9","v":9}]
[1.0599400599400612,{"$f":"9","v":9}]
[1.0639360639360653,{"$f":"9","v":9}]
[1.0679320679320694,{"$f":"9","v":9}]
[1.0719280719280735,{"$f":"9","v":9}]
[1.0759240759240776,{"$f":"9","v":9}]
[1.0799200799200817,{"$f":"9","v":9}]
[1.0839160839160857,{"$f":"9","v":9}]
[1.0879120879120898,{"$f":"9","v":9}]
[1.091908091908094,{"$f":"9","v":9}]
[1.095904095904098,{"$f":"9","v":9}]
[1.099900099900102,{"$f":"9","v":9}]
[1.1038961038961062,{"$f":"9","v":9}]
[1.1078921078921102,{"$f":"9","v":9}]
[1.1118881118881143,{"$f":"9","v":9}]
[1.1158841158841184,{"$f":"9","v":9}]
[1.1198801198801225,{"$f":"9","v":9}]
[1.1238761238761266,{"$f":"9","v":9}]
[1.1278721278721306,{"$f":"9","v":9}]
[1.1318681318681347,{"$f":"9","v":9}]
[1.1358641358641388,{"$f":"9","v":9}]
[1.139860139860143,{"$f":"9","v":9}]
[1.143856143856147,{"$f":"9","v":9}]
[1.147852147852151,{"$f":"9","v":9}]
[1.1518481518481551,{"$f":"9","v":9}]
[1.1558441558441592,{"$f":"9","v":9}]
[1.1598401598401633,{"$f":"9","v":9}]
[1.1638361638361674,{"$f":"9","v":9}]
[1.1678321678321715,{"$f":"9","v":9}]
[1.1718281718281756,{"$f":"9","v":9}]
[1.1758241758241796,{"$f":"9","v":9}]
[1.1798201798201837,{"$f":"9","v":9}]
[1.1838161838161878,{"$f":"9","v":9}]
[1.1878121878121919,{"$f":"9","v":9}]
[1.191808191808196,{"$f":"9","v":9}]
[1.1958041958042,{"$f":"9","v":9}]
[1.1998001998002041,{"$f":"9","v":9}]
[1.2037962037962082,{"$f":"9","v":9}]
[1.2077922077922123,{"$f":"9","v":9}]
[1.2117882117882164,{"$f":"9","v":9}]
[1.2157842157842205,{"$f":"9","v":9}]
[1.2197802197802246,{"$f":"9","v":9}]
[1.2237762237762286,{"$f":"9","v":9}]
[1.2277722277722327,{"$f":"9","v":9}]
[1.2317682317682368,{"$f":"9","v":9}]
[1.2357642357642409,{"$f":"9","v":9}]
[1.239760239760245,{"$f":"9","v":9}]
[1.243756243756249,{"$f":"9","v":9}]
[1.2477522477522531,{"$f":"9","v":9}]
[1.2517482517482572,{"$f":"9","v":9}]
[1.2557442557442613,{"$f":"9","v":9}]
[{"$f":"A65+dx","v":1.2597402597402654},{"$f":"9","v":9}]
[1.2637362637362695,{"$f":"9","v":9}]
[1.2677322677322735,{"$f":"9","v":9}]
[1.2717282717282776,{"$f":"9","v":9}]
[1.2757242757242817,{"$f":"9","v":9}]
[1.2797202797202858,{"$f":"9","v":9}]
[1.2837162837162899,{"$f":"9","v":9}]
[1.287712287712294,{"$f":"9","v":9}]
[1.291708291708298,{"$f":"9","v":9}]
[1.2957042957043021,{"$f":"9","v":9}]
[1.2997002997003062,{"$f":"9","v":9}]
[1.3036963036963103,{"$f":"9","v":9}]
[1.3076923076923144,{"$f":"9","v":9}]
[1.3116883116883185,{"$f":"9","v":9}]
[1.3156843156843225,{"$f":"9","v":9}]
{"$rows_left_out":924}
{"sheet":"Defining Function","index":3,"n_rows":12,"n_cols":1,"rows_kept":12}
["                                                     Defining a Function in Excel"]
[]
["Computers have very specific rules you must follow when defining a function.  If you don't, the program will either not work at all or will work incorrectly."]
[]
["1. The Variable used should be the one named in the instruction, usually x, though sometimes y, t, Q (for an angle theta), "]
[" or even x and y (for a function of two variables). "]
[]
["2.  Order of Operations:  There five arithmetic operations, addition (+), subtraction (-), multiplication (*), division (/), and  exponentiation or power (^).  When computers see any of these operation symbols, they perform the indicated steps in a very particular order.  First, the power is done.  Second, products and quotients of adjacent terms is done.  Third, and last, sums and differences of adjacent terms are done.  So, in 10*x^3 + 5*x – 7, say with x = 2, the first pass only calculates 2^3 and ignores the multiplications and the sums and differences to calculate 2^3 = 8.  The second pass looks at 10*8 + 5*2 – 7 and only does the multiplications, so it produces 80 + 10 -  7.  The third pass looks at the +’s and –‘s to produce 80 + 10 – 7 = 83.  "]
[]
["3.    Parentheses  If you need an operation involving more than two adjacent terms, as in Ö4^3 + 6^2, the computer would take the square root of  4 to produce 2^3 + 6^2;  it would then cube the 2 and square the 6 to produce 8 + 36; and finally it would add the 8 and the 36 to get 44.  If you actually wanted the square root of the entire expression, you would need to use parentheses, as in Ö(4^3 + 6^2) to tell the computer to do all the operations inside the parentheses before taking the square root.  Therefore, it would calculate (4^3 + 6^2) = 64 + 36 = 100 and then take the square root of Ö100  =  10."]
[]
["4.  Built-In Functions  Computer programs have built-in functions for most common algebraic functions.  In Excel, the square root function is denoted by SQRT(…), so SQRT(100) = 10.  Alternatively, you could enter it as 100^.5 or 100^(1/2); notice that parentheses are needed to have the ½ done first.  The common trig functions are SIN (…), COS (…), and TAN (…), where the arguments are automatically interpreted as being in radians, not degrees.  The logarithm to the base 10 is represented by LOG (…) and the logarithm with the base e, known as the natural logarithm, is LN (…). The corresponding exponential function with base e is EXP (x).  If x is the variable, then each of these would be SQRT (x), SIN (x), COS (x), TAN (x), LOG (x) (for log with base 10 ), LN (x) (for log with base e ), and EXP (x)."]