{"text_format":"3","workbook":"xlsx","n_sheets":3,"sheets":["Sheet1","Sheet2","Sheet3"],"not_rendered":{"charts":1,"images":3,"macros":1,"defined_names":8,"comments":1},"read":"whole","date_system":"1900"}

{"sheet":"Sheet1","index":0,"n_rows":36,"n_cols":15,"rows_kept":36,"merged":[[29,2,29,3]]}
[null," Going  Around On Circles"]
[null,"         (The Epicycloid)"]
[]
[null,"This graphing utility lets you investigate"]
[null,"   the path traced out by a fixed point"]
[null,"       on a small circle as it rolls around "]
[null,"  the outside rim of a larger, fixed circle."]
[]
[]
["What is the radius R of the larger fixed circle?"]
[null,null,"(R is between 3 and 12)",null,{"$f":"F11","v":12},{"v":12,"d":"12.00"}]
[]
[]
["What is the radius r of the smaller rolling circle?"]
[null,null,"(r is between 1 and 6)",null,{"$f":"F15","v":2},{"v":2,"d":"2.00"}]
[]
[]
[]
[]
[]
[]
["Click each item below for suggestions and investigations",{"$nulls":7},"     Now trace along the epicycloid: q = ",{"$nulls":4},{"$f":"dQ* L23","v":{"v":3.676323676323676,"d":"3.68"}},"radians"]
[null,"   Item 1",{"$nulls":9},23]
[null,"   Item 2",{"$nulls":9},"then:","x =",{"$f":"LOOKUP(N22,Sheet2!C3:C1004,Sheet2!H3:H1004)","v":{"v":-13.694627984376929,"d":"-13.69"}}]
[null,"   Item 3",{"$nulls":10},"y =",{"$f":"LOOKUP(N22,Sheet2!C3:C1004,Sheet2!I3:I1004)","v":{"v":-8.266334886946854,"d":"-8.27"}}]
[]
[]
[]
["To access/download all the DIGMath Apps for Calculus"]
["     Click this link:",null,"DIGMath for Calculus"]
[]
["Created by:  Sheldon P. Gordon   "]
["                      Farmingdale State College    "]
["Development of this module was supported by the "]
["NSF's Division of Undergraduate Education  "]
["under grants DUE-0310123 and DUE-0442160."]

{"sheet":"Sheet2","index":1,"n_rows":1004,"n_cols":9,"rows_kept":1004}
[null,null,"Q","r = f(Q)","r = g(Q)","x1","y1","x2","y2"]
[]
[null,null,{"$f":"Sheet2!A6","v":{"v":0,"d":"0.000"}},{"$f":"r0","v":12},{"$f":"SIN(2*Q)","v":0},{"$f":"D3*COS($C3)","v":12},{"$f":"D3*SIN($C3)","v":0},{"$f":"(r0+r00)*COS($C3)-r00*COS((r0+r00)*$C3/r00)","v":12},{"$f":"(r0+r00)*SIN($C3)-r00*SIN((r0+r00)*$C3/r00)","v":0}]
[null,null,{"$f":"C3+Sheet2!B$12","v":{"v":0.15984015984015984,"d":"0.160"}},{"$f":"D3","v":12},0.31426309266573743,{"$f":"D4*COS(C4)","v":11.847032834542262},{"$f":"D4*SIN(C4)","v":1.9099248721553275},12.948159749481718,0.42902088018180384]
[null,null,{"$f":"C4+Sheet2!B$12","v":{"v":0.3196803196803197,"d":"0.320"}},{"$f":"D4","v":12},0.5966824908793644,11.392031163787077,3.771157111988849,14.527912919744978,2.8282789334134257]
[0,"Qmin",{"$f":"C5+Sheet2!B$12","v":{"v":0.4795204795204795,"d":"0.480"}},12,0.8186411624982322,10.64659504037677,5.53624548283625,14.374958698276185,6.885746990734899]
[160,"Qmax",{"$f":"C6+Sheet2!B$12","v":{"v":0.6393606393606394,"d":"0.639"}},12,0.9576484483104256,9.629729006115987,7.160189890552373,11.703995515374295,10.297711900896308]
[null,null,{"$f":"C7+Sheet2!B$12","v":{"v":0.7992007992007992,"d":"0.799"}},12,0.9996189986858854,8.367357580156584,8.601588639652338,8.217872779319006,11.306377879983744]
[null,null,{"$f":"C8+Sheet2!B$12","v":{"v":0.9590409590409591,"d":"0.959"}},12,0.9403000158467808,6.8916643256292005,9.823693949978786,6.22242810305506,10.627050325047538]
[null,null,{"$f":"C9+Sheet2!B$12","v":{"v":1.118881118881119,"d":"1.119"}},12,0.7857021819534492,5.240271344905533,10.79534882399647,6.070025758668159,10.595049451076644]
[null,null,{"$f":"C10+Sheet2!B$12","v":{"v":1.2787212787212787,"d":"1.279"}},12,0.5514906078647522,3.4552801218719313,11.491781379725108,5.810906693981179,12.494662684981055]
["delta Q = ",{"$f":"(Sheet2!A7-Sheet2!A6)/1001","v":0.15984015984015984},{"$f":"C11+Sheet2!B$12","v":{"v":1.4385614385614385,"d":"1.439"}},12,0.2613975166017401,1.5821981644874603,11.89523639816765,3.4439144783866014,15.080415761769073]
[null,null,{"$f":"C12+Sheet2!B$12","v":{"v":1.5984015984015982,"d":"1.598"}},12,-0.0551824986541568,-0.3312211876326914,11.995427984230625,-0.7704978204496422,15.95744152981715]
[null,null,{"$f":"C13+Sheet2!B$12","v":{"v":1.758241758241758,"d":"1.758"}},12,-0.36617097399570553,-2.2361962120508903,11.789801800760234,-4.5423534119396685,14.266374880611966]
[null,null,{"$f":"C14+Sheet2!B$12","v":{"v":1.9180819180819177,"d":"1.918"}},12,-0.6400560258514006,-4.084160470474963,11.283600190161371,-6.069421392257954,11.648250482663217]
[null,null,{"$f":"C15+Sheet2!B$12","v":{"v":2.0779220779220777,"d":"2.078"}},12,-0.8490853915157718,-5.828000987158521,10.48972852335461,-6.005257943861732,10.402412501088122]
[null,null,{"$f":"C16+Sheet2!B$12","v":{"v":2.2377622377622375,"d":"2.238"}},12,-0.972078514292603,-7.423259371960322,9.428426183441395,-6.662372333202487,10.912603017279492]
[null,null,{"$f":"C17+Sheet2!B$12","v":{"v":2.3976023976023972,"d":"2.398"}},12,-0.9965727298957572,-8.829265265997728,8.12675057219342,-9.34979100014941,11.240630456000172]
[null,null,{"$f":"C18+Sheet2!B$12","v":{"v":2.557442557442557,"d":"2.557"}},12,-0.9200860850328682,-10.010173213232779,6.617887294377031,-12.84603320407247,9.344737012644284]
[null,null,{"$f":"C19+Sheet2!B$12","v":{"v":2.7172827172827168,"d":"2.717"}},12,-0.7503688291144562,-10.93587652343963,4.940304106437371,-14.729208622030928,5.422518599359623]
[null,null,{"$f":"C20+Sheet2!B$12","v":{"v":2.8771228771228765,"d":"2.877"}},12,-0.5046180959015159,-11.58277482804875,3.136770199220886,-14.066894416604434,1.7377265824440846]
[null,null,{"$f":"C21+Sheet2!B$12","v":{"v":3.0369630369630363,"d":"3.037"}},12,-0.20773534993903792,-11.934375760394229,1.2532658176598805,-12.436304630148696,0.12482031091656709]
[null,null,{"$f":"C22+Sheet2!B$12","v":{"v":3.196803196803196,"d":"3.197"}},12,0.1101968325138936,-11.98171542081053,-0.6621899838498763,-12.126180138275888,-0.01870568871898992]
[null,null,{"$f":"C23+Sheet2!B$12","v":{"v":3.356643356643356,"d":"3.357"}},12,0.41696297496385476,-11.723586907019726,-2.5607635645556295,-13.546728646645784,-0.9918385413705351]
[null,null,{"$f":"C24+Sheet2!B$12","v":{"v":3.5164835164835155,"d":"3.516"}},12,0.6814790349750404,-11.166571083534878,-4.394051687948462,-14.765925449205337,-4.1372247901504124]
[null,null,{"$f":"C25+Sheet2!B$12","v":{"v":3.6763236763236753,"d":"3.676"}},12,0.8769420923533457,-10.324868805628249,-6.115315539411249,-13.694627984376929,-8.266334886946854]
[null,null,{"$f":"C26+Sheet2!B$12","v":{"v":3.836163836163835,"d":"3.836"}},12,0.9835462391792862,-9.21993887523496,-7.680672310216804,-10.45849174268536,-10.938443138518432]
[null,null,{"$f":"C27+Sheet2!B$12","v":{"v":3.996003996003995,"d":"3.996"}},12,0.9904894756059885,-7.879950958935285,-9.05021396900509,-7.283971105198064,-11.154027642374173]
[null,null,{"$f":"C28+Sheet2!B$12","v":{"v":4.155844155844155,"d":"4.156"}},12,0.8970682564051374,-6.339067415613226,-10.189024698189256,-6.026136204763897,-10.429585319022456]
[null,null,{"$f":"C29+Sheet2!B$12","v":{"v":4.315684315684314,"d":"4.316"}},12,0.7127487798959216,-4.636572343255855,-11.06807105622994,-6.122597745294253,-11.044259426231516]
[null,null,{"$f":"C30+Sheet2!B$12","v":{"v":4.475524475524474,"d":"4.476"}},12,0.45620779568245495,-2.815870049433886,-11.664942171511232,-5.277573082337629,-13.434810139698184]
[null,null,{"$f":"C31+Sheet2!B$12","v":{"v":4.635364635364634,"d":"4.635"}},12,0.15344012436693416,-0.9233784789853767,-11.96442109692511,-2.1041234375129862,-15.674761090960127]
[null,null,{"$f":"C32+Sheet2!B$12","v":{"v":4.795204795204794,"d":"4.795"}},12,-0.1648753492552085,0.9926541895589778,-11.958872758749088,2.2536604111792844,-15.625260530910865]
[null,null,{"$f":"C33+Sheet2!B$12","v":{"v":4.955044955044953,"d":"4.955"}},12,-0.4664843105095364,2.8833796084939016,-11.648438609243797,5.347633402730736,-13.33494919000316]
[null,null,{"$f":"C34+Sheet2!B$12","v":{"v":5.114885114885113,"d":"5.115"}},12,-0.7208252845351859,4.700594626487166,-11.041033020394423,6.12097597776923,-10.985342304714568]
[null,null,{"$f":"C35+Sheet2!B$12","v":{"v":5.274725274725273,"d":"5.275"}},12,-0.9021263736688843,6.397970205150494,-10.152141510735877,6.0369055698147225,-10.443254957632707]
[null,null,{"$f":"C36+Sheet2!B$12","v":{"v":5.434565434565433,"d":"5.435"}},12,-0.9920166758831733,7.932232555986333,-9.00442594937348,7.370667959981453,-11.177501617659242]
[null,null,{"$f":"C37+Sheet2!B$12","v":{"v":5.594405594405592,"d":"5.594"}},12,-0.981387774107378,9.264266385182037,-7.627146802336125,10.59060500421742,-10.886453675649921]
[null,null,{"$f":"C38+Sheet2!B$12","v":{"v":5.754245754245752,"d":"5.754"}},12,-0.8713166751819736,10.360112119546622,-6.055417150818199,13.780261269362416,-8.128692989320207]
[null,null,{"$f":"C39+Sheet2!B$12","v":{"v":5.914085914085912,"d":"5.914"}},12,-0.672956678759353,11.191831689785973,-4.329307499762803,14.75387771770158,-3.992052421872166]
[null,null,{"$f":"C40+Sheet2!B$12","v":{"v":6.073926073926072,"d":"6.074"}},12,-0.40640723420222596,11.738220798380883,-2.4928241992684654,13.483024120301161,-0.9195165091737691]
[null,null,{"$f":"C41+Sheet2!B$12","v":{"v":6.233766233766231,"d":"6.234"}},12,-0.09867730077735891,11.985349513134894,-0.5927875234830356,12.101389102711632,-0.013435370524356394]
[null,null,{"$f":"C42+Sheet2!B$12","v":{"v":6.393606393606391,"d":"6.394"}},12,0.21905141993321542,11.926917404214818,1.3223619901667127,12.483025727295026,0.14625899820721888]
[null,null,{"$f":"C43+Sheet2!B$12","v":{"v":6.553446553446551,"d":"6.553"}},12,0.5145840678358589,11.564414170632858,3.2037985095923185,14.12290929374636,1.839944618507387]
[null,null,{"$f":"C44+Sheet2!B$12","v":{"v":6.713286713286711,"d":"6.713"}},12,0.7579748695958558,10.907081661074063,5.003555699566247,14.707822734414405,5.57646274233652]
[null,null,{"$f":"C45+Sheet2!B$12","v":{"v":6.87312687312687,"d":"6.873"}},12,0.9245614881313802,9.97167825733017,6.675749600778083,12.73434908696369,9.458226526982141]
[null,null,{"$f":"C46+Sheet2!B$12","v":{"v":7.03296703296703,"d":"7.033"}},12,0.997464011342484,8.782051627272887,8.177748419700476,9.224181903965498,11.260138321440373]
[null,null,{"$f":"C47+Sheet2!B$12","v":{"v":7.19280719280719,"d":"7.193"}},12,0.9692953621968937,7.368530739827694,9.471259406024856,6.6036992493350875,10.881665540562384]
[null,null,{"$f":"C48+Sheet2!B$12","v":{"v":7.35264735264735,"d":"7.353"}},12,0.8429098175010653,5.7671526422392265,10.523305108240145,6.009316195192141,10.41091012347416]
[null,null,{"$f":"C49+Sheet2!B$12","v":{"v":7.5124875124875095,"d":"7.512"}},12,0.6311137893421417,4.018743712576519,11.307064118179692,6.053470157111375,11.729743695445952]
[null,null,{"$f":"C50+Sheet2!B$12","v":{"v":7.672327672327669,"d":"7.672"}},12,0.3553681751791732,2.167878810511489,11.802554870151432,4.440326182255112,14.359194572633918]
[null,null,{"$f":"C51+Sheet2!B$12","v":{"v":7.832167832167829,"d":"7.832"}},12,0.043613765034405914,0.2617448623298193,11.997145061515425,0.6095768430508146,15.973398251705873]
[null,null,{"$f":"C52+Sheet2!B$12","v":{"v":7.992007992007989,"d":"7.992"}},12,-0.2725599467721666,-1.6510621474624703,11.885873707271864,-3.5716848068440106,15.003738168508022]
[null,null,{"$f":"C53+Sheet2!B$12","v":{"v":8.15184815184815,"d":"8.152"}},12,-0.5611156663058522,-3.5217761078061196,11.471577618029961,-5.850043564384122,12.399709634533403]
[null,null,{"$f":"C54+Sheet2!B$12","v":{"v":8.31168831168831,"d":"8.312"}},12,-0.7928145794020681,-5.302704050051777,10.764819076861649,-6.0618606734498615,10.56284236269254]
[null,null,{"$f":"C55+Sheet2!B$12","v":{"v":8.471528471528469,"d":"8.472"}},12,-0.9441790663029983,-6.948442057664488,9.783616558884516,-6.25636407631294,10.654654414445648]
[null,null,{"$f":"C56+Sheet2!B$12","v":{"v":8.631368631368629,"d":"8.631"}},12,-0.9998716451844555,-8.417032817625818,8.552985358751059,-8.328616219640235,11.311208445130177]
[null,null,{"$f":"C57+Sheet2!B$12","v":{"v":8.791208791208788,"d":"8.791"}},12,-0.9542490906517302,-9.671035302307653,7.10429983752932,-11.830595686088966,10.211888612637063]
[null,null,{"$f":"C58+Sheet2!B$12","v":{"v":8.951048951048948,"d":"8.951"}},12,-0.8119342512688762,-10.678479310783533,5.474493548189459,-14.427849186006284,6.734161157285459]
[null,null,{"$f":"C59+Sheet2!B$12","v":{"v":9.110889110889108,"d":"9.111"}},12,-0.5873476249151305,-11.413680533997805,3.7051176321190633,-14.4884662332681,2.702380901615525]
[null,null,{"$f":"C60+Sheet2!B$12","v":{"v":9.270729270729268,"d":"9.271"}},12,-0.30324615656603865,-11.857895364091108,1.84128149240321,-12.888629193221183,0.38581258204072877]
[null,null,{"$f":"C61+Sheet2!B$12","v":{"v":9.430569430569427,"d":"9.431"}},12,0.011582680598635932,-11.999798753827832,-0.06949724909642865,-12.001408502716139,-2.1754444275351448E-5]
[null,null,{"$f":"C62+Sheet2!B$12","v":{"v":9.590409590409587,"d":"9.590"}},12,0.32523786628934737,-11.835772943325168,-1.9785041910625019,-13.008661931306513,-0.47511108864928464]
[null,null,{"$f":"C63+Sheet2!B$12","v":{"v":9.750249750249747,"d":"9.750"}},12,0.605937304136674,-11.369999693132195,-3.8370701033697276,-14.564880727824125,-2.956611668254326]
[null,null,{"$f":"C64+Sheet2!B$12","v":{"v":9.910089910089907,"d":"9.910"}},12,0.8252382423816723,-10.61435367222026,-5.597811726114437,-14.318440721145489,-7.03641483809671]
[null,null,{"$f":"C65+Sheet2!B$12","v":{"v":10.069930069930066,"d":"10.070"}},12,0.96091932499014,-9.588099718907412,-7.215839783440845,-11.576247306663271,-10.380060188689733]
[null,null,{"$f":"C66+Sheet2!B$12","v":{"v":10.229770229770226,"d":"10.230"}},12,{"$f":"SIN(2*Q)","v":0.9992322403138137},-8.317401692906664,-8.64990341442223,{"$f":"(r0+r00)*COS($C67)-r00*COS((r0+r00)*$C67/r00)","v":-8.109339226843508},{"$f":"(r0+r00)*SIN($C67)-r00*SIN((r0+r00)*$C67/r00)","v":-11.299121788778073}]
[null,null,{"$f":"C67+Sheet2!B$12","v":{"v":10.389610389610386,"d":"10.390"}},12,0.9362948119291506,{"$f":"D68*COS(C68)","v":-6.834655440083028},{"$f":"D68*SIN(C68)","v":-9.863441844272387},-6.1912097002540705,-10.600432204820354]
[null,null,{"$f":"C68+Sheet2!B$12","v":{"v":10.549450549450546,"d":"10.549"}},{"$f":"D68","v":12},0.7784843723510269,-5.177662875667758,-10.825516484026611,-6.078057472895175,-10.630119902424019]
[null,null,{"$f":"C69+Sheet2!B$12","v":{"v":10.709290709290705,"d":"10.709"}},12,0.5417915597948695,-3.388668242288044,-11.511599695251242,-5.768709974756854,-12.590665411572898]
[null,null,{"$f":"C70+Sheet2!B$12","v":{"v":10.869130869130865,"d":"10.869"}},12,0.25020001655896684,-1.5132811129584205,-11.90420011059808,-3.3134562320176215,-15.154651594027392]
[null,null,{"$f":"C71+Sheet2!B$12","v":{"v":11.028971028971025,"d":"11.029"}},12,-0.066743828824904,0.40068640343619977,-11.993308567951605,0.9307746933106984,-15.937790003167459]
[null,null,{"$f":"C72+Sheet2!B$12","v":{"v":11.188811188811185,"d":"11.189"}},12,-0.37692464621959626,2.3044386092689715,-11.776653289288536,4.641115904823705,-14.17225312232905]
[null,null,{"$f":"C73+Sheet2!B$12","v":{"v":11.348651348651345,"d":"11.349"}},12,-0.6489123905306059,4.149440241429868,-11.259757798585298,6.083069026668456,-11.5688068739842]
[null,null,{"$f":"C74+Sheet2!B$12","v":{"v":11.508491508491504,"d":"11.508"}},12,-0.8551470496957757,5.888653854929466,-10.455800102183684,6.002276533831656,-10.396520832760524]
[null,null,{"$f":"C75+Sheet2!B$12","v":{"v":11.668331668331664,"d":"11.668"}},12,-0.9747312494285363,7.477739020337339,-9.385276721744777,6.724038388566648,-10.943314888485219]
[null,null,{"$f":"C76+Sheet2!B$12","v":{"v":11.828171828171824,"d":"11.828"}},12,-0.9955477452720576,8.876182762082925,-8.075480145112238,9.476617395660952,-11.217913341519894]
[null,null,{"$f":"C77+Sheet2!B$12","v":{"v":11.988011988011984,"d":"11.988"}},12,-0.9154872404343367,10.0483324176284,-6.559803017228353,12.955407073745581,-9.22832004569744]
[null,null,{"$f":"C78+Sheet2!B$12","v":{"v":12.147852147852143,"d":"12.148"}},12,-0.7426621169075084,10.964304585256922,-4.876886810426711,14.746928167222439,-5.268941776794114]
[null,null,{"$f":"C79+Sheet2!B$12","v":{"v":12.307692307692303,"d":"12.308"}},12,-0.49458442289473276,11.600746987281774,-3.069636678350204,14.009516472424327,-1.638543938873946]
[null,null,{"$f":"C80+Sheet2!B$12","v":{"v":12.467532467532463,"d":"12.468"}},12,-0.19639140954923198,11.941433825333808,-1.1841276093283069,12.391560318463979,-0.10553019146706832]
[null,null,{"$f":"C81+Sheet2!B$12","v":{"v":12.627372627372623,"d":"12.627"}},12,0.12170157991391252,11.977679449425434,0.7315702336834567,12.153546489545603,0.025188887566035767]
[null,null,{"$f":"C82+Sheet2!B$12","v":{"v":12.787212787212782,"d":"12.787"}},12,0.4274627747261344,11.708559794493722,2.628617039198585,13.61018933988599,1.0673399126444285]
[null,null,{"$f":"C83+Sheet2!B$12","v":{"v":12.947052947052942,"d":"12.947"}},12,0.6899099619259238,11.140935939002654,4.45864849512036,14.774679755589126,4.28385070510309]
[null,null,{"$f":"C84+Sheet2!B$12","v":{"v":13.106893106893102,"d":"13.107"}},12,0.8824498563517456,10.289279184989006,6.175008814030306,13.605880975736378,8.401877609259632]
[null,null,{"$f":"C85+Sheet2!B$12","v":{"v":13.266733266733262,"d":"13.267"}},12,0.9855727487471619,9.175302119053512,7.733940200447124,10.326507564539318,10.986882180734678]
[null,null,{"$f":"C86+Sheet2!B$12","v":{"v":13.426573426573421,"d":"13.427"}},12,0.9888293882994142,7.82740506022302,9.09569843515027,7.2001034401538515,11.12922103311858]
[null,null,{"$f":"C87+Sheet2!B$12","v":{"v":13.586413586413581,"d":"13.586"}},12,0.8918897857820779,6.279952007233883,10.22556613527286,6.01736917536201,10.417912247729943]
[null,null,{"$f":"C88+Sheet2!B$12","v":{"v":13.74625374625374,"d":"13.746"}},12,0.7045766507493877,4.572394544618545,11.094737857576561,6.122865979716209,11.105813911850788]
[null,null,{"$f":"C89+Sheet2!B$12","v":{"v":13.9060939060939,"d":"13.906"}},12,0.4458700746535468,2.7482660431957533,11.681054479618574,5.204128496940735,13.534501033662012]
[null,null,{"$f":"C90+Sheet2!B$12","v":{"v":14.06593406593406,"d":"14.066"}},12,0.14198431349282475,0.8540717973477266,11.969568136109807,1.9528629210777613,15.720973139977218]
[null,null,{"$f":"C91+Sheet2!B$12","v":{"v":14.22577422577422,"d":"14.226"}},12,-0.1762884539736845,-1.0618966054899128,11.952923307678711,-2.401358212056671,15.572542383597574]
[null,null,{"$f":"C92+Sheet2!B$12","v":{"v":14.38561438561438,"d":"14.386"}},12,-0.47669824040683434,-2.950792456035721,11.631544346362725,-5.414321114379204,13.235051290712514]
[null,null,{"$f":"C93+Sheet2!B$12","v":{"v":14.54545454545454,"d":"14.545"}},12,-0.728805081099169,-4.76445924693922,11.013624656953557,-6.118123578607816,10.929108586688875]
[null,null,{"$f":"C94+Sheet2!B$12","v":{"v":14.7052947052947,"d":"14.705"}},12,-0.9070634589611823,-6.456658400185518,10.114917810012784,-6.049770195142151,10.458829432266368]
[null,null,{"$f":"C95+Sheet2!B$12","v":{"v":14.86513486513486,"d":"14.865"}},12,-0.9934107842372126,-7.984248097797604,8.958335912032734,-7.4601497233865475,11.199518392677572]
[null,null,{"$f":"C96+Sheet2!B$12","v":{"v":15.024975024975019,"d":"15.025"}},12,-0.9790976431175653,-9.308283162104448,7.5733654721057,-10.72271349759803,10.830898702824674]
[null,null,{"$f":"C97+Sheet2!B$12","v":{"v":15.184815184815179,"d":"15.185"}},12,-0.8655743595604176,-10.39500794464711,5.995315657304748,-13.862706298745346,7.989065610330395]
[null,null,{"$f":"C98+Sheet2!B$12","v":{"v":15.344655344655338,"d":"15.345"}},12,-0.6643440366636543,-11.216716910489216,4.264418102150078,-14.738603799431875,3.8484505683583072]
[null,null,{"$f":"C99+Sheet2!B$12","v":{"v":15.504495504495498,"d":"15.504"}},12,-0.3957969686309913,-11.752460977741418,2.424801222093314,-13.419207928896666,0.8503650692497422]
[null,null,{"$f":"C100+Sheet2!B$12","v":{"v":15.664335664335658,"d":"15.664"}},12,-0.08714453019913058,-11.988581604507324,0.523365180412871,-12.079220946683707,0.009256253020571314]
[null,null,{"$f":"C101+Sheet2!B$12","v":{"v":15.824175824175818,"d":"15.824"}},12,0.23033810133397806,-11.919059006956518,-1.3914138092920778,-12.531632826501092,-0.1699407887617297]
[null,null,{"$f":"C102+Sheet2!B$12","v":{"v":15.984015984015977,"d":"15.984"}},12,0.5244810016331678,-11.545665630869436,-3.270719361265999,-14.1774345731114,-1.9451559550686]
[null,null,{"$f":"C103+Sheet2!B$12","v":{"v":16.143856143856137,"d":"16.144"}},12,0.7654792179025733,-10.877920963969533,-5.066639468289821,-14.682751569672401,-5.730640019912168]
[null,null,{"$f":"C104+Sheet2!B$12","v":{"v":16.3036963036963,"d":"16.304"}},12,0.9289128492964125,{"$f":"D105*COS(C105)","v":-9.932848841080997},{"$f":"D105*SIN(C105)","v":-6.733387995670226},-12.620465956721551,-9.568710760283727]
[null,null,{"$f":"C105+Sheet2!B$12","v":{"v":16.46353646353646,"d":"16.464"}},12,0.9982214700352545,-8.734543429502398,-8.228471977113156,-9.099907850150885,-11.276500656778293]
[null,null,{"$f":"C106+Sheet2!B$12","v":{"v":16.623376623376622,"d":"16.623"}},12,0.9663821665374129,-7.313554959594045,-9.513774952824843,-6.548012771271005,-10.850633740098626]
[null,null,{"$f":"C107+Sheet2!B$12","v":{"v":16.783216783216783,"d":"16.783"}},12,0.8366211561851236,-5.706110861087608,-10.556528730647116,-6.014330343291225,-10.422062794043347]
[null,null,{"$f":"C108+Sheet2!B$12","v":{"v":16.943056943056945,"d":"16.943"}},12,0.6220868807200023,-3.9531921618798043,-11.330148795636008,-6.0351186784203845,-11.813196661561701]
[null,null,{"$f":"C109+Sheet2!B$12","v":{"v":17.102897102897106,"d":"17.103"}},12,0.3445176991057684,-2.0994886960865804,-11.814912069711085,-4.335073573249614,-14.4505836195102]
[null,null,{"$f":"C110+Sheet2!B$12","v":{"v":17.262737262737268,"d":"17.263"}},12,0.03203918006151906,-0.19225975783486784,-11.998459742213468,-0.44814572158984844,-15.985637172053913]
[null,null,{"$f":"C111+Sheet2!B$12","v":{"v":17.42257742257743,"d":"17.423"}},12,-0.2836858094852667,1.7198707521147767,-11.87611235194498,3.6966865830377227,-14.924727234248458]
[null,null,{"$f":"C112+Sheet2!B$12","v":{"v":17.58241758241759,"d":"17.582"}},12,-0.5706654437915721,3.588153969746976,-11.450989087820712,5.886181154887251,-12.305924352140073]
[null,null,{"$f":"C113+Sheet2!B$12","v":{"v":17.742257742257753,"d":"17.742"}},12,-0.7998206104763939,5.364958897049485,-10.733928266621199,6.053692885983118,-10.533494226757643]
[null,null,{"$f":"C114+Sheet2!B$12","v":{"v":17.902097902097914,"d":"17.902"}},12,-0.9479314428728067,7.004986731805504,-9.74321101522639,6.293068484257989,-10.683123844534617]
[null,null,{"$f":"C115+Sheet2!B$12","v":{"v":18.061938061938076,"d":"18.062"}},12,-0.9999901459137146,8.466425739155959,-8.504095201922276,8.44148085633005,-11.313514267274744]
[null,null,{"$f":"C116+Sheet2!B$12","v":{"v":18.221778221778237,"d":"18.222"}},12,-0.950721708082028,9.712017222026889,-7.0481714989813575,11.955917352915467,-10.122626392680077]
[null,null,{"$f":"C117+Sheet2!B$12","v":{"v":18.3816183816184,"d":"18.382"}},12,-0.8051184085128406,10.710005414009448,-5.412557993397236,14.477085149877754,-6.581790464593331]
[null,null,{"$f":"C118+Sheet2!B$12","v":{"v":18.54145854145856,"d":"18.541"}},12,-0.5779339586374591,11.434947077622326,-3.6389538787921794,14.446646149126705,-2.5790004350171563]
[null,null,{"$f":"C119+Sheet2!B$12","v":{"v":18.70129870129872,"d":"18.701"}},12,-0.2921885360552857,11.86836016763134,-1.7725763541754058,12.830188488756557,-0.3454282829482378]
{"$rows_left_out":885}
{"sheet":"Sheet3","index":2,"n_rows":0,"n_cols":0,"rows_kept":0}