{"text_format":"3","workbook":"xlsx","n_sheets":3,"sheets":["Sheet1","Sheet2","Sheet3"],"not_rendered":{"charts":1,"images":3,"macros":1,"defined_names":8,"comments":1},"read":"whole","date_system":"1900"}

{"sheet":"Sheet1","index":0,"n_rows":36,"n_cols":15,"rows_kept":36,"merged":[[29,2,29,3]]}
[null,"    Going Around In Circles"]
[null,"         (The Hypocycloid)"]
[]
[null,"This graphing utility lets you investigate"]
[null,"   the path traced out by a fixed point"]
[null,"       on a small circle as it rolls around "]
[null,"    the inside rim of a larger, fixed circle."]
[]
[]
["What is the radius R of the larger fixed circle?"]
[null,null,"(R is between 3 and 12)",null,{"$f":"F11","v":10},{"v":10,"d":"10.00"}]
[]
[]
["What is the radius r of the smaller rolling circle?"]
[null,null,"(r is between 1 and 6)",null,{"$f":"F15","v":2},{"v":2,"d":"2.00"}]
[]
[]
[]
[]
[]
[]
["Click each item below for suggestions and investigations",{"$nulls":7},"    Now trace along the hypocycloid: q = ",{"$nulls":4},{"$f":"dQ* L23","v":{"v":3.3566433566433567,"d":"3.36"}},"radians"]
[null,"   Item 1",{"$nulls":9},21]
[null,"   Item 2",{"$nulls":9},"then:","x =",{"$f":"LOOKUP(N22,Sheet2!C3:C1004,Sheet2!H3:H1004)","v":{"v":-6.51115709464265,"d":"-6.51"}}]
[null,"   Item 3",{"$nulls":10},"y =",{"$f":"LOOKUP(N22,Sheet2!C3:C1004,Sheet2!I3:I1004)","v":{"v":-3.223125448895467,"d":"-3.22"}}]
[]
[]
[]
["To access/download all the DIGMath Apps for Calculus"]
["     Click this link:",null,"DIGMath for Calculus"]
[]
["Created by:  Sheldon P. Gordon   "]
["                      Farmingdale State College    "]
["Development of this module was supported by the "]
["NSF's Division of Undergraduate Education  "]
["under grants DUE-0310123 and DUE-0442160."]

{"sheet":"Sheet2","index":1,"n_rows":1004,"n_cols":9,"rows_kept":1004}
[null,null,"Q","r = f(Q)","r = g(Q)","x1","y1","x2","y2"]
[]
[null,null,{"$f":"Sheet2!A6","v":{"v":0,"d":"0.000"}},{"$f":"r0","v":10},{"$f":"SIN(2*Q)","v":0},{"$f":"D3*COS($C3)","v":10},{"$f":"D3*SIN($C3)","v":0},{"$f":"(r0-r00)*COS($C3)+r00*COS((r0-r00)*$C3/r00)","v":10},{"$f":"(r0-r00)*SIN($C3)-r00*SIN((r0-r00)*$C3/r00)","v":0}]
[null,null,{"$f":"C3+Sheet2!B$12","v":{"v":0.15984015984015984,"d":"0.160"}},{"$f":"D3","v":10},0.31426309266573743,{"$f":"D4*COS(C4)","v":9.872527362118552},{"$f":"D4*SIN(C4)","v":1.5916040601294394},9.502976724047507,0.0799182663448228]
[null,null,{"$f":"C4+Sheet2!B$12","v":{"v":0.3196803196803197,"d":"0.320"}},{"$f":"D4","v":10},0.5966824908793644,9.493359303155897,3.1426309266573744,8.170567462836706,0.5988078447050482]
[0,"Qmin",{"$f":"C5+Sheet2!B$12","v":{"v":0.4795204795204795,"d":"0.480"}},10,0.8186411624982322,8.872162533647307,4.613537902363542,6.417036615172019,1.810230290197272]
[160,"Qmax",{"$f":"C6+Sheet2!B$12","v":{"v":0.6393606393606394,"d":"0.639"}},10,0.9576484483104256,8.024774171763323,5.966824908793644,4.751457135205195,3.670478711305411]
[null,null,{"$f":"C7+Sheet2!B$12","v":{"v":0.7992007992007992,"d":"0.799"}},10,0.9996189986858854,6.97279798346382,7.167990533043616,3.581285816635967,5.844757423743207]
[null,null,{"$f":"C8+Sheet2!B$12","v":{"v":0.9590409590409591,"d":"0.959"}},10,0.9403000158467808,5.743053604691001,8.186411624982322,3.057786404546976,7.82924135168866]
[null,null,{"$f":"C9+Sheet2!B$12","v":{"v":1.118881118881119,"d":"1.119"}},10,0.7857021819534492,4.3668927874212775,8.996124019997058,3.024202555031378,9.141056244582852]
[null,null,{"$f":"C10+Sheet2!B$12","v":{"v":1.2787212787212787,"d":"1.279"}},10,0.5514906078647522,2.879400101559943,9.576484483104256,3.0869525189958185,9.50135975654914]
["delta Q = ",{"$f":"(Sheet2!A7-Sheet2!A6)/1001","v":0.15984015984015984},{"$f":"C11+Sheet2!B$12","v":{"v":1.4385614385614385,"d":"1.439"}},10,0.2613975166017401,1.318498470406217,9.912696998473043,2.7814841295827457,8.939393790581464]
[null,null,{"$f":"C12+Sheet2!B$12","v":{"v":1.5984015984015982,"d":"1.598"}},10,-0.0551824986541568,-0.2760176563605762,9.996189986858855,1.767005442280675,7.776558324459295]
[null,null,{"$f":"C13+Sheet2!B$12","v":{"v":1.758241758241758,"d":"1.758"}},10,-0.36617097399570553,-1.8634968433757417,9.824834833966861,-0.02712220348844796,6.496909797223407]
[null,null,{"$f":"C14+Sheet2!B$12","v":{"v":1.9180819180819177,"d":"1.918"}},10,-0.6400560258514006,-3.4034670587291354,9.403000158467808,-2.3614605118980636,5.555307648415675]
[null,null,{"$f":"C15+Sheet2!B$12","v":{"v":2.0779220779220777,"d":"2.078"}},10,-0.8490853915157718,-4.8566674892987685,8.741440436128842,-4.769117999780981,5.1990158360928005]
[null,null,{"$f":"C16+Sheet2!B$12","v":{"v":2.2377622377622375,"d":"2.238"}},10,-0.972078514292603,-6.186049476633602,7.857021819534495,-6.728586133104138,5.37320186426269]
[null,null,{"$f":"C17+Sheet2!B$12","v":{"v":2.3976023976023972,"d":"2.398"}},10,-0.9965727298957572,-7.357721054998106,6.772292143494516,-7.8588056678860125,5.747584413306034]
[null,null,{"$f":"C18+Sheet2!B$12","v":{"v":2.557442557442557,"d":"2.557"}},10,-0.9200860850328682,-8.341811011027316,5.514906078647526,-8.059682424306294,5.853575431988395]
[null,null,{"$f":"C19+Sheet2!B$12","v":{"v":2.7172827172827168,"d":"2.717"}},10,-0.7503688291144562,-9.113230436199691,4.1169200886978095,-7.542797867786153,5.277569422724595]
[null,null,{"$f":"C20+Sheet2!B$12","v":{"v":2.8771228771228765,"d":"2.877"}},10,-0.5046180959015159,-9.652312356707291,2.613975166017405,-6.74040757621092,3.8338134831778694]
[null,null,{"$f":"C21+Sheet2!B$12","v":{"v":3.0369630369630363,"d":"3.037"}},10,-0.20773534993903792,-9.945313133661857,1.0443881813832336,-6.128866409386664,1.6483250135110357]
[null,null,{"$f":"C22+Sheet2!B$12","v":{"v":3.196803196803196,"d":"3.197"}},10,0.1101968325138936,-9.984762850675443,-0.5518249865415635,-6.036383648124735,-0.8795628290996851]
[null,null,{"$f":"C23+Sheet2!B$12","v":{"v":3.356643356643356,"d":"3.357"}},10,0.41696297496385476,-9.769655755849772,-2.1339696371296912,-6.51115709464265,-3.223125448895467]
[null,null,{"$f":"C24+Sheet2!B$12","v":{"v":3.5164835164835155,"d":"3.516"}},10,0.6814790349750404,-9.305475902945732,-3.6617097399570513,-7.302035422798634,-4.924295814650609]
[null,null,{"$f":"C25+Sheet2!B$12","v":{"v":3.6763236763236753,"d":"3.676"}},10,0.8769420923533457,-8.60405733802354,-5.096096282842707,-7.959355603783088,-5.762696661276294]
[null,null,{"$f":"C26+Sheet2!B$12","v":{"v":3.836163836163835,"d":"3.836"}},10,0.9835462391792862,-7.683282396029131,-6.400560258514004,-8.016078735238176,-5.8311845571695455]
[null,null,{"$f":"C27+Sheet2!B$12","v":{"v":3.996003996003995,"d":"3.996"}},10,0.9904894756059885,-6.566625799112737,-7.5418449741709095,-7.177578244435095,-5.4883560857923905]
[null,null,{"$f":"C28+Sheet2!B$12","v":{"v":4.155844155844155,"d":"4.156"}},10,0.8970682564051374,-5.282556179677687,-8.490853915157713,-5.444970770341163,-5.207053973322035]
[null,null,{"$f":"C29+Sheet2!B$12","v":{"v":4.315684315684314,"d":"4.316"}},10,0.7127487798959216,-3.8638102860465455,-9.223392546858282,-3.123091521809736,-5.378970747117715]
[null,null,{"$f":"C30+Sheet2!B$12","v":{"v":4.475524475524474,"d":"4.476"}},10,0.45620779568245495,-2.3465583745282386,-9.720785142926028,-0.709748910988369,-6.152759611803069]
[null,null,{"$f":"C31+Sheet2!B$12","v":{"v":4.635364635364634,"d":"4.635"}},10,0.15344012436693416,-0.7694820658211472,-9.970350914104259,1.2902388602801214,-7.369788418151329]
[null,null,{"$f":"C32+Sheet2!B$12","v":{"v":4.795204795204794,"d":"4.795"}},10,-0.1648753492552085,0.8272118246324816,-9.965727298957573,2.553033936537877,-8.623057571744752]
[null,null,{"$f":"C33+Sheet2!B$12","v":{"v":4.955044955044953,"d":"4.955"}},10,-0.4664843105095364,2.4028163404115848,-9.70703217436983,3.0518226245230373,-9.416102224259209]
[null,null,{"$f":"C34+Sheet2!B$12","v":{"v":5.114885114885113,"d":"5.115"}},10,-0.7208252845351859,3.917162188739305,-9.200860850328684,3.055373387690517,-9.359153160890575]
[null,null,{"$f":"C35+Sheet2!B$12","v":{"v":5.274725274725273,"d":"5.275"}},10,-0.9021263736688843,5.331641837625412,-8.46011792561323,3.0099854938244435,-8.325063085192639]
[null,null,{"$f":"C36+Sheet2!B$12","v":{"v":5.434565434565433,"d":"5.435"}},10,-0.9920166758831733,6.610193796655278,-7.503688291144568,3.3517666964030193,-6.5033506660335885]
[null,null,{"$f":"C37+Sheet2!B$12","v":{"v":5.594405594405592,"d":"5.594"}},10,-0.981387774107378,7.720221987651696,-6.355955668613438,4.323689737451621,-4.330915242451558]
[null,null,{"$f":"C38+Sheet2!B$12","v":{"v":5.754245754245752,"d":"5.754"}},10,-0.8713166751819736,8.633426766288853,-5.0461809590151665,5.869970419230405,-2.326650667820582]
[null,null,{"$f":"C39+Sheet2!B$12","v":{"v":5.914085914085912,"d":"5.914"}},10,-0.672956678759353,9.326526408154978,-3.607756249802336,7.6497383605767055,-0.8951095092977535]
[null,null,{"$f":"C40+Sheet2!B$12","v":{"v":6.073926073926072,"d":"6.074"}},10,-0.40640723420222596,9.781850665317402,-2.0773534993903877,9.16481317220631,-0.17655856569729345]
[null,null,{"$f":"C41+Sheet2!B$12","v":{"v":6.233766233766231,"d":"6.234"}},10,-0.09867730077735891,9.987791260945745,-0.49398960290252975,9.951284170001776,-2.4088632235598206E-3]
[null,null,{"$f":"C42+Sheet2!B$12","v":{"v":6.393606393606391,"d":"6.394"}},10,0.21905141993321542,9.939097836845681,1.1019683251389272,9.759344171177514,0.026649110658872988]
[null,null,{"$f":"C43+Sheet2!B$12","v":{"v":6.553446553446551,"d":"6.553"}},10,0.5145840678358589,9.637011808860715,2.6698320913269318,8.650422395606572,0.3709659603580544]
[null,null,{"$f":"C44+Sheet2!B$12","v":{"v":6.713286713286711,"d":"6.713"}},10,0.7579748695958558,9.089234717561718,4.169629749638539,6.9732841622939565,1.358045023112003]
[null,null,{"$f":"C45+Sheet2!B$12","v":{"v":6.87312687312687,"d":"6.873"}},10,0.9245614881313802,8.309731881108476,5.563124667315069,5.228529723543931,3.04134643235328]
[null,null,{"$f":"C46+Sheet2!B$12","v":{"v":7.03296703296703,"d":"7.033"}},10,0.997464011342484,7.31837635606074,6.814790349750397,3.8749632691548355,5.167863652814668]
[null,null,{"$f":"C47+Sheet2!B$12","v":{"v":7.19280719280719,"d":"7.193"}},10,0.9692953621968937,6.140442283189746,7.892716171687381,3.1542198298461663,7.267569418163573]
[null,null,{"$f":"C48+Sheet2!B$12","v":{"v":7.35264735264735,"d":"7.353"}},10,0.8429098175010653,4.805960535199356,8.769420923533453,3.002780586400768,8.829663656749126]
[null,null,{"$f":"C49+Sheet2!B$12","v":{"v":7.5124875124875095,"d":"7.512"}},10,0.6311137893421417,3.3489530938137664,9.422553431816409,3.085944014659824,9.496238031688257]
[null,null,{"$f":"C50+Sheet2!B$12","v":{"v":7.672327672327669,"d":"7.672"}},10,0.3553681751791732,1.8065656754262407,9.835462391792861,2.9401063806202905,9.197057986761598]
[null,null,{"$f":"C51+Sheet2!B$12","v":{"v":7.832167832167829,"d":"7.832"}},10,0.043613765034405914,0.21812071860818272,9.997620884596188,2.1668879328846407,8.17238576807521]
[null,null,{"$f":"C52+Sheet2!B$12","v":{"v":7.992007992007989,"d":"7.992"}},10,-0.2725599467721666,-1.3758851228853919,9.904894756059887,0.6021362033539013,6.874953801581574]
[null,null,{"$f":"C53+Sheet2!B$12","v":{"v":8.15184815184815,"d":"8.152"}},10,-0.5611156663058522,-2.9348134231717666,9.559648015024969,-1.6072539024328552,5.78989271342715]
[null,null,{"$f":"C54+Sheet2!B$12","v":{"v":8.31168831168831,"d":"8.312"}},10,-0.7928145794020681,-4.418920041709814,8.970682564051375,-4.049355862617764,5.24378171816627]
[null,null,{"$f":"C55+Sheet2!B$12","v":{"v":8.471528471528469,"d":"8.472"}},10,-0.9441790663029983,-5.790368381387073,8.153013799070429,-6.198191142088866,5.2782372778163165]
[null,null,{"$f":"C56+Sheet2!B$12","v":{"v":8.631368631368629,"d":"8.631"}},10,-0.9998716451844555,-7.014194014688182,7.127487798959216,-7.610328439126024,5.6379118790442915]
[null,null,{"$f":"C57+Sheet2!B$12","v":{"v":8.791208791208788,"d":"8.791"}},10,-0.9542490906517302,-8.059196085256378,5.920249864607766,-8.089722176243718,5.877530779269311]
[null,null,{"$f":"C58+Sheet2!B$12","v":{"v":8.951048951048948,"d":"8.951"}},10,-0.8119342512688762,-8.898732758986279,4.56207795682455,-7.755935120723225,5.54552525120523]
[null,null,{"$f":"C59+Sheet2!B$12","v":{"v":9.110889110889108,"d":"9.111"}},10,-0.5873476249151305,-9.511400444998172,3.087598026765886,-6.989029285972316,4.3715218375767915]
[null,null,{"$f":"C60+Sheet2!B$12","v":{"v":9.270729270729268,"d":"9.271"}},10,-0.30324615656603865,-9.881579470075923,1.5344012436693415,-6.273096501949037,2.3833889122104726]
[null,null,{"$f":"C61+Sheet2!B$12","v":{"v":9.430569430569427,"d":"9.431"}},10,0.011582680598635932,-9.999832294856528,-0.05791437424702388,-6.000402469844622,-0.09265911385804534]
[null,null,{"$f":"C62+Sheet2!B$12","v":{"v":9.590409590409587,"d":"9.590"}},10,0.32523786628934737,-9.86314411943764,-1.648753492552085,-6.313633974223902,-2.5492244401089548]
[null,null,{"$f":"C63+Sheet2!B$12","v":{"v":9.750249750249747,"d":"9.750"}},10,0.605937304136674,-9.474999744276829,-3.197558419474773,-7.048639861599145,-4.486169299300377]
[null,null,{"$f":"C64+Sheet2!B$12","v":{"v":9.910089910089907,"d":"9.910"}},10,0.8252382423816723,-8.845294726850216,-4.664843105095365,-7.80030840823694,-5.596202467876769]
[null,null,{"$f":"C65+Sheet2!B$12","v":{"v":10.069930069930066,"d":"10.070"}},10,0.96091932499014,-7.99008309908951,-6.013199819534037,-8.085530275829633,-5.874599502326205]
[null,null,{"$f":"C66+Sheet2!B$12","v":{"v":10.229770229770226,"d":"10.230"}},10,{"$f":"SIN(2*Q)","v":0.9992322403138137},-6.931168077422219,-7.2082528453518595,{"$f":"(r0-r00)*COS($C67)+r00*COS((r0-r00)*$C67/r00)","v":-7.538794742268029},{"$f":"(r0-r00)*SIN($C67)-r00*SIN((r0-r00)*$C67/r00)","v":-5.610009867393431}]
[null,null,{"$f":"C67+Sheet2!B$12","v":{"v":10.389610389610386,"d":"10.390"}},10,0.9362948119291506,{"$f":"D68*COS(C68)","v":-5.69554620006919},{"$f":"D68*SIN(C68)","v":-8.219534870226989},-6.063028859437127,-5.260264505814801]
[null,null,{"$f":"C68+Sheet2!B$12","v":{"v":10.549450549450546,"d":"10.549"}},{"$f":"D68","v":10},0.7784843723510269,-4.314719063056465,-9.021263736688843,-3.8759269224242607,-5.262504565939439]
[null,null,{"$f":"C69+Sheet2!B$12","v":{"v":10.709290709290705,"d":"10.709"}},10,0.5417915597948695,-2.823890201906703,-9.5929997460427,-1.433264538585193,-5.85286865417311]
[null,null,{"$f":"C70+Sheet2!B$12","v":{"v":10.869130869130865,"d":"10.869"}},10,0.25020001655896684,-1.261067594132017,-9.920166758831733,0.7407457315499573,-6.967164617139236]
[null,null,{"$f":"C71+Sheet2!B$12","v":{"v":11.028971028971025,"d":"11.029"}},10,-0.066743828824904,0.3339053361968331,-9.994423806626337,2.2493053142126342,-8.261919044233291]
[null,null,{"$f":"C72+Sheet2!B$12","v":{"v":11.188811188811185,"d":"11.189"}},10,-0.37692464621959626,1.9203655077241426,-9.81387774107378,2.968003650468243,-9.247598849846304]
[null,null,{"$f":"C73+Sheet2!B$12","v":{"v":11.348651348651345,"d":"11.349"}},10,-0.6489123905306059,3.4578668678582236,-9.383131498821081,3.0819443319499964,-9.481439260913712]
[null,null,{"$f":"C74+Sheet2!B$12","v":{"v":11.508491508491504,"d":"11.508"}},10,-0.8551470496957757,4.907211545774555,-8.713166751819736,3.0006633302060854,-8.7437167145734]
[null,null,{"$f":"C75+Sheet2!B$12","v":{"v":11.668331668331664,"d":"11.668"}},10,-0.9747312494285363,6.231449183614449,-7.821063934787313,3.1847553124414976,-7.127796216554589]
[null,null,{"$f":"C76+Sheet2!B$12","v":{"v":11.828171828171824,"d":"11.828"}},10,-0.9955477452720576,7.396818968402438,-6.72956678759353,3.9529939222568395,-5.008297615462596]
[null,null,{"$f":"C77+Sheet2!B$12","v":{"v":11.988011988011984,"d":"11.988"}},10,-0.9154872404343367,8.373610348023666,-5.46650251435696,5.346420728826626,-2.899827813496551]
[null,null,{"$f":"C78+Sheet2!B$12","v":{"v":12.147852147852143,"d":"12.148"}},10,-0.7426621169075084,9.136920487714102,-4.06407234202226,7.103348310613115,-1.2619146463570832]
[null,null,{"$f":"C79+Sheet2!B$12","v":{"v":12.307692307692303,"d":"12.308"}},10,-0.49458442289473276,9.667289156068144,-2.558030565291837,8.75537631937405,-0.32699262044365396]
[null,null,{"$f":"C80+Sheet2!B$12","v":{"v":12.467532467532463,"d":"12.468"}},10,-0.19639140954923198,9.95119485444484,-0.9867730077735891,9.806677540576935,-0.019151202708673654]
[null,null,{"$f":"C81+Sheet2!B$12","v":{"v":12.627372627372623,"d":"12.627"}},10,0.12170157991391252,9.98139954118786,0.6096418614028807,9.925874534736119,0.004525729349488694]
[null,null,{"$f":"C82+Sheet2!B$12","v":{"v":12.787212787212782,"d":"12.787"}},10,0.4274627747261344,9.757133162078102,2.190514199332154,9.074808834556217,0.2066496250081109]
[null,null,{"$f":"C83+Sheet2!B$12","v":{"v":12.947052947052942,"d":"12.947"}},10,0.6899099619259238,9.284113282502211,3.7155404126003,7.5233876037432506,0.9747423213779505]
[null,null,{"$f":"C84+Sheet2!B$12","v":{"v":13.106893106893102,"d":"13.107"}},10,0.8824498563517456,8.574399320824172,5.145840678358589,5.744648460758472,2.456232040139727]
[null,null,{"$f":"C85+Sheet2!B$12","v":{"v":13.266733266733262,"d":"13.267"}},10,0.9855727487471619,7.646085099211261,6.444950167039271,4.231453507076863,4.488718130615698]
[null,null,{"$f":"C86+Sheet2!B$12","v":{"v":13.426573426573421,"d":"13.427"}},10,0.9888293882994142,6.522837550185851,7.579748695958558,3.307135803490305,6.653346180890759]
[null,null,{"$f":"C87+Sheet2!B$12","v":{"v":13.586413586413581,"d":"13.586"}},10,0.8918897857820779,5.233293339361569,8.521305112727383,3.004765111559651,8.430482760634492]
[null,null,{"$f":"C88+Sheet2!B$12","v":{"v":13.74625374625374,"d":"13.746"}},10,0.7045766507493877,3.8103287871821205,9.245614881313802,3.0625500026207977,9.396440875001542]
[null,null,{"$f":"C89+Sheet2!B$12","v":{"v":13.9060939060939,"d":"13.906"}},10,0.4458700746535468,2.2902217026631275,9.734212066348812,3.036976868244265,9.383758750407152]
[null,null,{"$f":"C90+Sheet2!B$12","v":{"v":14.06593406593406,"d":"14.066"}},10,0.14198431349282475,0.7117264977897722,9.97464011342484,2.488743017119703,8.541895520053997]
[null,null,{"$f":"C91+Sheet2!B$12","v":{"v":14.22577422577422,"d":"14.226"}},10,-0.1762884539736845,-0.8849138379082606,9.960769423065592,1.1677584536556638,7.274505453795037]
[null,null,{"$f":"C92+Sheet2!B$12","v":{"v":14.38561438561438,"d":"14.386"}},10,-0.47669824040683434,-2.458993713363101,9.692953621968938,-0.8761598203183689,6.0781641323171325]
[null,null,{"$f":"C93+Sheet2!B$12","v":{"v":14.54545454545454,"d":"14.545"}},10,-0.728805081099169,-3.970382705782683,9.178020547461298,-3.3009335495700114,5.346303210989653]
[null,null,{"$f":"C94+Sheet2!B$12","v":{"v":14.7052947052947,"d":"14.705"}},10,-0.9070634589611823,-5.380548666821264,8.429098175010653,-5.59549540778751,5.215805731710678]
[null,null,{"$f":"C95+Sheet2!B$12","v":{"v":14.86513486513486,"d":"14.865"}},10,-0.9934107842372126,-6.653540081498003,7.465279926693945,-7.270292010153578,5.516812300314674]
[null,null,{"$f":"C96+Sheet2!B$12","v":{"v":15.024975024975019,"d":"15.025"}},10,-0.9790976431175653,-7.756902635087041,6.311137893421417,-8.040050887103117,5.845468008126576]
[null,null,{"$f":"C97+Sheet2!B$12","v":{"v":15.184815184815179,"d":"15.185"}},10,-0.8655743595604176,-8.662506620539258,4.99609638108729,-7.926881184145115,5.730727866756508]
[null,null,{"$f":"C98+Sheet2!B$12","v":{"v":15.344655344655338,"d":"15.345"}},10,-0.6643440366636543,-9.347264092074347,3.553681751791732,-7.243223269861712,4.829139870380014]
[null,null,{"$f":"C99+Sheet2!B$12","v":{"v":15.504495504495498,"d":"15.504"}},10,-0.3957969686309913,-9.793717481451182,2.0206676850777616,-6.461594946670873,3.070435801075949]
[null,null,{"$f":"C100+Sheet2!B$12","v":{"v":15.664335664335658,"d":"15.664"}},10,-0.08714453019913058,-9.99048467042277,0.43613765034405916,-6.022764412912725,0.6961621380063507]
[null,null,{"$f":"C101+Sheet2!B$12","v":{"v":15.824175824175818,"d":"15.824"}},10,0.23033810133397806,-9.932549172463766,-1.1595115077433982,-6.15826190167558,-1.8241870546122063]
[null,null,{"$f":"C102+Sheet2!B$12","v":{"v":15.984015984015977,"d":"15.984"}},10,0.5244810016331678,-9.62138802572453,-2.725599467721666,-6.797431704876148,-3.966698544099594]
[null,null,{"$f":"C103+Sheet2!B$12","v":{"v":16.143856143856137,"d":"16.144"}},10,0.7654792179025733,-9.064934136641277,-4.222199556908183,-7.595781041475964,-5.34798256809823]
[null,null,{"$f":"C104+Sheet2!B$12","v":{"v":16.3036963036963,"d":"16.304"}},10,0.9289128492964125,{"$f":"D105*COS(C105)","v":-8.277374034234164},{"$f":"D105*SIN(C105)","v":-5.611156663058522},-8.073415553739249,-5.864825164858404]
[null,null,{"$f":"C105+Sheet2!B$12","v":{"v":16.46353646353646,"d":"16.464"}},10,0.9982214700352545,-7.2787861912519976,-6.85705998092763,-7.808813365958976,-5.723682152994317]
[null,null,{"$f":"C106+Sheet2!B$12","v":{"v":16.623376623376622,"d":"16.623"}},10,0.9663821665374129,-6.0946291329950375,-7.928145794020702,-6.611281273602207,-5.348650889882477]
[null,null,{"$f":"C107+Sheet2!B$12","v":{"v":16.783216783216783,"d":"16.783"}},10,0.8366211561851236,-4.755092384239673,-8.797107275539265,-4.603813743297871,-5.204542019507754]
[null,null,{"$f":"C108+Sheet2!B$12","v":{"v":16.943056943056945,"d":"16.943"}},10,0.6220868807200023,-3.2943268015665033,-9.441790663030007,-2.1834297899089723,-5.605185270402062]
[null,null,{"$f":"C109+Sheet2!B$12","v":{"v":17.102897102897106,"d":"17.103"}},10,0.3445176991057684,-1.7495739134054835,-9.845760058092571,0.12557108928708205,-6.582902988911179]
[null,null,{"$f":"C110+Sheet2!B$12","v":{"v":17.262737262737268,"d":"17.263"}},10,0.03203918006151906,-0.16021646486238988,-9.998716451844556,1.8677207918740304,-7.870882235135568]
[null,null,{"$f":"C111+Sheet2!B$12","v":{"v":17.42257742257743,"d":"17.423"}},10,-0.2836858094852667,1.4332256267623138,-9.896760293287484,2.824669947396607,-9.005533140726646]
[null,null,{"$f":"C112+Sheet2!B$12","v":{"v":17.58241758241759,"d":"17.582"}},10,-0.5706654437915721,2.99012830812248,-9.54249090651726,3.0894664515466563,-9.508474979973249]
[null,null,{"$f":"C113+Sheet2!B$12","v":{"v":17.742257742257753,"d":"17.742"}},10,-0.7998206104763939,4.4707990808745715,-8.944940222184332,3.017787228928331,-9.07628662833524]
[null,null,{"$f":"C114+Sheet2!B$12","v":{"v":17.902097902097914,"d":"17.902"}},10,-0.9479314428728067,5.837488943171253,-8.119342512688657,3.0756950729893173,-7.7030418154362845]
[null,null,{"$f":"C115+Sheet2!B$12","v":{"v":18.061938061938076,"d":"18.062"}},10,-0.9999901459137146,7.055354782629966,-7.086746001601897,3.6443626584058437,-5.687154137595107]
[null,null,{"$f":"C116+Sheet2!B$12","v":{"v":18.221778221778237,"d":"18.222"}},10,-0.950721708082028,8.093347685022408,-5.873476249151132,4.859191083144291,-3.5197129167972685]
[null,null,{"$f":"C117+Sheet2!B$12","v":{"v":18.3816183816184,"d":"18.382"}},10,-0.8051184085128406,8.925004511674539,-4.510464994497697,6.547141002434635,-1.6982636402073408]
[null,null,{"$f":"C118+Sheet2!B$12","v":{"v":18.54145854145856,"d":"18.541"}},10,-0.5779339586374591,9.52912256468527,-3.0324615656601495,8.287267409562759,-0.5393996959298628]
[null,null,{"$f":"C119+Sheet2!B$12","v":{"v":18.70129870129872,"d":"18.701"}},10,-0.2921885360552857,9.890300139692783,-1.4771469618128383,9.570743549345703,-0.06396699463616784]
{"$rows_left_out":885}
{"sheet":"Sheet3","index":2,"n_rows":0,"n_cols":0,"rows_kept":0}