{"text_format":"3","workbook":"xlsx","n_sheets":4,"sheets":["Sheet1","Sheet2","Defining Function","Sheet3"],"not_rendered":{"charts":3,"images":1,"macros":1,"defined_names":5,"comments":1},"read":"whole","date_system":"1900"}

{"sheet":"Sheet1","index":0,"n_rows":49,"n_cols":16,"rows_kept":49,"merged":[[42,2,42,3]]}
[null,"   The Indeterminate Form 0/0 "]
[null,"   and Taylor Approximations"]
[]
[null,"      This DIGMath spreadsheet provides a "]
[null,"  graphical representation for finding the limit"]
[null,"            of the indeterminate form 0/0"]
[null,null,"       lim x → a f(x) / g(x)"]
[null,"     where  lim x → a f(x) =  lim x → a g(x) = 0"]
[null,"   using the associated Taylor approximations. "]
[]
[]
["Enter the numerator function:   f(x) =  ",{"$nulls":3},"sin(1*x)"]
[null,null,{"$f":"IF(Sheet2!D2=0,\"\",\"That is not zero at the point a\")","v":""}]
[" and the denominator function:  g(x) = ",{"$nulls":3},"4*x"]
[null,null,{"$f":"IF(Sheet2!E2=0,\"\",\"That is not zero at the point a\")","v":""}]
[]
["     What is the limit point a =  ",null,null,0]
[null,{"$f":"IF(OR(Sheet2!D2<>0,Sheet2!E2<>0),\"Both functions have to be 0 at this point!!\",\"\")","v":""},{"$nulls":6},"The graphs of  f(x)/g(x) and the Taylor polynomial ratios"]
["Enter the Taylor approximation to f:    "]
[null,"   TAYLOR ( f(x) ) =  ",null,"x-x^3/6",{"$nulls":4},"Now trace along the various curves:"]
["  and the Taylor approximation to g:    ",{"$nulls":7},"x  = ",{"$f":"D26+K21*dx","v":{"v":1.0978043912175646,"d":"1.098"}},388]
[null,"   TAYLOR ( g(x) ) =  ",null,"5*x",{"$nulls":4},"f/g =",{"$f":"LOOKUP(J$21,Sheet2!C3:C504,Sheet2!F3:F504)","v":{"v":0.20272493447729137,"d":"0.203"}}]
[{"$nulls":7},"  Taylor ratios =",null,{"$f":"LOOKUP(J$21,Sheet2!C4:C505,Sheet2!I4:I505)","v":{"v":0.159827517287448,"d":"0.160"}}]
[]
["Now enter the interval for x :  "]
[null,"Starting value xMin =",null,-2]
[null,"Ending value xMax =",null,2]
[]
[]
[]
[]
["Click each item below for suggestions and investigations"]
[null,"   Item 1"]
[null,"   Item 2"]
[null,"   Item 3"]
[null,"   Item 4"]
[null,"   Item 5"]
[null,"   Item 6"]
[{"$nulls":7},"When x  = ",{"$f":"J21","v":1.0978043912175646},{"$nulls":5},"When x  = ",{"$f":"I39","v":1.0978043912175646}]
[{"$nulls":7},"                f(x) =",{"$f":"Sheet2!K14","v":0.8902092931138512},{"$nulls":5},"               g(x) =",{"$f":"Sheet2!K21","v":4.391217564870244}]
[{"$nulls":7},"TAYLOR (f(x) ) =",{"$f":"Sheet2!K16","v":0.8772967515778054},{"$nulls":5},"TAYLOR (g(x) ) =",{"$f":"Sheet2!K23","v":5.4890219560878055}]
["To access/download all the DIGMath Apps for Calculus"]
["      Click this link:",null,"DIGMath for Calculus"]
[]
["Created by:  Sheldon P. Gordon   "]
["                      Farmingdale State College    "]
["Development of this module was supported by the "]
["NSF's Division of Undergraduate Education  "]
["under grants DUE-0310123 and DUE-0442160."]

{"sheet":"Sheet2","index":1,"n_rows":504,"n_cols":11,"rows_kept":504}
[null,null,"x","y = f(x)","y = g(x)","f(x)/g(x)","Taylor(f)","Taylor(g)","Ratio","   Tracing points"]
[null,null,{"$f":"a0","v":0},{"$f":"SIN(1*x)","v":0},{"$f":"4*x","v":0},null,{"$f":"x-x^3/6","v":0},{"$f":"5*x","v":0}]
[null,null,{"$f":"a","v":-2},-0.9092974268256817,-8,{"$f":"D3/E3","v":0.11366217835321021},-0.6666666666666667,-10,{"$f":"G3/H3","v":0.06666666666666668},0,0]
[null,null,{"$f":"C3+dx","v":-1.9920159680638723},-0.9125909398380481,-7.968063872255489,{"$f":"D4/E4","v":0.11453107736945443},-0.6745870386602117,-9.960079840319361,{"$f":"G4/H4","v":0.06772907943261845},{"$f":"Sheet1!J$21","v":1.0978043912175646},{"$f":"Sheet1!J22","v":0.20272493447729137}]
[null,null,-1.9840319361277445,-0.9158262802635574,-7.936127744510978,0.11539963943964845,-0.6823804300620899,-9.920159680638722,0.06878724254750646,"on curve"]
[null,null,-1.9760479041916168,-0.9190032418672869,-7.904191616766467,0.11626783438775523,-0.6900473498125481,-9.880239520958083,0.06984115601133063]
[null,null,-1.968063872255489,-0.9221216221356385,-7.872255489021956,0.11713563202077963,-0.6975883068518336,-9.840319361277444,0.07089081982409101,0,0]
[null,null,-1.9600798403193613,-0.9251812222892479,-7.840319361277445,0.11800300213006955,-0.7050038101201934,-9.800399201596807,0.07193623398578755,{"$f":"Sheet1!J$21","v":1.0978043912175646},{"$f":"Sheet1!J23","v":0.159827517287448}]
[null,null,-1.9520958083832336,-0.9281818472956553,-7.808383233532934,0.11886991449261844,-0.7122943685578751,-9.760479041916168,0.07297739849642032,"on derivatives"]
[null,null,-1.9441117764471059,-0.931123305881738,-7.7764471057884235,0.11973633887236927,-0.7194604911051252,-9.72055888223553,0.07401431335598926]
[null,null,-1.9361277445109781,-0.9340054105459028,-7.7445109780439125,0.12060224502151992,-0.7265026867021915,-9.68063872255489,0.07504697856449442]
["delta x = ",{"$f":"(Sheet1!D27-Sheet1!D26)/501","v":0.007984031936127744},-1.9281437125748504,-0.9368279775700386,-7.712574850299402,0.12146760268182953,-0.7334214642893206,-9.640718562874252,0.07607539412193574,"Points on graphs for f"]
[null,null,-1.9201596806387227,-0.9395908270312264,-7.680638722554891,0.1223323815859263,-0.7402173328067605,-9.600798403193613,0.07709956002831331]
[null,null,-1.912175648702595,-0.9422937828132099,-7.64870259481038,0.12319655145861641,-0.7468908011947573,-9.560878243512974,0.07811947628362702,{"$f":"J8","v":1.0978043912175646},{"$f":"LOOKUP(J14,C$3:C$504,D$3:D$504)","v":0.8902092931138512}]
[null,null,-1.9041916167664672,-0.9449366726176204,-7.616766467065869,0.12406008201819387,-0.7534423783935587,-9.520958083832337,0.0791351428878769]
[null,null,-1.8962075848303395,-0.9475193279749609,-7.584830339321358,0.1249229429777514,-0.759872573343412,-9.481037924151698,0.08014655984106302,{"$f":"J14","v":1.0978043912175646},{"$f":"LOOKUP(J16,C3:C504,G3:G504)","v":0.8772967515778054}]
[null,null,-1.8882235528942117,-0.9500415842553445,-7.552894211576847,0.12578510404649249,-0.7661818949845642,-9.441117764471059,0.08115372714318533]
[null,null,-1.880239520958084,-0.952503280678989,-7.520958083832336,0.1266465349310439,-0.7723708522572623,-9.40119760479042,0.08215664479424381]
[null,null,-1.8722554890219563,-0.9549042603264658,-7.489021956087825,0.12750720533676954,-0.7784399541017539,-9.361277445109781,0.08315531279423853,"Points on graphs for g"]
[null,null,-1.8642714570858285,-0.9572443701487021,-7.457085828343314,0.1283670849690845,-0.7843897094582857,-9.321357285429142,0.0841497311431694]
[null,null,-1.8562874251497008,-0.9595234609767372,-7.425149700598803,0.12922614353477024,-0.7902206272671051,-9.281437125748504,0.08513989984103648,{"$f":"J4","v":1.0978043912175646},{"$f":"LOOKUP(J21,C$3:C$504,E$3:E$504)","v":4.391217564870244}]
[null,null,-1.848303393213573,-0.9617413875312316,-7.393213572854292,0.13008435074329022,-0.7959332164684592,-9.241516966067865,0.08612581888783974]
[null,null,-1.8403193612774453,-0.9638980084317272,-7.361277445109781,0.1309416763081061,-0.801527986002595,-9.201596806387226,0.0871074882835792,{"$f":"J21","v":1.0978043912175646},{"$f":"LOOKUP(J23,C$3:C$504,H$3:H$504)","v":5.4890219560878055}]
[null,null,-1.8323353293413176,-0.9659931862056597,-7.32934131736527,0.13179808994799438,-0.8070054448097601,-9.161676646706589,0.08808490802825485]
[null,null,-1.8243512974051899,-0.9680267872971215,-7.2974051896207595,0.13265356138836373,-0.8123661018302013,-9.12175648702595,0.0890580781218667]
[null,null,-1.8163672654690621,-0.9699986820753759,-7.2654690618762485,0.13350806036257232,-0.8176104660041658,-9.08183632734531,0.09002699856441472]
[null,null,-1.8083832335329344,-0.9719087448431192,-7.233532934131738,0.13436155661324575,-0.8227390462719008,-9.041916167664672,0.09099166935589895]
[null,null,-1.8003992015968067,-0.9737568538444943,-7.201596806387227,0.13521401989359522,-0.8277523515736537,-9.001996007984033,0.09195209049631939]
[null,null,-1.792415169660679,-0.9755428912728511,-7.169660678642716,0.1360654199687356,-0.8326508908496711,-8.962075848303394,0.09290826198567599]
[null,null,-1.7844311377245512,-0.9772667432782567,-7.137724550898205,0.13691572661700405,-0.8374351730402008,-8.922155688622755,0.0938601838239688]
[null,null,-1.7764471057884235,-0.978928299974752,-7.105788423153694,0.13776490963127827,-0.8421057070854895,-8.882235528942118,0.09480785601119777]
[null,null,-1.7684630738522957,-0.980527455447357,-7.073852295409183,0.13861293882029507,-0.8466630019257847,-8.84231536926148,0.09575127854736298]
[null,null,-1.760479041916168,-0.9820641077588217,-7.041916167664672,0.1394597840099687,-0.8511075665013332,-8.80239520958084,0.09669045143246437]
[null,null,-1.7524950099800403,-0.9835381589561247,-7.009980039920161,0.14030541504470911,-0.8554399097523826,-8.762475049900202,0.09762537466650195]
[null,null,-1.7445109780439125,-0.9849495150767165,-6.97804391217565,0.14114980178873995,-0.8596605406191796,-8.722554890219563,0.09855604824947573]
[null,null,-1.7365269461077848,-0.9862980861545093,-6.946107784431139,0.1419929141274164,-0.8637699680419717,-8.682634730538924,0.09948247218138569]
[null,null,-1.728542914171657,-0.9875837862256123,-6.914171656686628,0.14283472196854263,-0.867768700961006,-8.642714570858285,0.10040464646223185]
[null,null,-1.7205588822355293,-0.9888065333338103,-6.882235528942117,0.14367519524368877,-0.8716572483165296,-8.602794411177646,0.10132257109201422]
[null,null,-1.7125748502994016,-0.9899662495357895,-6.850299401197606,0.1445143039095077,-0.8754361190487896,-8.562874251497007,0.10223624607073276]
[null,null,-1.7045908183632739,-0.9910628609061045,-6.8183632734530955,0.145352017949051,-0.8791058220980331,-8.52295409181637,0.10314567139838746]
[null,null,-1.6966067864271461,-0.9920962975418915,-6.7864271457085845,0.14618830737308458,-0.8826668664045076,-8.483033932135731,0.1040508470749784]
[null,null,-1.6886227544910184,-0.9930664935673241,-6.754491017964074,0.14702314222140345,-0.88611976090846,-8.443113772455092,0.10495177310050552]
[null,null,-1.6806387225548907,-0.9939733871378121,-6.722554890219563,0.147856492564146,-0.8894650145501376,-8.403193612774453,0.10584844947496884]
[null,null,-1.672654690618763,-0.9948169204439443,-6.690618762475052,0.1486883285031074,-0.8927031362697874,-8.363273453093814,0.10674087619836835]
[null,null,-1.6646706586826352,-0.9955970397151731,-6.658682634730541,0.14951862017305204,-0.8958346350076566,-8.323353293413176,0.10762905327070404]
[null,null,-1.6566866267465075,-0.9963136952232423,-6.62674650698603,0.1503473377430254,-0.8988600197039925,-8.283433133732537,0.10851298069197594]
[null,null,-1.6487025948103797,-0.996966841285357,-6.594810379241519,0.15117445141766456,-0.9017797992990423,-8.2435129740519,0.10939265846218402]
[null,null,-1.640718562874252,-0.9975564362670952,-6.562874251497008,0.15199993143850807,-0.9045944827330528,-8.20359281437126,0.11026808658132829]
[null,null,-1.6327345309381243,-0.9980824425850628,-6.530938123752497,0.1528237480853045,-0.9073045789462716,-8.163672654690622,0.11113926504940878]
[null,null,-1.6247504990019965,-0.9985448267092882,-6.499001996007986,0.1536458716773198,-0.9099105968789455,-8.123752495009983,0.11200619386642544]
[null,null,-1.6167664670658688,-0.9989435591653602,-6.467065868263475,0.1544662725746436,-0.9124130454713218,-8.083832335329344,0.11286887303237829]
[null,null,-1.608782435129741,-0.9992786145363065,-6.435129740518964,0.15528492117949422,-0.9148124336636478,-8.043912175648705,0.11372730254726734]
[null,null,-1.6007984031936133,-0.9995499714642146,-6.403193612774453,0.15610178793752225,-0.9171092703961706,-8.003992015968066,0.1145814824110926]
[null,null,-1.5928143712574856,-0.9997576126515925,-6.371257485029942,0.15691684333911268,-0.9193040646091373,-7.964071856287428,0.11543141262385404]
[null,null,-1.5848303393213579,-0.9999015248624714,-6.3393213572854314,0.15773005792068576,-0.9213973252427948,-7.924151696606789,0.11627709318555164]
[null,null,-1.5768463073852301,-0.9999816989232502,-6.3073852295409205,0.15854140226599625,-0.9233895612373909,-7.88423153692615,0.11711852409618549]
[null,null,-1.5688622754491024,-0.999998129723279,-6.27544910179641,0.15935084700743085,-0.9252812815331722,-7.844311377245512,0.11795570535575549]
[null,null,-1.5608782435129747,-0.9999508162151858,-6.243512974051899,0.1601583628273043,-0.9270729950703861,-7.8043912175648735,0.1187886369642617]
[null,null,-1.552894211576847,-0.9998397614149434,-6.211576846307388,0.16096392045915373,-0.9287652107892796,-7.764471057884235,0.11961731892170409]
[null,null,-1.5449101796407192,-0.9996649724016763,-6.179640718562877,0.16176749068903087,-0.9303584376301003,-7.724550898203596,0.1204417512280827]
[null,null,-1.5369261477045915,-0.9994264603172099,-6.147704590818366,0.16256904435679284,-0.9318531845330947,-7.684630738522957,0.12126193388339748]
[null,null,-1.5289421157684637,-0.9991242403653606,-6.115768463073855,0.1633685523573908,-0.9332499604385106,-7.644710578842319,0.12207786688764846]
[null,null,-1.520958083832336,-0.9987583318109663,-6.083832335329344,0.1641659856421568,-0.9345492742865947,-7.60479041916168,0.12288955024083563]
[null,null,-1.5129740518962083,-0.9983287579786579,-6.051896207584833,0.1649613152200882,-0.9357516350175944,-7.564870259481041,0.123696983942959]
[null,null,-1.5049900199600805,-0.9978355462513737,-6.019960079840322,0.16575451215913065,-0.9368575515717568,-7.524950099800403,0.12450016799401854]
[null,null,-1.4970059880239528,{"$f":"SIN(1*x)","v":-0.9972787280686126},{"$f":"4*x","v":-5.988023952095811},0.16654554758745824,{"$f":"x-x^3/6","v":-0.937867532889329},{"$f":"5*x","v":-7.485029940119764},0.1252991023940143]
[null,null,-1.489021956087825,-0.9966583389244308,-5.9560878243513,0.16733439269475187,-0.9387820879105583,-7.445109780439125,0.12609378714294625]
[null,null,{"$f":"C67+dx","v":-1.4810379241516973},-0.9959744183651791,-5.924151696606789,{"$f":"D68/E68","v":0.16812101873347524},-0.9396017255756918,-7.405189620758486,{"$f":"G68/H68","v":0.1268842222408144}]
[null,null,-1.4730538922155696,-0.9952270099869819,-5.892215568862278,0.16890539702014826,-0.9403269548249765,-7.3652694610778475,0.1276704076876187]
[null,null,-1.4650698602794419,-0.9944161614329582,-5.860279441117767,0.16968749893661847,-0.9409582845986598,-7.3253493013972095,0.1284523434833592]
[null,null,-1.4570858283433141,-0.9935419243901847,-5.8283433133732565,0.17046729593132956,-0.9414962238369888,-7.285429141716571,0.12923002962803593]
[null,null,-1.4491017964071864,-0.9926043545864012,-5.796407185628746,0.1712447595205877,-0.9419412814802107,-7.245508982035932,0.13000346612164884]
[null,null,-1.4411177644710587,-0.9916035117864578,-5.764471057884235,0.17201986128982516,-0.9422939664685726,-7.205588822355294,0.13077265296419793]
[null,null,-1.433133732534931,-0.9905394597885057,-5.732534930139724,0.1727925728948611,-0.9425547877423215,-7.165668662674655,0.13153759015568323]
[null,null,-1.4251497005988032,-0.9894122664199302,-5.700598802395213,0.17356286606315993,-0.9427242542417047,-7.125748502994016,0.1322982776961047]
[null,null,-1.4171656686626755,-0.988222003533027,-5.668662674650702,0.1743307125950867,-0.9428028749069697,-7.085828343313377,0.13305471558546242]
[null,null,-1.4091816367265477,-0.9869687470004223,-5.636726546906191,0.1750960843651598,-0.942791158678363,-7.045908183632738,0.13380690382375626]
[null,null,-1.40119760479042,-0.985652576710236,-5.60479041916168,0.17585895332330054,-0.9426896144961323,-7.0059880239521,0.13455484241098634]
[null,null,-1.3932135728542923,-0.9842735765609896,-5.572854291417169,0.17661929149608005,-0.9424987513005245,-6.966067864271461,0.13529853134715258]
[null,null,-1.3852295409181645,-0.9828318344562578,-5.540918163672658,0.17737707098796285,-0.942219078031787,-6.926147704590822,0.13603797063225503]
[null,null,-1.3772455089820368,-0.9813274422990657,-5.508982035928147,0.17813226398254767,-0.9418511036301667,-6.886227544910184,0.1367731602662937]
[null,null,-1.369261477045909,-0.9797604959860295,-5.477045908183636,0.17888484274380484,-0.9413953370359107,-6.8463073852295455,0.1375041002492685]
[null,null,-1.3612774451097813,-0.9781310954012449,-5.445109780439125,0.1796347796173106,-0.9408522871892666,-6.806387225548907,0.13823079058117954]
[null,null,-1.3532934131736536,-0.976439344409919,-5.413173652694614,0.18038204703147828,-0.9402224630304812,-6.766467065868268,0.13895323126202677]
[null,null,-1.3453093812375259,-0.9746853508517498,-5.381237524950103,0.18112661749878572,-0.9395063734998017,-6.726546906187629,0.1396714222918102]
[null,null,-1.3373253493013981,-0.9728692265340524,-5.3493013972055925,0.18186846361699996,-0.9387045275374752,-6.686626746506991,0.14038536367052978]
[null,null,-1.3293413173652704,-0.9709910872246313,-5.317365269461082,0.18260755807039789,-0.9378174340837491,-6.646706586826352,0.14109505539818556]
[null,null,-1.3213572854291427,-0.9690510526444015,-5.285429141716571,0.1833438736309837,-0.9368456020788705,-6.606786427145713,0.14180049747477758]
[null,null,-1.313373253493015,-0.967049246459756,-5.25349301397206,0.18407738315970265,-0.9357895404630865,-6.566866267465075,0.14250168990030576]
[null,null,-1.3053892215568872,-0.9649857962746838,-5.221556886227549,0.18480805960765148,-0.9346497581766442,-6.526946107784436,0.14319863267477015]
[null,null,-1.2974051896207595,-0.9628608336226354,-5.189620758483038,0.1855358760172846,-0.9334267641597906,-6.487025948103797,0.14389132579817068]
[null,null,-1.2894211576846317,-0.9606744939581381,-5.157684630738527,0.18626080552361718,-0.9321210673527733,-6.447105788423158,0.14457976927050747]
[null,null,-1.281437125748504,-0.9584269166481618,-5.125748502994016,0.18698282135542396,-0.9307331766958393,-6.4071856287425195,0.14526396309178044]
[null,null,-1.2734530938123763,-0.956118244963235,-5.093812375249505,0.18770189683643432,-0.9292636011292357,-6.3672654690618815,0.14594390726198955]
[null,null,-1.2654690618762485,-0.9537486260683122,-5.061876247504994,0.18841800538652367,-0.9277128495932097,-6.327345309381243,0.14661960178113492]
[null,null,-1.2574850299401208,-0.9513182110133929,-5.029940119760483,0.18913112052290057,-0.9260814310280083,-6.287425149700604,0.14729104664921644]
[null,null,-1.249500998003993,-0.948827154723893,-4.998003992015972,0.18984121586128994,-0.924369854373879,-6.247504990019966,0.14795824186623416]
[null,null,-1.2415169660678653,-0.946275615990769,-4.966067864271461,0.1905482651171121,-0.9225786285710686,-6.207584830339327,0.1486211874321881]
[null,null,-1.2335329341317376,-0.9436637574603964,-4.93413173652695,0.19125224210665784,-0.9207082625598244,-6.167664670658688,0.1492798833470782]
[null,null,-1.2255489021956099,-0.9409917456242015,-4.902195608782439,0.19195312074825918,-0.9187592652803938,-6.127744510978049,0.14993432961090453]
[null,null,-1.2175648702594821,-0.9382597508080487,-4.8702594810379285,0.19265087506345574,-0.9167321456730235,-6.08782435129741,0.15058452622366703]
[null,null,-1.2095808383233544,-0.935467947161383,-4.838323353293418,0.19334547917815698,-0.9146274126779611,-6.047904191616772,0.1512304731853657]
[null,null,-1.2015968063872267,-0.9326165126461291,-4.806387225548907,0.19403690732379994,-0.9124455752354534,-6.007984031936133,0.15187217049600057]
[null,null,-1.193612774451099,-0.9297056290253473,-4.774451097804396,0.19472513383850273,-0.9101871422857479,-5.968063872255494,0.15250961815557168]
[null,null,-1.1856287425149712,-0.926735481851647,-4.742514970059885,0.19541013316821326,-0.9078526227690915,-5.928143712574856,0.1531428161640789]
[null,null,-1.1776447105788435,-0.923706260455359,-4.710578842315374,0.19609187986785356,-0.9054425256257316,-5.8882235528942175,0.15377176452152239]
[null,null,-1.1696606786427157,-0.9206181579324665,-4.678642714570863,0.19677034860245957,-0.9029573597959151,-5.848303393213579,0.15439646322790204]
[null,null,-1.161676646706588,-0.9174713711322963,-4.646706586826352,0.19744551414831613,-0.9003976342198894,-5.80838323353294,0.15501691228321793]
[null,null,-1.1536926147704603,-0.9142661006449709,-4.614770459081841,0.19811735139408737,-0.8977638578379015,-5.768463073852301,0.15563311168746996]
[null,null,-1.1457085828343325,-0.9110025507886222,-4.58283433133733,0.1987858353419422,-0.8950565395901985,-5.728542914171663,0.15624506144065817]
[null,null,-1.1377245508982048,-0.9076809295963668,-4.550898203592819,0.19945094110867512,-0.8922761884170277,-5.688622754491024,0.1568527615427826]
[null,null,-1.129740518962077,-0.9043014488030454,-4.518962075848308,0.20011264392682213,-0.8894233132586363,-5.648702594810385,0.15745621199384324]
[null,null,-1.1217564870259493,-0.9008643238317259,-4.487025948103797,0.20077091914577144,-0.8864984230552715,-5.608782435129747,0.15805541279384003]
[null,null,-1.1137724550898216,-0.8973697737799713,-4.455089820359286,0.2014257422328697,-0.8835020267471803,-5.568862275449108,0.15865036394277304]
[null,null,-1.1057884231536939,-0.8938180214058734,-4.423153692614775,0.2020770887745226,-0.8804346332746098,-5.528942115768469,0.15924106544064223]
[null,null,-1.0978043912175661,-0.8902092931138536,-4.3912175648702645,0.20272493447729095,-0.8772967515778074,-5.48902195608783,0.15982751728744765]
[null,null,-1.0898203592814384,-0.8865438189402299,-4.3592814371257536,0.20336925516898108,-0.8740888905970201,-5.4491017964071915,0.16040971948318924]
[null,null,-1.0818363273453107,-0.8828218325385547,-4.327345309381243,0.20401002679973035,-0.8708115592724952,-5.4091816367265535,0.16098767202786698]
[null,null,-1.073852295409183,-0.8790435711647199,-4.295409181636732,0.20464722544308742,-0.8674652665444796,-5.369261477045915,0.16156137492148095]
[null,null,-1.0658682634730552,-0.8752092756618327,-4.263473053892221,0.2052808272970869,-0.8640505213532208,-5.329341317365276,0.16213082816403113]
{"$rows_left_out":385}
{"sheet":"Defining Function","index":2,"n_rows":12,"n_cols":1,"rows_kept":12}
["                                                     Defining a Function in Excel"]
[]
["Computers have very specific rules you must follow when defining a function.  If you don't, the program will either not work at all or will work incorrectly."]
[]
["1. The Variable used should be the one named in the instruction, usually x, though sometimes y, t, Q (for an angle theta), "]
[" or even x and y (for a function of two variables). "]
[]
["2.  Order of Operations:  There five arithmetic operations, addition (+), subtraction (-), multiplication (*), division (/), and  exponentiation or power (^).  When computers see any of these operation symbols, they perform the indicated steps in a very particular order.  First, the power is done.  Second, products and quotients of adjacent terms is done.  Third, and last, sums and differences of adjacent terms are done.  So, in 10*x^3 + 5*x – 7, say with x = 2, the first pass only calculates 2^3 and ignores the multiplications and the sums and differences to calculate 2^3 = 8.  The second pass looks at 10*8 + 5*2 – 7 and only does the multiplications, so it produces 80 + 10 -  7.  The third pass looks at the +’s and –‘s to produce 80 + 10 – 7 = 83.  "]
[]
["3.    Parentheses  If you need an operation involving more than two adjacent terms, as in Ö4^3 + 6^2, the computer would take the square root of  4 to produce 2^3 + 6^2;  it would then cube the 2 and square the 6 to produce 8 + 36; and finally it would add the 8 and the 36 to get 44.  If you actually wanted the square root of the entire expression, you would need to use parentheses, as in Ö(4^3 + 6^2) to tell the computer to do all the operations inside the parentheses before taking the square root.  Therefore, it would calculate (4^3 + 6^2) = 64 + 36 = 100 and then take the square root of Ö100  =  10."]
[]
["4.  Built-In Functions  Computer programs have built-in functions for most common algebraic functions.  In Excel, the square root function is denoted by SQRT(…), so SQRT(100) = 10.  Alternatively, you could enter it as 100^.5 or 100^(1/2); notice that parentheses are needed to have the ½ done first.  The common trig functions are SIN (…), COS (…), and TAN (…), where the arguments are automatically interpreted as being in radians, not degrees.  The logarithm to the base 10 is represented by LOG (…) and the logarithm with the base e, known as the natural logarithm, is LN (…). The corresponding exponential function with base e is EXP (x).  If x is the variable, then each of these would be SQRT (x), SIN (x), COS (x), TAN (x), LOG (x) (for log with base 10 ), LN (x) (for log with base e ), and EXP (x)."]

{"sheet":"Sheet3","index":3,"n_rows":0,"n_cols":0,"rows_kept":0}