{"text_format":"3","workbook":"xlsx","n_sheets":3,"sheets":["Sheet1","Sheet2","Sheet3"],"not_rendered":{"charts":5,"images":9,"external_links":1,"defined_names":12,"comments":1},"read":"whole","date_system":"1900"}

{"sheet":"Sheet1","index":0,"n_rows":44,"n_cols":19,"rows_kept":44,"merged":[[37,2,37,3]]}
[null,"       Visualizing Integration by Parts"]
[]
[null,null,"    This DIGMath spreadsheet lets you"]
[null,null,"               visualize the process of"]
[null,null,"Integration by Parts for various functions"]
[]
[]
[]
["Which function do you want?",null,null,{"$f":"IF(E9=TRUE, 1,IF(E10=TRUE, 2,IF(E12=TRUE,3,4)))","v":3},false]
[{"$nulls":4},false]
[]
[{"$nulls":4},true]
[]
["What is the power p (1 to 3)?",null,null,{"$f":"E14","v":3},3]
[]
["What is the multiple c (-3, 3)?",null,null,{"$f":"IF(E16<3,E16-3,E16-2)","v":2},4,{"$nulls":4},"Pick a tracing point x0 =",null,null,{"$f":"a+K17*dx","v":2.58}]
[{"$nulls":10},172]
["             Your function is then y =",{"$nulls":3},{"$f":"IF(pop=1,Sheet2!A1,IF(pop=2,Sheet2!A2,Sheet2!A3))","v":"x^3 cos(2x)"}]
[{"$nulls":9}," The area from x =",null,{"$f":"a","v":0},"to x =",{"$f":"x0","v":2.58},"=",{"$f":"LOOKUP(x0+dx/2,Sheet2!$C$2:$C$202,Sheet2!E$2:E$202)","v":-3.6222785586703874}]
[]
{"$rows_left_out":25}
{"sheet":"Sheet2","index":1,"n_rows":401,"n_cols":22,"rows_kept":401}
[{"$f":"\"x^\"&TEXT(p,\"0\")&\" e^(\"&TEXT(cc,\"0\")&\"x)\"","v":"x^3 e^(2x)"},null,"x","f(x)","Area","u*v","POP = 1","POP = 2","POP = 3","Int(v du)","Diff",null,"x","f(x)","sweep x","sweep y","u v","POP = 1","POP = 2","POP = 3","Int (v du)","u v - int(v*du)"]
[{"$f":"\"x^\"&TEXT(p,\"0\")&\" sin(\"&TEXT(cc,\"0\")&\"x)\"","v":"x^3 sin(2x)"},null,{"$f":"a","v":0},{"$f":"IF(pop=1,x^p*EXP(cc*x),IF(pop=2,x^p*SIN(cc*x),x^p*COS(cc*x)))","v":0},0,{"$f":"IF(pop=1,x^p*EXP(cc*x)/cc,IF(pop=2,(-1)*x^p*(COS(cc*x))/cc,x^p*SIN(cc*x)/cc))","v":0},{"$f":"IF(p=1,EXP(cc*x)/cc^2-EXP(a*x)/cc^2,IF(p=2,EXP(cc*x)*(2*x/cc^2-1/cc^3)-EXP(a*cc)*(2*a/cc^2-1/cc^3),EXP(cc*x)*(-3*x^2/cc^2+6*x/cc^3-3/cc^4))-EXP(cc*a)*(-3*a^2/cc^2+6*a/cc^3-3/cc^4))","v":0},{"$f":"IF(p=1,(SIN(cc*x))/cc^2-SIN(a*cc)/cc^2,IF(p=2, 2*x/cc^2*SIN(cc*x)+2/cc^3*COS(cc*x)-  2*a/cc^2*SIN(cc*a)+2/cc^3*COS(cc*a),  6*x/cc^3*COS(cc*x)+3/cc^4*(cc^2*x^2-2)*SIN(cc*x)  -  6*a/cc^3*COS(cc*x)+3/cc^4*(cc^2*a^2-2)*SIN(cc*a)  ))","v":0},{"$f":"IF(p=1,COS(cc*x)/cc^2-COS(cc*a)/cc^2,\nIF(p=2,(-2/cc^3*SIN(cc*x)+2*x/cc^2*COS(cc*x)+2/cc^3*SIN(cc*a)\n-2*a/cc^2*COS(cc*a)),\n(-6*x/cc^3*SIN(cc*x)+(3*x^2/cc^2-6/cc^4)*COS(cc*x)\n+6*a/cc^3*SIN(cc*a)-(3*a^2/cc^2-6/cc^4)*COS(cc*a)))\n)","v":0},{"$f":"IF(pop=1,G2,IF(pop=2,-H2,I2))","v":0},{"$f":"F2-J2","v":0},null,{"$f":"C2","v":0},0,{"$f":"M2","v":0},{"$f":"N2","v":0},0,0,0,0,0,0]
[{"$f":"\"x^\"&TEXT(p,\"0\")&\" cos(\"&TEXT(cc,\"0\")&\"x)\"","v":"x^3 cos(2x)"},null,{"$f":"C2+dx","v":0.015},3.3734813639028327E-6,{"$f":"E2+(D2+D3)*dx/2","v":2.5301110229271243E-8},5.0617406591711428E-8,0.005708499188087968,1.6870443994079776E-6,-3.7964953292224379E-8,{"$f":"IF(pop=1,G3,IF(pop=2,H3,I3))*(-1)","v":3.7964953292224379E-8},{"$f":"F3-J3","v":1.2652453299487049E-8},null,{"$f":"M2","v":0},{"$f":"IF(pop=1,xx^p*EXP(cc*xx),IF(pop=2,xx^p*SIN(cc*xx),xx^p*COS(cc*xx)))","v":0},{"$f":"O2","v":0},{"$f":"N3","v":0},{"$f":"IF(pop=1,xx^p*EXP(cc*xx)/cc,IF(pop=2,(-1)*xx^p*(COS(cc*xx))/cc,xx^p*SIN(cc*xx)/cc))","v":0},{"$f":"IF(p=1,EXP(cc*xx)/cc^2-EXP(a*xx)/cc^2,IF(p=2,EXP(cc*xx)*(2*xx/cc^2-1/cc^3)-EXP(a*cc)*(2*a/cc^2-1/cc^3),EXP(cc*xx)*(-3*xx^2/cc^2+6*xx/cc^3-3/cc^4))-EXP(cc*a)*(-3*a^2/cc^2+6*a/cc^3-3/cc^4))","v":0},{"$f":"IF(p=1,(SIN(cc*xx))/cc^2-SIN(a*cc)/cc^2,IF(p=2, 2*x/cc^2*SIN(cc*xx)+2/cc^3*COS(cc*xx)-  2*a/cc^2*SIN(cc*a)+2/cc^3*COS(cc*a),  6*xx/cc^3*COS(cc*xx)+3/cc^4*(cc^2*xx^2-2)*SIN(cc*xx)  -  6*a/cc^3*COS(cc*xx)+3/cc^4*(cc^2*a^2-2)*SIN(cc*a)  ))","v":0},{"$f":"IF(p=1,COS(cc*xx)/cc^2-COS(cc*a)/cc^2,\nIF(p=2,(-2/cc^3*SIN(cc*xx)+2*xx/cc^2*COS(cc*xx)+2/cc^3*SIN(cc*a)\n-2*a/cc^2*COS(cc*a)),\n(-6*xx/cc^3*SIN(cc*xx)+(3*xx^2/cc^2-6/cc^4)*COS(cc*xx)\n+6*a/cc^3*SIN(cc*a)-(3*a^2/cc^2-6/cc^4)*COS(cc*a)))\n)","v":0},{"$f":"IF(pop=1,R3,IF(pop=2,-S3,T3))","v":0},0]
[{"$f":"\"x^\"&TEXT(p,\"0\")&\" cos(\"&TEXT(cc,\"0\")&\"x)\"","v":"x^3 cos(2x)"},null,0.03,2.6951414578250514E-5,2.5273782979542131E-7,8.09514087472502e-07,0.011580230151097548,1.3485423123994755E-5,-6.0725703282527022E-7,6.0725703282527022E-7,2.0225705464723176E-7,null,{"$f":"M2+dx","v":0.015},0,{"$f":"IF(xx<=x0,O2+dx,O2)","v":0.015},{"$f":"N4","v":0},0,0,0,0,0,0]
[null,null,0.045,9.0756192795717972E-5,1.135544885100185E-6,4.0950913978343774E-6,0.017608926686946608,4.5451836495145892E-5,-3.0727016687159825E-6,3.0727016687159825E-6,1.0223897291183949E-6,null,{"$f":"M4","v":0.015},{"$f":"IF(pop=1,xx^p*EXP(cc*xx),IF(pop=2,xx^p*SIN(cc*xx),xx^p*COS(cc*xx)))","v":3.3734813639028327E-6},{"$f":"O4","v":0.015},{"$f":"IF(xx<=x0,IF(pop=1,xx^p*EXP(cc*xx),IF(pop=2,xx^p*SIN(cc*xx),xx^p*COS(cc*xx))),P3)","v":3.3734813639028327E-6},{"$f":"IF(xx<=x0,IF(pop=1,xx^p*EXP(cc*xx)/cc,IF(pop=2,(-1)*xx^p*(COS(cc*xx))/cc,xx^p*SIN(cc*xx)/cc)),Q3)","v":5.0617406591711428E-8},{"$f":"IF(p=1,EXP(cc*xx)/cc^2-EXP(a*xx)/cc^2,IF(p=2,EXP(cc*xx)*(2*xx/cc^2-1/cc^3)-EXP(a*cc)*(2*a/cc^2-1/cc^3),EXP(cc*xx)*(-3*xx^2/cc^2+6*xx/cc^3-3/cc^4))-EXP(cc*a)*(-3*a^2/cc^2+6*a/cc^3-3/cc^4))","v":0.005708499188087968},{"$f":"IF(p=1,(SIN(cc*xx))/cc^2-SIN(a*cc)/cc^2,IF(p=2, 2*xx/cc^2*SIN(cc*xx)+2/cc^3*COS(cc*xx)-  2*a/cc^2*SIN(cc*a)+2/cc^3*COS(cc*a),  6*xx/cc^3*COS(cc*xx)+3/cc^4*(cc^2*xx^2-2)*SIN(cc*xx)  -  6*a/cc^3*COS(cc*xx)+3/cc^4*(cc^2*a^2-2)*SIN(cc*a)  ))","v":1.6870443994079776E-6},{"$f":"IF(p=1,COS(cc*xx)/cc^2-COS(cc*a)/cc^2,\nIF(p=2,(-2/cc^3*SIN(cc*xx)+2*xx/cc^2*COS(cc*xx)+2/cc^3*SIN(cc*a)\n-2*a/cc^2*COS(cc*a)),\n(-6*xx/cc^3*SIN(cc*xx)+(3*xx^2/cc^2-6/cc^4)*COS(cc*xx)\n+6*a/cc^3*SIN(cc*a)-(3*a^2/cc^2-6/cc^4)*COS(cc*a)))\n)","v":-3.7964953292224379E-8},{"$f":"IF(xx<=x0,(-1)*IF(pop=1,R5,IF(pop=2,S5,T5)),U3)","v":3.7964953292224379E-8},{"$f":"IF(xx<=x0,Q5-U5,V3)","v":1.2652453299487049E-8}]
[null,null,0.06,2.1444666534443509E-4,3.4245663211513329E-6,1.292891838720329E-5,0.02378745715067465,1.075338397593037E-4,-9.7044563958093022E-6,9.7044563958093022E-6,3.2244619913939881E-6,null,{"$f":"M4+dx","v":0.03},0,{"$f":"IF(xx<=x0,O4+dx,O4)","v":0.03},{"$f":"N6","v":0},0,0,0,0,0,0]
[{"$f":"a","v":0},null,0.075,4.1713779850426779E-4,8.1614498000166049E-6,3.1522106068649836E-5,0.030107767430402915,2.0951557767566464E-4,-2.3671192613150538E-5,2.3671192613150538E-5,7.8509134554992978E-6,null,{"$f":"M6","v":0.03},{"$f":"IF(pop=1,xx^p*EXP(cc*xx),IF(pop=2,xx^p*SIN(cc*xx),xx^p*COS(cc*xx)))","v":2.6951414578250514E-5},{"$f":"O6","v":0.03},{"$f":"IF(xx<=x0,IF(pop=1,xx^p*EXP(cc*xx),IF(pop=2,xx^p*SIN(cc*xx),xx^p*COS(cc*xx))),P5)","v":2.6951414578250514E-5},{"$f":"IF(xx<=x0,IF(pop=1,xx^p*EXP(cc*xx)/cc,IF(pop=2,(-1)*xx^p*(COS(cc*xx))/cc,xx^p*SIN(cc*xx)/cc)),Q5)","v":8.09514087472502e-07},{"$f":"IF(p=1,EXP(cc*xx)/cc^2-EXP(a*xx)/cc^2,IF(p=2,EXP(cc*xx)*(2*xx/cc^2-1/cc^3)-EXP(a*cc)*(2*a/cc^2-1/cc^3),EXP(cc*xx)*(-3*xx^2/cc^2+6*xx/cc^3-3/cc^4))-EXP(cc*a)*(-3*a^2/cc^2+6*a/cc^3-3/cc^4))","v":0.011580230151097548},{"$f":"IF(p=1,(SIN(cc*xx))/cc^2-SIN(a*cc)/cc^2,IF(p=2, 2*xx/cc^2*SIN(cc*xx)+2/cc^3*COS(cc*xx)-  2*a/cc^2*SIN(cc*a)+2/cc^3*COS(cc*a),  6*xx/cc^3*COS(cc*xx)+3/cc^4*(cc^2*xx^2-2)*SIN(cc*xx)  -  6*a/cc^3*COS(cc*xx)+3/cc^4*(cc^2*a^2-2)*SIN(cc*a)  ))","v":1.3485423123994755E-5},{"$f":"IF(p=1,COS(cc*xx)/cc^2-COS(cc*a)/cc^2,\nIF(p=2,(-2/cc^3*SIN(cc*xx)+2*xx/cc^2*COS(cc*xx)+2/cc^3*SIN(cc*a)\n-2*a/cc^2*COS(cc*a)),\n(-6*xx/cc^3*SIN(cc*xx)+(3*xx^2/cc^2-6/cc^4)*COS(cc*xx)\n+6*a/cc^3*SIN(cc*a)-(3*a^2/cc^2-6/cc^4)*COS(cc*a)))\n)","v":-6.0725703282527022E-7},{"$f":"IF(xx<=x0,(-1)*IF(pop=1,R7,IF(pop=2,S7,T7)),U5)","v":6.0725703282527022E-7},{"$f":"IF(xx<=x0,Q7-U7,V5)","v":2.0225705464723176E-7}]
[{"$f":"b","v":3},null,0.09,7.1722205204254052E-4,1.6669148679117668E-5,6.52562795137129e-05,0.03656082094441779,3.6096388707602955E-4,-4.90305681008496e-05,4.90305681008496e-05,1.62257114128633e-05,null,{"$f":"M6+dx","v":0.045},0,{"$f":"IF(xx<=x0,O6+dx,O6)","v":0.045},{"$f":"N8","v":0},0,0,0,0,0,0]
[null,null,0.105,1.1321930376575419E-3,3.0539761851868288E-5,1.2065919577967048E-4,0.04313653552143684,5.7117488909176617E-4,-9.0717008310647884E-5,9.0717008310647884E-5,2.9942187469022598E-5,null,{"$f":"M8","v":0.045},{"$f":"IF(pop=1,xx^p*EXP(cc*xx),IF(pop=2,xx^p*SIN(cc*xx),xx^p*COS(cc*xx)))","v":9.0756192795717972E-5},{"$f":"O8","v":0.045},{"$f":"IF(xx<=x0,IF(pop=1,xx^p*EXP(cc*xx),IF(pop=2,xx^p*SIN(cc*xx),xx^p*COS(cc*xx))),P7)","v":9.0756192795717972E-5},{"$f":"IF(xx<=x0,IF(pop=1,xx^p*EXP(cc*xx)/cc,IF(pop=2,(-1)*xx^p*(COS(cc*xx))/cc,xx^p*SIN(cc*xx)/cc)),Q7)","v":4.0950913978343774E-6},{"$f":"IF(p=1,EXP(cc*xx)/cc^2-EXP(a*xx)/cc^2,IF(p=2,EXP(cc*xx)*(2*xx/cc^2-1/cc^3)-EXP(a*cc)*(2*a/cc^2-1/cc^3),EXP(cc*xx)*(-3*xx^2/cc^2+6*xx/cc^3-3/cc^4))-EXP(cc*a)*(-3*a^2/cc^2+6*a/cc^3-3/cc^4))","v":0.017608926686946608},{"$f":"IF(p=1,(SIN(cc*xx))/cc^2-SIN(a*cc)/cc^2,IF(p=2, 2*xx/cc^2*SIN(cc*xx)+2/cc^3*COS(cc*xx)-  2*a/cc^2*SIN(cc*a)+2/cc^3*COS(cc*a),  6*xx/cc^3*COS(cc*xx)+3/cc^4*(cc^2*xx^2-2)*SIN(cc*xx)  -  6*a/cc^3*COS(cc*xx)+3/cc^4*(cc^2*a^2-2)*SIN(cc*a)  ))","v":4.5451836495145892E-5},{"$f":"IF(p=1,COS(cc*xx)/cc^2-COS(cc*a)/cc^2,\nIF(p=2,(-2/cc^3*SIN(cc*xx)+2*xx/cc^2*COS(cc*xx)+2/cc^3*SIN(cc*a)\n-2*a/cc^2*COS(cc*a)),\n(-6*xx/cc^3*SIN(cc*xx)+(3*xx^2/cc^2-6/cc^4)*COS(cc*xx)\n+6*a/cc^3*SIN(cc*a)-(3*a^2/cc^2-6/cc^4)*COS(cc*a)))\n)","v":-3.0727016687159825E-6},{"$f":"IF(xx<=x0,(-1)*IF(pop=1,R9,IF(pop=2,S9,T9)),U7)","v":3.0727016687159825E-6},{"$f":"IF(xx<=x0,Q9-U9,V7)","v":1.0223897291183949E-6}]
["dx =",null,0.12,1.6784720205443072E-3,5.1619749788382154E-5,2.0537506923304426E-4,0.049823717020191866,8.4912119192025182E-4,-1.5452681955130387E-4,1.5452681955130387E-4,5.0848249681740383E-5,null,{"$f":"M8+dx","v":0.06},0,{"$f":"IF(xx<=x0,O8+dx,O8)","v":0.06},{"$f":"N10","v":0},0,0,0,0,0,0]
[{"$f":"(b-a)/200","v":0.015},null,0.135,2.3712378191462283E-3,8.1992573586061159E-5,3.2812967927164151E-4,0.05660998953829735,1.2033998239752014E-3,-2.4710066225180904E-4,2.4710066225180904E-4,8.1029017019832469E-5,null,{"$f":"M10","v":0.06},{"$f":"IF(pop=1,xx^p*EXP(cc*xx),IF(pop=2,xx^p*SIN(cc*xx),xx^p*COS(cc*xx)))","v":2.1444666534443509E-4},{"$f":"O10","v":0.06},{"$f":"IF(xx<=x0,IF(pop=1,xx^p*EXP(cc*xx),IF(pop=2,xx^p*SIN(cc*xx),xx^p*COS(cc*xx))),P9)","v":2.1444666534443509E-4},{"$f":"IF(xx<=x0,IF(pop=1,xx^p*EXP(cc*xx)/cc,IF(pop=2,(-1)*xx^p*(COS(cc*xx))/cc,xx^p*SIN(cc*xx)/cc)),Q9)","v":1.292891838720329E-5},{"$f":"IF(p=1,EXP(cc*xx)/cc^2-EXP(a*xx)/cc^2,IF(p=2,EXP(cc*xx)*(2*xx/cc^2-1/cc^3)-EXP(a*cc)*(2*a/cc^2-1/cc^3),EXP(cc*xx)*(-3*xx^2/cc^2+6*xx/cc^3-3/cc^4))-EXP(cc*a)*(-3*a^2/cc^2+6*a/cc^3-3/cc^4))","v":0.02378745715067465},{"$f":"IF(p=1,(SIN(cc*xx))/cc^2-SIN(a*cc)/cc^2,IF(p=2, 2*xx/cc^2*SIN(cc*xx)+2/cc^3*COS(cc*xx)-  2*a/cc^2*SIN(cc*a)+2/cc^3*COS(cc*a),  6*xx/cc^3*COS(cc*xx)+3/cc^4*(cc^2*xx^2-2)*SIN(cc*xx)  -  6*a/cc^3*COS(cc*xx)+3/cc^4*(cc^2*a^2-2)*SIN(cc*a)  ))","v":1.075338397593037E-4},{"$f":"IF(p=1,COS(cc*xx)/cc^2-COS(cc*a)/cc^2,\nIF(p=2,(-2/cc^3*SIN(cc*xx)+2*xx/cc^2*COS(cc*xx)+2/cc^3*SIN(cc*a)\n-2*a/cc^2*COS(cc*a)),\n(-6*xx/cc^3*SIN(cc*xx)+(3*xx^2/cc^2-6/cc^4)*COS(cc*xx)\n+6*a/cc^3*SIN(cc*a)-(3*a^2/cc^2-6/cc^4)*COS(cc*a)))\n)","v":-9.7044563958093022E-6},{"$f":"IF(xx<=x0,(-1)*IF(pop=1,R11,IF(pop=2,S11,T11)),U9)","v":9.7044563958093022E-6},{"$f":"IF(xx<=x0,Q11-U11,V9)","v":3.2244619913939881E-6}]
[null,null,0.15000000000000002,3.2242606507989213E-3,1.2395881211064977E-4,4.9869034874101077E-4,0.06348172205395473,1.6421810160384548E-3,-0.000375903417508372,0.000375903417508372,1.227869312326388E-4,null,{"$f":"M10+dx","v":0.075},0,{"$f":"IF(xx<=x0,O10+dx,O10)","v":0.075},{"$f":"N12","v":0},0,0,0,0,0,0]
[null,null,0.16500000000000004,0.004249740462422458,1.8001382045981012E-4,7.2782089446414967E-4,0.07042395133736422,0.002173157949599963,-5.4920148508985633E-4,5.4920148508985633E-4,1.7861940937429334E-4,null,{"$f":"M12","v":0.075},{"$f":"IF(pop=1,xx^p*EXP(cc*xx),IF(pop=2,xx^p*SIN(cc*xx),xx^p*COS(cc*xx)))","v":4.1713779850426779E-4},{"$f":"O12","v":0.075},{"$f":"IF(xx<=x0,IF(pop=1,xx^p*EXP(cc*xx),IF(pop=2,xx^p*SIN(cc*xx),xx^p*COS(cc*xx))),P11)","v":4.1713779850426779E-4},{"$f":"IF(xx<=x0,IF(pop=1,xx^p*EXP(cc*xx)/cc,IF(pop=2,(-1)*xx^p*(COS(cc*xx))/cc,xx^p*SIN(cc*xx)/cc)),Q11)","v":3.1522106068649836E-5},{"$f":"IF(p=1,EXP(cc*xx)/cc^2-EXP(a*xx)/cc^2,IF(p=2,EXP(cc*xx)*(2*xx/cc^2-1/cc^3)-EXP(a*cc)*(2*a/cc^2-1/cc^3),EXP(cc*xx)*(-3*xx^2/cc^2+6*xx/cc^3-3/cc^4))-EXP(cc*a)*(-3*a^2/cc^2+6*a/cc^3-3/cc^4))","v":0.030107767430402915},{"$f":"IF(p=1,(SIN(cc*xx))/cc^2-SIN(a*cc)/cc^2,IF(p=2, 2*xx/cc^2*SIN(cc*xx)+2/cc^3*COS(cc*xx)-  2*a/cc^2*SIN(cc*a)+2/cc^3*COS(cc*a),  6*xx/cc^3*COS(cc*xx)+3/cc^4*(cc^2*xx^2-2)*SIN(cc*xx)  -  6*a/cc^3*COS(cc*xx)+3/cc^4*(cc^2*a^2-2)*SIN(cc*a)  ))","v":2.0951557767566464E-4},{"$f":"IF(p=1,COS(cc*xx)/cc^2-COS(cc*a)/cc^2,\nIF(p=2,(-2/cc^3*SIN(cc*xx)+2*xx/cc^2*COS(cc*xx)+2/cc^3*SIN(cc*a)\n-2*a/cc^2*COS(cc*a)),\n(-6*xx/cc^3*SIN(cc*xx)+(3*xx^2/cc^2-6/cc^4)*COS(cc*xx)\n+6*a/cc^3*SIN(cc*a)-(3*a^2/cc^2-6/cc^4)*COS(cc*a)))\n)","v":-2.3671192613150538E-5},{"$f":"IF(xx<=x0,(-1)*IF(pop=1,R13,IF(pop=2,S13,T13)),U11)","v":2.3671192613150538E-5},{"$f":"IF(xx<=x0,Q13-U13,V11)","v":7.8509134554992978E-6}]
["First graph",null,0.18000000000000005,0.00545815027568972,2.5282300099565148E-4,1.0272316642301635E-3,0.07742030096176589,2.8034975869471596E-3,-7.7603755598887325E-4,7.7603755598887325E-4,2.5119410824129022E-4,null,{"$f":"M12+dx","v":0.09},0,{"$f":"IF(xx<=x0,O12+dx,O12)","v":0.09},{"$f":"N14","v":0},0,0,0,0,0,0]
[{"$f":"x0","v":2.58},0,0.19500000000000006,6.8580850652095E-3,3.4519476605239562E-4,1.4095247872931776E-3,0.08445289623680043,3.5397926967401516E-3,-1.0662029074489654E-3,1.0662029074489654E-3,3.4332187984421219E-4,null,{"$f":"M14","v":0.09},{"$f":"IF(pop=1,xx^p*EXP(cc*xx),IF(pop=2,xx^p*SIN(cc*xx),xx^p*COS(cc*xx)))","v":7.1722205204254052E-4},{"$f":"O14","v":0.09},{"$f":"IF(xx<=x0,IF(pop=1,xx^p*EXP(cc*xx),IF(pop=2,xx^p*SIN(cc*xx),xx^p*COS(cc*xx))),P13)","v":7.1722205204254052E-4},{"$f":"IF(xx<=x0,IF(pop=1,xx^p*EXP(cc*xx)/cc,IF(pop=2,(-1)*xx^p*(COS(cc*xx))/cc,xx^p*SIN(cc*xx)/cc)),Q13)","v":6.52562795137129e-05},{"$f":"IF(p=1,EXP(cc*xx)/cc^2-EXP(a*xx)/cc^2,IF(p=2,EXP(cc*xx)*(2*xx/cc^2-1/cc^3)-EXP(a*cc)*(2*a/cc^2-1/cc^3),EXP(cc*xx)*(-3*xx^2/cc^2+6*xx/cc^3-3/cc^4))-EXP(cc*a)*(-3*a^2/cc^2+6*a/cc^3-3/cc^4))","v":0.03656082094441779},{"$f":"IF(p=1,(SIN(cc*xx))/cc^2-SIN(a*cc)/cc^2,IF(p=2, 2*xx/cc^2*SIN(cc*xx)+2/cc^3*COS(cc*xx)-  2*a/cc^2*SIN(cc*a)+2/cc^3*COS(cc*a),  6*xx/cc^3*COS(cc*xx)+3/cc^4*(cc^2*xx^2-2)*SIN(cc*xx)  -  6*a/cc^3*COS(cc*xx)+3/cc^4*(cc^2*a^2-2)*SIN(cc*a)  ))","v":3.6096388707602955E-4},{"$f":"IF(p=1,COS(cc*xx)/cc^2-COS(cc*a)/cc^2,\nIF(p=2,(-2/cc^3*SIN(cc*xx)+2*xx/cc^2*COS(cc*xx)+2/cc^3*SIN(cc*a)\n-2*a/cc^2*COS(cc*a)),\n(-6*xx/cc^3*SIN(cc*xx)+(3*xx^2/cc^2-6/cc^4)*COS(cc*xx)\n+6*a/cc^3*SIN(cc*a)-(3*a^2/cc^2-6/cc^4)*COS(cc*a)))\n)","v":-4.90305681008496e-05},{"$f":"IF(xx<=x0,(-1)*IF(pop=1,R15,IF(pop=2,S15,T15)),U13)","v":4.90305681008496e-05},{"$f":"IF(xx<=x0,Q15-U15,V13)","v":1.62257114128633e-05}]
[{"$f":"x0","v":2.58},{"$f":"LOOKUP(x0+dx/2,C2:C202,D2:D202)","v":7.4329217303038355},0.21000000000000008,0.008456116676232295,4.6005127911320906E-4,1.8881347778923424E-3,0.09150227487935471,0.004388015186795047,-1.430207273168338E-3,1.430207273168338E-3,4.5792750472400446E-4,null,{"$f":"M14+dx","v":0.105},0,{"$f":"IF(xx<=x0,O14+dx,O14)","v":0.105},{"$f":"N16","v":0},0,0,0,0,0,0]
[null,null,0.2250000000000001,0.010256655275235973,6.0039706874922107E-4,2.4772646434928695E-3,0.09854729322922953,5.353470853588671E-3,-1.8792463460707287E-3,1.8792463460707287E-3,5.9801829742214081E-4,null,{"$f":"M16","v":0.105},{"$f":"IF(pop=1,xx^p*EXP(cc*xx),IF(pop=2,xx^p*SIN(cc*xx),xx^p*COS(cc*xx)))","v":1.1321930376575419E-3},{"$f":"O16","v":0.105},{"$f":"IF(xx<=x0,IF(pop=1,xx^p*EXP(cc*xx),IF(pop=2,xx^p*SIN(cc*xx),xx^p*COS(cc*xx))),P15)","v":1.1321930376575419E-3},{"$f":"IF(xx<=x0,IF(pop=1,xx^p*EXP(cc*xx)/cc,IF(pop=2,(-1)*xx^p*(COS(cc*xx))/cc,xx^p*SIN(cc*xx)/cc)),Q15)","v":1.2065919577967048E-4},{"$f":"IF(p=1,EXP(cc*xx)/cc^2-EXP(a*xx)/cc^2,IF(p=2,EXP(cc*xx)*(2*xx/cc^2-1/cc^3)-EXP(a*cc)*(2*a/cc^2-1/cc^3),EXP(cc*xx)*(-3*xx^2/cc^2+6*xx/cc^3-3/cc^4))-EXP(cc*a)*(-3*a^2/cc^2+6*a/cc^3-3/cc^4))","v":0.04313653552143684},{"$f":"IF(p=1,(SIN(cc*xx))/cc^2-SIN(a*cc)/cc^2,IF(p=2, 2*xx/cc^2*SIN(cc*xx)+2/cc^3*COS(cc*xx)-  2*a/cc^2*SIN(cc*a)+2/cc^3*COS(cc*a),  6*xx/cc^3*COS(cc*xx)+3/cc^4*(cc^2*xx^2-2)*SIN(cc*xx)  -  6*a/cc^3*COS(cc*xx)+3/cc^4*(cc^2*a^2-2)*SIN(cc*a)  ))","v":5.7117488909176617E-4},{"$f":"IF(p=1,COS(cc*xx)/cc^2-COS(cc*a)/cc^2,\nIF(p=2,(-2/cc^3*SIN(cc*xx)+2*xx/cc^2*COS(cc*xx)+2/cc^3*SIN(cc*a)\n-2*a/cc^2*COS(cc*a)),\n(-6*xx/cc^3*SIN(cc*xx)+(3*xx^2/cc^2-6/cc^4)*COS(cc*xx)\n+6*a/cc^3*SIN(cc*a)-(3*a^2/cc^2-6/cc^4)*COS(cc*a)))\n)","v":-9.0717008310647884E-5},{"$f":"IF(xx<=x0,(-1)*IF(pop=1,R17,IF(pop=2,S17,T17)),U15)","v":9.0717008310647884E-5},{"$f":"IF(xx<=x0,Q17-U17,V15)","v":2.9942187469022598E-5}]
["Second graph",null,0.2400000000000001,0.012261817812500837,7.6928561690724716E-4,0.003191817661342735,0.10556502780882035,0.006440755655607117,-2.4251669756334415E-3,2.4251669756334415E-3,7.666506857092934E-4,null,{"$f":"M16+dx","v":0.12},0,{"$f":"IF(xx<=x0,O16+dx,O16)","v":0.12},{"$f":"N18","v":0},0,0,0,0,0,0]
[{"$f":"x0","v":2.58},0,0.2550000000000001,0.014471303960464588,9.6978403020448779E-4,0.004047324998516543,0.11253067201752996,0.00765371361508041,-3.0804301262640776E-3,3.0804301262640776E-3,0.000966894872252465,null,{"$f":"M18","v":0.12},{"$f":"IF(pop=1,xx^p*EXP(cc*xx),IF(pop=2,xx^p*SIN(cc*xx),xx^p*COS(cc*xx)))","v":1.6784720205443072E-3},{"$f":"O18","v":0.12},{"$f":"IF(xx<=x0,IF(pop=1,xx^p*EXP(cc*xx),IF(pop=2,xx^p*SIN(cc*xx),xx^p*COS(cc*xx))),P17)","v":1.6784720205443072E-3},{"$f":"IF(xx<=x0,IF(pop=1,xx^p*EXP(cc*xx)/cc,IF(pop=2,(-1)*xx^p*(COS(cc*xx))/cc,xx^p*SIN(cc*xx)/cc)),Q17)","v":2.0537506923304426E-4},{"$f":"IF(p=1,EXP(cc*xx)/cc^2-EXP(a*xx)/cc^2,IF(p=2,EXP(cc*xx)*(2*xx/cc^2-1/cc^3)-EXP(a*cc)*(2*a/cc^2-1/cc^3),EXP(cc*xx)*(-3*xx^2/cc^2+6*xx/cc^3-3/cc^4))-EXP(cc*a)*(-3*a^2/cc^2+6*a/cc^3-3/cc^4))","v":0.049823717020191866},{"$f":"IF(p=1,(SIN(cc*xx))/cc^2-SIN(a*cc)/cc^2,IF(p=2, 2*xx/cc^2*SIN(cc*xx)+2/cc^3*COS(cc*xx)-  2*a/cc^2*SIN(cc*a)+2/cc^3*COS(cc*a),  6*xx/cc^3*COS(cc*xx)+3/cc^4*(cc^2*xx^2-2)*SIN(cc*xx)  -  6*a/cc^3*COS(cc*xx)+3/cc^4*(cc^2*a^2-2)*SIN(cc*a)  ))","v":8.4912119192025182E-4},{"$f":"IF(p=1,COS(cc*xx)/cc^2-COS(cc*a)/cc^2,\nIF(p=2,(-2/cc^3*SIN(cc*xx)+2*xx/cc^2*COS(cc*xx)+2/cc^3*SIN(cc*a)\n-2*a/cc^2*COS(cc*a)),\n(-6*xx/cc^3*SIN(cc*xx)+(3*xx^2/cc^2-6/cc^4)*COS(cc*xx)\n+6*a/cc^3*SIN(cc*a)-(3*a^2/cc^2-6/cc^4)*COS(cc*a)))\n)","v":-1.5452681955130387E-4},{"$f":"IF(xx<=x0,(-1)*IF(pop=1,R19,IF(pop=2,S19,T19)),U17)","v":1.5452681955130387E-4},{"$f":"IF(xx<=x0,Q19-U19,V17)","v":5.0848249681740383E-5}]
[{"$f":"x0","v":2.58},{"$f":"LOOKUP(x0+dx/2,C$2:C$202,E$2:E$202)","v":-3.6222785586703874},0.27000000000000013,0.016882279975284176,1.2049359097226035E-3,5.059869361854122E-3,0.11941742774281579,0.008995396449890947,-3.8580716676223648E-3,3.8580716676223648E-3,1.2017976942317573E-3,null,{"$f":"M18+dx","v":0.135},0,{"$f":"IF(xx<=x0,O18+dx,O18)","v":0.135},{"$f":"N20","v":0},0,0,0,0,0,0]
{"$rows_left_out":382}
{"sheet":"Sheet3","index":2,"n_rows":0,"n_cols":0,"rows_kept":0}