{"text_format":"3","workbook":"xlsx","n_sheets":3,"sheets":["Sine","Tangent","Sheet2"],"not_rendered":{"charts":6,"images":6,"defined_names":30,"comments":2},"read":"whole","date_system":"1900"}

{"sheet":"Sine","index":0,"n_rows":42,"n_cols":19,"rows_kept":42}
[null,"       Visualizing Trig Substitutions"]
[]
[null,null,"    This DIGMath spreadsheet lets you"]
[null,null,"               visualize the process of"]
[null,null,"      Integration with Trig Substitutions"]
[null,null,"              for a function of the form:"]
[]
[]
[]
[]
["What is the value of the constant a?",null,null,3]
[]
["What is the value of the constant b?",null,null,2]
[{"$nulls":9},"Pick a tracing point x0 =",null,null,{"$f":"a+K15*dx","v":0.5}]
["           Your subsitution is then x = ",null,null,{"$f":"TEXT(a0/b0,\"0.00\")","v":"1.50"},{"$nulls":6},150]
[null,null,"          so that   dx  =",{"$f":"TEXT(a0/b0,\"0.00\")","v":"1.50"}]
[{"$nulls":9},"The corresponding transformed point is ",{"$nulls":5},{"$f":"LOOKUP(x0,Sheet2!C3:C202,Sheet2!F3:F202)","v":0.33277459985167746},"= q"]
["What is the interval for x for display?  ",null,null,{"$f":"\"  It must be within \"&TEXT(-a0/b0,\"0.00\")& \" to \"&TEXT(a0/b0,\"0.00\")","v":"  It must be within -1.50 to 1.50"}]
[null,null,"xMin =",-1,{"$f":"IF(a<-a0/b0,\"Must be larger than \"&TEXT(-a0/b0,\"0.00\"),\"\")","v":""},{"$nulls":4}," The area from x =",null,{"$f":"a","v":-1},"to x =",{"$f":"x0","v":0.5},"=",{"$f":"LOOKUP(x0+dx/2,Sheet2!$C$3:$C$203,Sheet2!E$3:E$203)","v":{"v":0.5347860007439358,"d":"0.535"}}]
[null,null,"xMax =",1,{"$f":"IF(b>a0/b0,\"Must be smaller than \"&TEXT(a0/b0,\"0.00\"),\"\")","v":""}]
[]
[null,"This corresponds to:",{"$nulls":13},"The area  under the transformed graph"]
[null,null,"q Min  =",{"$f":"theta0","v":{"v":-0.7297276562269663,"d":"-0.730"}},"radians",{"$nulls":10},"from q =",{"$f":"theta0","v":{"v":-0.7297276562269663,"d":"-0.730"}},"to q =",{"$f":"th0","v":{"v":0.33277459985167746,"d":"0.333"}}]
[null,null,"q Max  =",{"$f":"theta00","v":{"v":0.7297276562269663,"d":"0.730"}},"radians",{"$nulls":11},"is about",{"$f":"LOOKUP(ATAN(b0/a0*x0)+0.001,Sheet2!F3:F203,Sheet2!H3:H203)","v":{"v":0.5242143779103192,"d":"0.524"}}]
[]
[]
["Click each item below for suggestions and investigations"]
[null,null,"   Item 1"]
[null,null,"   Item 2"]
[null,null,"   Item 3"]
{"$rows_left_out":13}
{"sheet":"Tangent","index":1,"n_rows":43,"n_cols":19,"rows_kept":43}
[null,"             Visualizing Trig Substitutions"]
[]
[null,null,"    This DIGMath spreadsheet lets you"]
[null,null,"               visualize the process of"]
[null,null,"      Integration with Trig Substitutions"]
[null,null,"              for a function of the form:"]
[]
[]
[]
[]
["What is the value of the constant a?",null,null,3]
[]
["What is the value of the constant b?",null,null,2]
[{"$nulls":9},"Pick a tracing point x0 =",null,null,{"$f":"aa+K15*dxx","v":1}]
["              Your substitution is then x = ",null,null,{"$f":"TEXT(a00/b00,\"0.00\")","v":"1.50"},"tan q",{"$nulls":5},150]
[null,null,"          so that   dx  =",{"$f":"TEXT(a00/b00,\"0.00\")","v":"1.50"},"sec2q dq"]
[{"$nulls":9},"The corresponding transformed point is ",{"$nulls":5},{"$f":"LOOKUP(x00,Sheet2!S3:S203,Sheet2!V3:V203)","v":0.5787149449132},"= q"]
["What is the interval for x for display?  ",null,null,{"$f":"\"  It must be within \"&TEXT(-1.3*a00/b00,\"0.00\")& \" to \"&TEXT(1.3*a00/b00,\"0.00\")","v":"  It must be within -1.95 to 1.95"}]
[null,null,"xMin =",-2,{"$f":"IF(aa<-1.3*a00/b00,\"Must be larger than \"&TEXT(-1.3*a00/b00,\"0.00\"),\"\")","v":"Must be larger than -1.95"},{"$nulls":4}," The area from x =",null,{"$f":"aa","v":-2},"to x =",{"$f":"x00","v":1},"is",{"$f":"LOOKUP(x00+dxx/2,Sheet2!$S$3:$S$203,Sheet2!U$3:U$203)","v":{"v":0.8618737249853202,"d":"0.862"}}]
[null,null,"xMax =",2]
[]
[null,"This corresponds to:",{"$nulls":13},"The area  under the transformed graph"]
[null,null,"q Min  =",{"$f":"ttheta0","v":{"v":-0.9272952180016122,"d":"-0.927"}},"radians",{"$nulls":10},"from q =",{"$f":"ttheta0","v":{"v":-0.9272952180016122,"d":"-0.927"}},"to q =",{"$f":"th00","v":{"v":0.5787149449132,"d":"0.579"}}]
[null,null,"q Max  =",{"$f":"ttheta00","v":{"v":0.9272952180016122,"d":"0.927"}},"radians",{"$nulls":11},"is about",{"$f":"LOOKUP(ATAN(b00/a00*x00)+0.001,Sheet2!V3:V203,Sheet2!X3:X203)","v":{"v":0.8618904233077969,"d":"0.862"}}]
[]
[]
["Click each item below for suggestions and investigations"]
[null,null,"   Item 1"]
[null,null,"   Item 2"]
[null,null,"   Item 3"]
{"$rows_left_out":14}
{"sheet":"Sheet2","index":2,"n_rows":403,"n_cols":31,"rows_kept":403}
[{"$nulls":6},"SINE",{"$nulls":15},"TANGENT"]
[null,null,"x","f(x)","Area","q ","f(q )","Area",null,"xx","f(xx)","sweep x","sweep y","q ","f(q )",{"$nulls":3},"xxx","f(x)","Area","q ","f(q )","Area",null,"xxxx","f(xx)","sweep x","sweep y","q ","f(q )"]
[null,null,{"$f":"a","v":-1},{"$f":"1/SQRT(a0^2-b0^2*x^2)","v":0.4472135954999579},0,{"$f":"theta0","v":-0.7297276562269663},{"$f":"1/b0","v":0.5},0,null,{"$f":"C3","v":-1},0,{"$f":"J3","v":-1},{"$f":"K3","v":0},{"$f":"theta0","v":-0.7297276562269663},0,{"$nulls":3},{"$f":"aa","v":-2},{"$f":"1/SQRT(a00^2+b00^2*xxx^2)","v":0.2},0,{"$f":"ttheta0","v":-0.9272952180016122},{"$f":"1/b00/COS(t)","v":0.8333333333333333},0,null,{"$f":"S3","v":-2},0,{"$f":"Z3","v":-2},{"$f":"AA3","v":0},{"$f":"ttheta0","v":-0.9272952180016122},0]
[null,null,{"$f":"C3+dx","v":-0.99},0.44369572338750174,{"$f":"E3+(D3+D4)*dx/2","v":0.004454546594437299},{"$f":"ASIN(b0/a0*x)","v":-0.7208187608700896},0.5,{"$f":"H3+(G3+G4)*(F4-F3)/2","v":0.004454447678438389},null,{"$f":"J3","v":-1},{"$f":"1/SQRT(a0^2-b0^2*xx^2)","v":0.4472135954999579},{"$f":"L3","v":-1},{"$f":"K4","v":0.4472135954999579},{"$f":"N3","v":-0.7297276562269663},{"$f":"G3","v":0.5},{"$nulls":3},{"$f":"S3+dxx","v":-1.98},0.20128589599848745,{"$f":"U3+(T3+T4)*dxx/2","v":0.004012858959984875},{"$f":"ATAN(b00/a00*xxx)","v":-0.9224643377076359},0.828009661779378,{"$f":"X3+(W3+W4)*(V4-V3)/2","v":4.012874568312755E-3},null,{"$f":"Z3","v":-2},{"$f":"1/SQRT(a00^2+b00^2*xxxx^2)","v":0.2},{"$f":"AB3","v":-2},{"$f":"AA4","v":0.2},{"$f":"AD3","v":-0.9272952180016122},{"$f":"W3","v":0.8333333333333333}]
[null,null,-0.98,0.44029372104771675,0.008874493816613392,-0.7119790549125672,0.5,{"$f":"H4+(G4+G5)*(F5-F4)/2","v":0.008874300657199574},null,{"$f":"J3+dx","v":-0.99},0,{"$f":"IF(xx<=x0,L3+dx,L3)","v":-0.99},{"$f":"K5","v":0},{"$f":"IF(xx<=x0,ASIN(b0/a0*xx),N3)","v":-0.7208187608700896},0,{"$nulls":3},-1.96,0.20258361439690944,0.008051554063938843,-0.9175710512593592,0.8227055636401425,{"$f":"X4+(W4+W5)*(V5-V4)/2","v":0.008051585789567425},null,{"$f":"Z3+dxx","v":-1.98},0,{"$f":"IF(xxxx<=x00,AB3+dxx,AB3)","v":-1.98},{"$f":"AA5","v":0},{"$f":"IF(xxxx<=x00,ATAN(b00/a00*xxxx),AD3)","v":-0.9224643377076359},0]
[null,null,-0.97,0.43700216937155384,0.013260973268709744,-0.703206275769447,0.5,0.013260690228759642,null,{"$f":"J5","v":-0.99},{"$f":"1/SQRT(a0^2-b0^2*xx^2)","v":0.44369572338750174},{"$f":"L5","v":-0.99},{"$f":"IF(xx<=x0,1/SQRT(a0^2-b0^2*xx^2),M4)","v":0.44369572338750174},{"$f":"N5","v":-0.7208187608700896},{"$f":"O4","v":0.5},{"$nulls":3},-1.94,0.2038931970717981,0.012116322178625918,-0.9126143804653363,0.8174214199406434,0.01211637054856935,null,{"$f":"Z5","v":-1.98},{"$f":"1/SQRT(a00^2+b00^2*xxxx^2)","v":0.20128589599848745},{"$f":"AB5","v":-1.98},{"$f":"IF(xxxx<=x00,1/SQRT(a00^2+b00^2*xxxx^2),AC4)","v":0.20128589599848745},{"$f":"AD5","v":-0.9224643377076359},{"$f":"IF(xxxx<=x00,1/b00/COS(tt),AE4)","v":0.828009661779378}]
[null,null,-0.96,0.433816005246128,0.017615064141798153,-0.6944982656265558,0.5,0.017614695300205263,null,{"$f":"J5+dx","v":-0.98},0,{"$f":"IF(xx<=x0,L5+dx,L5)","v":-0.98},{"$f":"K7","v":0},{"$f":"IF(xx<=x0,ASIN(b0/a0*xx),N5)","v":-0.7119790549125672},0,{"$nulls":3},-1.92,0.20521468065743836,0.016207400955918282,-0.9075933340888033,0.812157620169878,0.016207466515879877,null,{"$f":"Z5+dxx","v":-1.96},0,{"$f":"IF(xxxx<=x00,AB5+dxx,AB5)","v":-1.96},{"$f":"AA7","v":0},{"$f":"IF(xxxx<=x00,ATAN(b00/a00*xxxx),AD5)","v":-0.9175710512593592},0]
[{"$f":"a","v":-1},null,-0.95,0.430730492253948,0.021937796629298532,-0.6858529646187107,0.5,0.021937345804127817,null,{"$f":"J7","v":-0.98},{"$f":"1/SQRT(a0^2-b0^2*xx^2)","v":0.44029372104771675},{"$f":"L7","v":-0.98},{"$f":"IF(xx<=x0,1/SQRT(a0^2-b0^2*xx^2),M6)","v":0.44029372104771675},{"$f":"N7","v":-0.7119790549125672},{"$f":"O6","v":0.5},null,{"$f":"a","v":-1},null,-1.9,0.2065480961930069,0.020325028724422736,-0.9025069079643125,0.8069145624606802,0.020325112039464025,null,{"$f":"Z7","v":-1.96},{"$f":"1/SQRT(a00^2+b00^2*xxxx^2)","v":0.20258361439690944},{"$f":"AB7","v":-1.96},{"$f":"IF(xxxx<=x00,1/SQRT(a00^2+b00^2*xxxx^2),AC6)","v":0.20258361439690944},{"$f":"AD7","v":-0.9175710512593592},{"$f":"IF(xxxx<=x00,1/b00/COS(tt),AE6)","v":0.8227055636401425}]
[{"$f":"b","v":1},null,-0.94,0.4277411942682218,0.026230155061909382,-0.6772684045643949,0.5,0.02622962583128574,null,{"$f":"J7+dx","v":-0.97},0,{"$f":"IF(xx<=x0,L7+dx,L7)","v":-0.97},{"$f":"K9","v":0},{"$f":"IF(xx<=x0,ASIN(b0/a0*xx),N7)","v":-0.703206275769447},0,null,{"$f":"b","v":1},null,-1.88,0.20789346875340156,0.02446944437388682,-0.8973540851399052,0.8016926537714507,0.024469546029117648,null,{"$f":"Z7+dxx","v":-1.94},0,{"$f":"IF(xxxx<=x00,AB7+dxx,AB7)","v":-1.94},{"$f":"AA9","v":0},{"$f":"IF(xxxx<=x00,ATAN(b00/a00*xxxx),AD7)","v":-0.9126143804653363},0]
[null,null,-0.9299999999999999,0.42484395161215144,0.030493080791311248,-0.6687427032023716,0.5,0.030492476512297362,null,{"$f":"J9","v":-0.97},{"$f":"1/SQRT(a0^2-b0^2*xx^2)","v":0.43700216937155384},{"$f":"L9","v":-0.97},{"$f":"IF(xx<=x0,1/SQRT(a0^2-b0^2*xx^2),M8)","v":0.43700216937155384},{"$f":"N9","v":-0.703206275769447},{"$f":"O8","v":0.5},{"$nulls":3},-1.8599999999999999,0.20925081706326057,0.028640887232053443,-0.8921338360465839,0.7964923100695951,0.02864100783334313,null,{"$f":"Z9","v":-1.94},{"$f":"1/SQRT(a00^2+b00^2*xxxx^2)","v":0.2038931970717981},{"$f":"AB9","v":-1.94},{"$f":"IF(xxxx<=x00,1/SQRT(a00^2+b00^2*xxxx^2),AC8)","v":0.2038931970717981},{"$f":"AD9","v":-0.9126143804653363},{"$f":"IF(xxxx<=x00,1/b00/COS(tt),AE8)","v":0.8174214199406434}]
["dx =",null,-0.9199999999999999,0.42203485949329966,0.0347274748468385,-0.6602740588819114,0.5,0.03472679867252748,null,{"$f":"J9+dx","v":-0.96},0,{"$f":"IF(xx<=x0,L9+dx,L9)","v":-0.96},{"$f":"K11","v":0},{"$f":"IF(xx<=x0,ASIN(b0/a0*xx),N9)","v":-0.6944982656265558},0,null,"dxx =",null,-1.8399999999999999,0.210620153093678,0.03283959693362283,-0.8868451186969318,0.7913139565164876,0.03283973710833319,null,{"$f":"Z9+dxx","v":-1.92},0,{"$f":"IF(xxxx<=x00,AB9+dxx,AB9)","v":-1.92},{"$f":"AA11","v":0},{"$f":"IF(xxxx<=x00,ATAN(b00/a00*xxxx),AD9)","v":-0.9075933340888033},0]
[{"$f":"(b-a)/200","v":0.01},null,-0.9099999999999999,0.4193102484610279,0.03893420038661014,-0.6518607456637092,0.5,0.03893345528162856,null,{"$f":"J11","v":-0.96},{"$f":"1/SQRT(a0^2-b0^2*xx^2)","v":0.433816005246128},{"$f":"L11","v":-0.96},{"$f":"IF(xx<=x0,1/SQRT(a0^2-b0^2*xx^2),M10)","v":0.433816005246128},{"$f":"N11","v":-0.6944982656265558},{"$f":"O10","v":0.5},null,{"$f":"(bb-aa)/200","v":0.02},null,-1.8199999999999998,0.21200148164113236,0.03706581328097094,-0.8814868789148151,0.7861580276537563,0.037065973678710964,null,{"$f":"Z11","v":-1.92},{"$f":"1/SQRT(a00^2+b00^2*xxxx^2)","v":0.20521468065743836},{"$f":"AB11","v":-1.92},{"$f":"IF(xxxx<=x00,1/SQRT(a00^2+b00^2*xxxx^2),AC10)","v":0.20521468065743836},{"$f":"AD11","v":-0.9075933340888033},{"$f":"IF(xxxx<=x00,1/b00/COS(tt),AE10)","v":0.812157620169878}]
[null,null,-0.8999999999999999,0.41666666666666663,0.04311408496224861,-0.6435011087932843,0.5,0.04311327371684104,null,{"$f":"J11+dx","v":-0.95},0,{"$f":"IF(xx<=x0,L11+dx,L11)","v":-0.95},{"$f":"K13","v":0},{"$f":"IF(xx<=x0,ASIN(b0/a0*xx),N11)","v":-0.6858529646187107},0,{"$nulls":3},-1.7999999999999998,0.21339479988815996,0.04131977609626386,-0.8760580505981933,0.7810249675906653,0.04131995738966653,null,{"$f":"Z11+dxx","v":-1.9},0,{"$f":"IF(xxxx<=x00,AB11+dxx,AB11)","v":-1.9},{"$f":"AA13","v":0},{"$f":"IF(xxxx<=x00,ATAN(b00/a00*xxxx),AD11)","v":-0.9025069079643125},0]
[null,null,-0.8899999999999999,0.41410086373331056,0.047267922614248496,-0.6351935605127755,0.5,0.0472670478570954,null,{"$f":"J13","v":-0.95},{"$f":"1/SQRT(a0^2-b0^2*xx^2)","v":0.430730492253948},{"$f":"L13","v":-0.95},{"$f":"IF(xx<=x0,1/SQRT(a0^2-b0^2*xx^2),M12)","v":0.430730492253948},{"$f":"N13","v":-0.6858529646187107},{"$f":"O12","v":0.5},{"$nulls":3},-1.7799999999999998,0.21480009694532007,0.04560172506459866,-0.870557556017155,0.7759152301923481,0.04560192795011961,null,{"$f":"Z13","v":-1.9},{"$f":"1/SQRT(a00^2+b00^2*xxxx^2)","v":0.2065480961930069},{"$f":"AB13","v":-1.9},{"$f":"IF(xxxx<=x00,1/SQRT(a00^2+b00^2*xxxx^2),AC12)","v":0.2065480961930069},{"$f":"AD13","v":-0.9025069079643125},{"$f":"IF(xxxx<=x00,1/b00/COS(tt),AE12)","v":0.8069145624606802}]
["First graph",null,-0.8799999999999999,0.4116097760656063,0.05139647581324308,-0.6269365761806794,0.5,0.05139554002314345,null,{"$f":"J13+dx","v":-0.94},0,{"$f":"IF(xx<=x0,L13+dx,L13)","v":-0.94},{"$f":"K15","v":0},{"$f":"IF(xx<=x0,ASIN(b0/a0*xx),N13)","v":-0.6772684045643949},0,null,"First graph",null,-1.7599999999999998,0.21621735337402342,0.0499118995677921,-0.864984306149388,0.7708292792686184,0.04991212476653092,null,{"$f":"Z13+dxx","v":-1.88},0,{"$f":"IF(xxxx<=x00,AB13+dxx,AB13)","v":-1.88},{"$f":"AA15","v":0},{"$f":"IF(xxxx<=x00,ATAN(b00/a00*xxxx),AD13)","v":-0.8973540851399052},0]
[{"$f":"x0","v":0.5},0,-0.8699999999999999,0.4091905134501969,0.0555004772608221,-0.6187286906722509,0.5,0.05549948277735772,null,{"$f":"J15","v":-0.94},{"$f":"1/SQRT(a0^2-b0^2*xx^2)","v":0.4277411942682218},{"$f":"L15","v":-0.94},{"$f":"IF(xx<=x0,1/SQRT(a0^2-b0^2*xx^2),M14)","v":0.4277411942682218},{"$f":"N15","v":-0.6772684045643949},{"$f":"O14","v":0.5},null,{"$f":"x00","v":1},0,-1.7399999999999998,0.21764654068982092,0.05425053850843054,-0.8593372010553886,0.7657675887630658,0.05425078676697359,null,{"$f":"Z15","v":-1.88},{"$f":"1/SQRT(a00^2+b00^2*xxxx^2)","v":0.20789346875340156},{"$f":"AB15","v":-1.88},{"$f":"IF(xxxx<=x00,1/SQRT(a00^2+b00^2*xxxx^2),AC14)","v":0.20789346875340156},{"$f":"AD15","v":-0.8973540851399052},{"$f":"IF(xxxx<=x00,1/b00/COS(tt),AE14)","v":0.8016926537714507}]
[{"$f":"x0","v":0.5},{"$f":"LOOKUP(x0+dx/2,C3:C203,D3:D203)","v":0.35355339059327384},-0.8599999999999999,0.4068403468150745,0.059580631562148455,-0.610568495036099,0.5,0.05957958059543367,null,{"$f":"J15+dx","v":-0.9299999999999999},0,{"$f":"IF(xx<=x0,L15+dx,L15)","v":-0.9299999999999999},{"$f":"K17","v":0},{"$f":"IF(xx<=x0,ASIN(b0/a0*xx),N15)","v":-0.6687427032023716},0,null,{"$f":"x00","v":1},{"$f":"LOOKUP(x00+dxx/2,S3:S203,T3:T203)","v":0.2773500981126144},-1.7199999999999998,0.21908762084577996,0.05861788012378655,-0.8536151302958045,0.7607306429421067,0.05861815221507208,null,{"$f":"Z15+dxx","v":-1.8599999999999999},0,{"$f":"IF(xxxx<=x00,AB15+dxx,AB15)","v":-1.8599999999999999},{"$f":"AA17","v":0},{"$f":"IF(xxxx<=x00,ATAN(b00/a00*xxxx),AD15)","v":-0.8921338360465839},0]
[null,null,-0.8499999999999999,0.40455669703136743,0.06363761678138066,-0.6024546333849903,0.5,0.06363651142098803,null,{"$f":"J17","v":-0.9299999999999999},{"$f":"1/SQRT(a0^2-b0^2*xx^2)","v":0.42484395161215144},{"$f":"L17","v":-0.9299999999999999},{"$f":"IF(xx<=x0,1/SQRT(a0^2-b0^2*xx^2),M16)","v":0.42484395161215144},{"$f":"N17","v":-0.6687427032023716},{"$f":"O16","v":0.5},{"$nulls":3},-1.6999999999999997,0.22054054569561546,0.0630141617892005,-0.8478169733934056,0.7557189365836422,0.06301445851340567,null,{"$f":"Z17","v":-1.8599999999999999},{"$f":"1/SQRT(a00^2+b00^2*xxxx^2)","v":0.20925081706326057},{"$f":"AB17","v":-1.8599999999999999},{"$f":"IF(xxxx<=x00,1/SQRT(a00^2+b00^2*xxxx^2),AC16)","v":0.20925081706326057},{"$f":"AD17","v":-0.8921338360465839},{"$f":"IF(xxxx<=x00,1/b00/COS(tt),AE16)","v":0.7964923100695951}]
["Second graph",null,-0.8399999999999999,0.4023371246543896,0.06767208588980944,-0.594385800001062,0.5,0.06767092811295217,null,{"$f":"J17+dx","v":-0.9199999999999999},0,{"$f":"IF(xx<=x0,L17+dx,L17)","v":-0.9199999999999999},{"$f":"K19","v":0},{"$f":"IF(xx<=x0,ASIN(b0/a0*xx),N17)","v":-0.6602740588819114},0,null,"Second graph",null,-1.6799999999999997,0.22200525643628416,0.06743961981051949,-0.8419416003422655,0.7507329751649382,0.06743994199596869,null,{"$f":"Z17+dxx","v":-1.8399999999999999},0,{"$f":"IF(xxxx<=x00,AB17+dxx,AB17)","v":-1.8399999999999999},{"$f":"AA19","v":0},{"$f":"IF(xxxx<=x00,ATAN(b00/a00*xxxx),AD17)","v":-0.8868451186969318},0]
[{"$f":"x0","v":0.5},0,-0.8299999999999998,0.40017932051238597,0.07168466811564332,-0.5863607366375918,0.5,0.07168345979468727,null,{"$f":"J19","v":-0.9199999999999999},{"$f":"1/SQRT(a0^2-b0^2*xx^2)","v":0.42203485949329966},{"$f":"L19","v":-0.9199999999999999},{"$f":"IF(xx<=x0,1/SQRT(a0^2-b0^2*xx^2),M18)","v":0.42203485949329966},{"$f":"N19","v":-0.6602740588819114},{"$f":"O18","v":0.5},null,{"$f":"x00","v":1},0,-1.6599999999999997,0.22348168302980045,0.07189448920518034,-0.8359878721668329,0.7457732750493127,0.07189483770927448,null,{"$f":"Z19","v":-1.8399999999999999},{"$f":"1/SQRT(a00^2+b00^2*xxxx^2)","v":0.210620153093678},{"$f":"AB19","v":-1.8399999999999999},{"$f":"IF(xxxx<=x00,1/SQRT(a00^2+b00^2*xxxx^2),AC18)","v":0.210620153093678},{"$f":"AD19","v":-0.8868451186969318},{"$f":"IF(xxxx<=x00,1/b00/COS(tt),AE18)","v":0.7913139565164876}]
[{"$f":"x0","v":0.5},{"$f":"LOOKUP(x0+dx/2,C$3:C$203,E$3:E$203)","v":0.5347860007439358},-0.8199999999999998,0.39808109706155126,0.07567597020351301,-0.5783782300012036,0.5,0.07567471311288138,null,{"$f":"J19+dx","v":-0.9099999999999999},0,{"$f":"IF(xx<=x0,L19+dx,L19)","v":-0.9099999999999999},{"$f":"K21","v":0},{"$f":"IF(xx<=x0,ASIN(b0/a0*xx),N19)","v":-0.6518607456637092},0,null,{"$f":"x00","v":1},{"$f":"LOOKUP(x00+dxx/2,S$3:S$203,U$3:U$203)","v":0.8618737249853202},-1.6399999999999997,0.22496974360409108,0.07637900347151926,-0.829954641533658,0.7408403636711787,0.07637937918168647,null,{"$f":"Z19+dxx","v":-1.8199999999999998},0,{"$f":"IF(xxxx<=x00,AB19+dxx,AB19)","v":-1.8199999999999998},{"$f":"AA21","v":0},{"$f":"IF(xxxx<=x00,ATAN(b00/a00*xxxx),AD19)","v":-0.8814868789148151},0]
[null,null,-0.8099999999999998,0.39604038043479783,0.07964657759099475,-0.5704371093999216,0.5,0.07964527341352234,null,{"$f":"J21","v":-0.9099999999999999},{"$f":"1/SQRT(a0^2-b0^2*xx^2)","v":0.4193102484610279},{"$f":"L21","v":-0.9099999999999999},{"$f":"IF(xx<=x0,1/SQRT(a0^2-b0^2*xx^2),M20)","v":0.4193102484610279},{"$f":"N21","v":-0.6518607456637092},{"$f":"O20","v":0.5},{"$nulls":3},-1.6199999999999997,0.22646934383276834,0.08089339434588785,-0.8238407534186362,0.7359347797189638,0.08089379818055284,null,{"$f":"Z21","v":-1.8199999999999998},{"$f":"1/SQRT(a00^2+b00^2*xxxx^2)","v":0.21200148164113236},{"$f":"AB21","v":-1.8199999999999998},{"$f":"IF(xxxx<=x00,1/SQRT(a00^2+b00^2*xxxx^2),AC20)","v":0.21200148164113236},{"$f":"AD21","v":-0.8814868789148151},{"$f":"IF(xxxx<=x00,1/b00/COS(tt),AE20)","v":0.7861580276537563}]
["Third graph",null,-0.7999999999999998,0.3940552031195503,0.08359705550876649,-0.5625362445438554,0.5,0.08359570584155546,null,{"$f":"J21+dx","v":-0.8999999999999999},0,{"$f":"IF(xx<=x0,L21+dx,L21)","v":-0.8999999999999999},{"$f":"K23","v":0},{"$f":"IF(xx<=x0,ASIN(b0/a0*xx),N21)","v":-0.6435011087932843},0,null,"Third graph",null,-1.5999999999999996,0.22798037629377663,0.0854378915471533,-0.8176450458327021,0.731057073315377,0.08543832445672697,null,{"$f":"Z21+dxx","v":-1.7999999999999998},0,{"$f":"IF(xxxx<=x00,AB21+dxx,AB21)","v":-1.7999999999999998},{"$f":"AA23","v":0},{"$f":"IF(xxxx<=x00,ATAN(b00/a00*xxxx),AD21)","v":-0.8760580505981933},0]
[{"$f":"th0","v":0.33277459985167746},0,-0.7899999999999998,0.3921236972067164,0.08752795001039783,-0.5546745434865271,0.5,0.08752655637021961,null,{"$f":"J23","v":-0.8999999999999999},{"$f":"1/SQRT(a0^2-b0^2*xx^2)","v":0.41666666666666663},{"$f":"L23","v":-0.8999999999999999},{"$f":"IF(xx<=x0,1/SQRT(a0^2-b0^2*xx^2),M22)","v":0.41666666666666663},{"$f":"N23","v":-0.6435011087932843},{"$f":"O22","v":0.5},null,{"$f":"th00","v":0.5787149449132},0,-1.5799999999999996,0.22950271980694795,0.09001272250816054,-0.8113663506090045,0.726207806194465,0.09001318547604734,null,{"$f":"Z23","v":-1.7999999999999998},{"$f":"1/SQRT(a00^2+b00^2*xxxx^2)","v":0.21339479988815996},{"$f":"AB23","v":-1.7999999999999998},{"$f":"IF(xxxx<=x00,1/SQRT(a00^2+b00^2*xxxx^2),AC22)","v":0.21339479988815996},{"$f":"AD23","v":-0.8760580505981933},{"$f":"IF(xxxx<=x00,1/b00/COS(tt),AE22)","v":0.7810249675906653}]
[{"$f":"A24","v":0.33277459985167746},{"$f":"LOOKUP(x0+dx/2,C$3:C$203,G$3:G$203)","v":0.5},-0.7799999999999998,0.39024408815903916,0.09143978893722661,-0.5468509506959438,0.5,0.09143835276551127,null,{"$f":"J23+dx","v":-0.8899999999999999},0,{"$f":"IF(xx<=x0,L23+dx,L23)","v":-0.8899999999999999},{"$f":"K25","v":0},{"$f":"IF(xx<=x0,ASIN(b0/a0*xx),N23)","v":-0.6351935605127755},0,null,{"$f":"Q24","v":0.5787149449132},{"$f":"LOOKUP(x00+dxx/2,S$3:S$203,W$3:W$203)","v":0.6009252125773319},-1.5599999999999996,0.2310362387505949,0.09461811209373597,-0.8050034942546528,0.7213875518748571,0.09461860613735808,null,{"$f":"Z23+dxx","v":-1.7799999999999998},0,{"$f":"IF(xxxx<=x00,AB23+dxx,AB23)","v":-1.7799999999999998},{"$f":"AA25","v":0},{"$f":"IF(xxxx<=x00,ATAN(b00/a00*xxxx),AD23)","v":-0.870557556017155},0]
[null,null,-0.7699999999999998,0.38841468905237775,0.09533308282328369,-0.5390644452455008,0.5,0.09533160549073277,null,{"$f":"J25","v":-0.8899999999999999},{"$f":"1/SQRT(a0^2-b0^2*xx^2)","v":0.41410086373331056},{"$f":"L25","v":-0.8899999999999999},{"$f":"IF(xx<=x0,1/SQRT(a0^2-b0^2*xx^2),M24)","v":0.41410086373331056},{"$f":"N25","v":-0.6351935605127755},{"$f":"O24","v":0.5},{"$nulls":3},-1.5399999999999996,0.23258078235737026,0.09925428230481562,-0.7985552988702039,0.716596895828548,0.09925480847665324,null,{"$f":"Z25","v":-1.7799999999999998},{"$f":"1/SQRT(a00^2+b00^2*xxxx^2)","v":0.21480009694532007},{"$f":"AB25","v":-1.7799999999999998},{"$f":"IF(xxxx<=x00,1/SQRT(a00^2+b00^2*xxxx^2),AC24)","v":0.21480009694532007},{"$f":"AD25","v":-0.870557556017155},{"$f":"IF(xxxx<=x00,1/b00/COS(tt),AE24)","v":0.7759152301923481}]
["x vert",null,-0.7599999999999998,0.3866338952481992,0.09920832574478658,-0.5313140391156786,0.5,0.09920680855564384,null,{"$f":"J25+dx","v":-0.8799999999999999},0,{"$f":"IF(xx<=x0,L25+dx,L25)","v":-0.8799999999999999},{"$f":"K27","v":0},{"$f":"IF(xx<=x0,ASIN(b0/a0*xx),N25)","v":-0.6269365761806794},0,null,"x vert",null,-1.5199999999999996,0.23413618398973715,0.10392145196828668,-0.7920205831401159,0.7118364356445313,0.10392201135693283,null,{"$f":"Z25+dxx","v":-1.7599999999999998},0,{"$f":"IF(xxxx<=x00,AB25+dxx,AB25)","v":-1.7599999999999998},{"$f":"AA27","v":0},{"$f":"IF(xxxx<=x00,ATAN(b00/a00*xxxx),AD25)","v":-0.864984306149388},0]
[0,0,-0.7499999999999998,0.3849001794597504,0.10306599611832633,-0.5235987755982987,0.5,0.10306444031433382,null,{"$f":"J27","v":-0.8799999999999999},{"$f":"1/SQRT(a0^2-b0^2*xx^2)","v":0.4116097760656063},{"$f":"L27","v":-0.8799999999999999},{"$f":"IF(xx<=x0,1/SQRT(a0^2-b0^2*xx^2),M26)","v":0.4116097760656063},{"$f":"N27","v":-0.6269365761806794},{"$f":"O26","v":0.5},null,0,0,-1.4999999999999996,0.23570226039551592,0.10861983641213921,-0.7853981633974482,0.7071067811865475,0.10862043014336614,null,{"$f":"Z27","v":-1.7599999999999998},{"$f":"1/SQRT(a00^2+b00^2*xxxx^2)","v":0.21621735337402342},{"$f":"AB27","v":-1.7599999999999998},{"$f":"IF(xxxx<=x00,1/SQRT(a00^2+b00^2*xxxx^2),AC26)","v":0.21621735337402342},{"$f":"AD27","v":-0.864984306149388},{"$f":"IF(xxxx<=x00,1/b00/COS(tt),AE26)","v":0.7708292792686184}]
[0,{"$f":"MAX(D3:D203)","v":0.4472135954999584},-0.7399999999999998,0.3832120871781036,0.1069065574515156,-0.5159177277957983,0.5,0.10690496421558404,null,{"$f":"J27+dx","v":-0.8699999999999999},0,{"$f":"IF(xx<=x0,L27+dx,L27)","v":-0.8699999999999999},{"$f":"K29","v":0},{"$f":"IF(xx<=x0,ASIN(b0/a0*xx),N27)","v":-0.6187286906722509},0,null,0,{"$f":"MAX(T3:T203)","v":0.3333333333333333},-1.4799999999999995,0.23727881094411274,0.1133496471255355,-0.7786868547661255,0.7024085547441585,0.11335027636337283,null,{"$f":"Z27+dxx","v":-1.7399999999999998},0,{"$f":"IF(xxxx<=x00,AB27+dxx,AB27)","v":-1.7399999999999998},{"$f":"AA29","v":0},{"$f":"IF(xxxx<=x00,ATAN(b00/a00*xxxx),AD27)","v":-0.8593372010553886},0]
[null,null,-0.7299999999999998,0.38156823242757437,0.110730459049544,-0.5082699972086465,0.5,0.11072882950915991,null,{"$f":"J29","v":-0.8699999999999999},{"$f":"1/SQRT(a0^2-b0^2*xx^2)","v":0.4091905134501969},{"$f":"L29","v":-0.8699999999999999},{"$f":"IF(xx<=x0,1/SQRT(a0^2-b0^2*xx^2),M28)","v":0.4091905134501969},{"$f":"N29","v":-0.6187286906722509},{"$f":"O28","v":0.5},{"$nulls":3},-1.4599999999999995,0.23886561684418375,0.11811109140341847,-0.7718854723841199,0.6977423911763168,0.11811175735123888,null,{"$f":"Z29","v":-1.7399999999999998},{"$f":"1/SQRT(a00^2+b00^2*xxxx^2)","v":0.21764654068982092},{"$f":"AB29","v":-1.7399999999999998},{"$f":"IF(xxxx<=x00,1/SQRT(a00^2+b00^2*xxxx^2),AC28)","v":0.21764654068982092},{"$f":"AD29","v":-0.8593372010553886},{"$f":"IF(xxxx<=x00,1/b00/COS(tt),AE28)","v":0.7657675887630658}]
{"$rows_left_out":373}