{"text_format":"3","workbook":"xlsx","n_sheets":2,"sheets":["z-Substitution","Sheet2"],"not_rendered":{"charts":3,"images":6,"defined_names":36,"comments":1},"read":"whole","date_system":"1900"}

{"sheet":"z-Substitution","index":0,"n_rows":54,"n_cols":19,"rows_kept":54}
[null,"       Visualizing the z-Substitution"]
[]
[null,null,"    This DIGMath spreadsheet lets you"]
[null,null,"               visualize the process of"]
[null,null,"      Integration with the z-Substitution"]
[null,null,"for rational functions of sine and cosine"]
[]
[]
[]
[]
["What is the value of the constant a?",null,null,2]
[]
["What is the value of the constant b?",null,null,3]
[{"$nulls":9},"Pick a tracing point x0 =",null,null,{"$f":"a+K15*dx","v":2.445}]
["What is the value of the constant c?",null,null,1,{"$nulls":6},163]
[]
[{"$nulls":8},"         The corresponding transformed point is z = ",{"$nulls":6},{"$f":"TAN(x0/2)","v":2.7540697327827077}]
["                The z-substitution is then  ",null,null,{"$f":"TEXT(a0/b0,\"0.00\")","v":"0.67"}]
[null,null,"                         so that   ",{"$f":"TEXT(a0/b0,\"0.00\")","v":"0.67"},{"$nulls":5}," The area from x =",null,{"$f":"a","v":0},"to x =",{"$f":"x0","v":2.445},"=",{"$f":"LOOKUP(x0+dx/2,Sheet2!$C$3:$C$203,Sheet2!E$3:E$203)","v":{"v":0.5646897585289976,"d":"0.565"}}]
[]
[]
[]
[]
[{"$nulls":15},"The area  under the transformed graph"]
[{"$nulls":15},"from z =",{"$f":"theta0","v":{"v":0,"d":"0.000"}},"to z =",{"$f":"th0","v":{"v":2.7540697327827077,"d":"2.754"}}]
[" The transformed integrand is then  ",{"$nulls":3},"2z",{"$nulls":11},"is about",{"$f":"LOOKUP(th0+dtheta/2,Sheet2!F3:F203,Sheet2!H3:H203)","v":{"v":0.5646946404448312,"d":"0.565"}}]
[{"$nulls":3},{"$f":"TEXT(a0-c0,\"0\")&\" (z^2) + \"&TEXT(2*b0,\"0\"&\"z + \"&TEXT(a0+c0,\"0\"))","v":"1 (z^2) + 6z + 3"}]
[]
[]
["What is the interval for x for display? "]
[null,null,"xMin =",0]
[null,null,"xMax =",3]
[]
[null,null,"       This corresponds to:",{"$nulls":5},"          The area  =",null,{"$f":"LOOKUP(x0+dx/2,Sheet2!$C$3:$C$203,Sheet2!F3:F203)","v":{"v":2.7540697327827,"d":"2.754"}}]
[{"$nulls":3},"z Min  =",{"$f":"theta0","v":{"v":0,"d":"0.000"}}]
[{"$nulls":3},"z Max  =",{"$f":"TAN(b/2)","v":{"v":14.101419947171719,"d":"14.101"}}]
[]
[]
["Click each item below for suggestions and investigations"]
[null,null,"   Item 1"]
[null,null,"   Item 2"]
[null,null,"   Item 3"]
[null,null,"   Item 4"]
[]
[]
[]
["To access/download all the DIGMath Apps for Calculus"]
["Click this link:",null,"DIGMath for Calculus"]
[]
["Created by:  Sheldon P. Gordon   "]
["                      Farmingdale State College    "]
["Development of this module was supported by the "]
["NSF's Division of Undergraduate Education  "]
["under grants DUE-0310123 and DUE-0442160."]

{"sheet":"Sheet2","index":1,"n_rows":403,"n_cols":15,"rows_kept":403}
[{"$nulls":6},"z-Substitution"]
[null,null,"x","f(x)","Area","z ","f(z )","Area",null,"xx","f(xx)","sweep x","sweep y","z ","f(z )"]
[null,null,{"$f":"a","v":0},{"$f":"1/(a0+b0*SIN(x)+c0*COS(x))","v":0.3333333333333333},0,{"$f":"theta0","v":0},{"$f":"2/((a0-c0)*z^2+2*b0*z+(a0+c0))","v":0.6666666666666666},0,null,{"$f":"C3","v":0},0,{"$f":"J3","v":0},{"$f":"K3","v":0},{"$f":"theta0","v":0},0]
[null,null,{"$f":"C3+dx","v":0.015},0.3284195404621632,{"$f":"E3+(D3+D4)*dx/2","v":0.004963146553466224},{"$f":"TAN(x/2)","v":0.007500140628164134},0.6568021344187792,{"$f":"H3+(G3+G4)*(F4-F3)/2","v":4.963101062564315E-3},null,{"$f":"J3","v":0},{"$f":"1/(a0+b0*SIN(xx)+c0*COS(xx))","v":0.3333333333333333},{"$f":"L3","v":0},{"$f":"K4","v":0.3333333333333333},{"$f":"N3","v":0},{"$f":"G3","v":0.6666666666666666}]
[null,null,0.03,0.3236731428418897,0.00985384167824662,0.015001125101259222,0.6472006436931413,{"$f":"H4+(G4+G5)*(F5-F4)/2","v":0.009853753358309503},null,{"$f":"J3+dx","v":0.015},0,{"$f":"IF(xx<=x0,L3+dx,L3)","v":0.015},{"$f":"K5","v":0},{"$f":"IF(xx<=x0,TAN(xx/2),N3)","v":0.007500140628164134},0]
[null,null,0.045,0.319086940331275,0.014674542302045356,0.022503797644024767,0.6378508596507798,0.014674413673398515,null,{"$f":"J5","v":0.015},{"$f":"1/(a0+b0*SIN(xx)+c0*COS(xx))","v":0.3284195404621632},{"$f":"L5","v":0.015},{"$f":"IF(xx<=x0,1/(a0+b0*SIN(xx)+c0*COS(xx)),M4)","v":0.3284195404621632},{"$f":"N5","v":0.007500140628164134},{"$f":"IF(xx<=x0,2/((a0-c0)*zz^2+2*b0*zz+(a0+c0)),O4)","v":0.6568021344187792}]
[null,null,0.06,0.31465414594379176,0.019427600449108358,0.030009003241180714,0.6287420843177353,0.01942743389959388,null,{"$f":"J5+dx","v":0.03},0,{"$f":"IF(xx<=x0,L5+dx,L5)","v":0.03},{"$f":"K7","v":0},{"$f":"IF(xx<=x0,TAN(xx/2),N5)","v":0.015001125101259222},0]
[{"$f":"a","v":0},null,0.075,0.3103683571531812,0.024115269222335655,0.03751758801832656,0.6198642124021894,0.024115067015693718,null,{"$f":"J7","v":0.03},{"$f":"1/(a0+b0*SIN(xx)+c0*COS(xx))","v":0.3236731428418897},{"$f":"L7","v":0.03},{"$f":"IF(xx<=x0,1/(a0+b0*SIN(xx)+c0*COS(xx)),M6)","v":0.3236731428418897},{"$f":"N7","v":0.015001125101259222},{"$f":"IF(xx<=x0,2/((a0-c0)*zz^2+2*b0*zz+(a0+c0)),O6)","v":0.6472006436931413}]
[{"$f":"b","v":3},null,0.09,0.30622352956021365,0.028739708372686117,0.04503039962393285,0.6112076907382876,0.028739472656318515,null,{"$f":"J7+dx","v":0.045},0,{"$f":"IF(xx<=x0,L7+dx,L7)","v":0.045},{"$f":"K9","v":0},{"$f":"IF(xx<=x0,TAN(xx/2),N7)","v":0.022503797644024767},0]
[null,null,0.105,0.3022139526975235,0.03330298948961915,0.05254828761279192,0.6027634810140368,0.033302722301787505,null,{"$f":"J9","v":0.045},{"$f":"1/(a0+b0*SIN(xx)+c0*COS(xx))","v":0.319086940331275},{"$f":"L9","v":0.045},{"$f":"IF(xx<=x0,1/(a0+b0*SIN(xx)+c0*COS(xx)),M8)","v":0.319086940331275},{"$f":"N9","v":0.022503797644024767},{"$f":"IF(xx<=x0,2/((a0-c0)*zz^2+2*b0*zz+(a0+c0)),O8)","v":0.6378508596507798}]
["dx =",null,0.12,0.29833422777316354,0.037807100843149304,0.06007210383129728,0.5945230254771546,0.03780680411965553,null,{"$f":"J9+dx","v":0.06},0,{"$f":"IF(xx<=x0,L9+dx,L9)","v":0.06},{"$f":"K11","v":0},{"$f":"IF(xx<=x0,TAN(xx/2),N9)","v":0.030009003241180714},0]
[{"$f":"(b-a)/200","v":0.015},null,0.135,0.29457924717449263,0.04225395190525672,0.06760270280492385,0.5864782153449308,0.04225362748564878,null,{"$f":"J11","v":0.06},{"$f":"1/(a0+b0*SIN(xx)+c0*COS(xx))","v":0.31465414594379176},{"$f":"L11","v":0.06},{"$f":"IF(xx<=x0,1/(a0+b0*SIN(xx)+c0*COS(xx)),M10)","v":0.31465414594379176},{"$f":"N11","v":0.030009003241180714},{"$f":"IF(xx<=x0,2/((a0-c0)*zz^2+2*b0*zz+(a0+c0)),O10)","v":0.6287420843177353}]
[null,null,0.15000000000000002,0.29094417557252616,0.04664537757585936,0.07514094212828505,0.5786213616725859,0.04664502720920125,null,{"$f":"J11+dx","v":0.075},0,{"$f":"IF(xx<=x0,L11+dx,L11)","v":0.075},{"$f":"K13","v":0},{"$f":"IF(xx<=x0,TAN(xx/2),N11)","v":0.03751758801832656},0]
[null,null,0.16500000000000004,0.28742443248326305,0.05098314213627778,0.08268768285814712,0.5709451684597607,0.05098276748651925,null,{"$f":"J13","v":0.075},{"$f":"1/(a0+b0*SIN(xx)+c0*COS(xx))","v":0.3103683571531812},{"$f":"L13","v":0.075},{"$f":"IF(xx<=x0,1/(a0+b0*SIN(xx)+c0*COS(xx)),M12)","v":0.3103683571531812},{"$f":"N13","v":0.03751758801832656},{"$f":"IF(xx<=x0,2/((a0-c0)*zz^2+2*b0*zz+(a0+c0)),O12)","v":0.6198642124021894}]
["First graph",null,0.18000000000000005,0.28401567615702206,0.055268942951079925,0.09024378990978547,0.5634427077970618,0.055268545602057864,null,{"$f":"J13+dx","v":0.09},0,{"$f":"IF(xx<=x0,L13+dx,L13)","v":0.09},{"$f":"K15","v":0},{"$f":"IF(xx<=x0,TAN(xx/2),N13)","v":0.04503039962393285},0]
[{"$f":"x0","v":2.445},0,0.19500000000000006,0.2807137886797086,0.05950441393735541,0.09781013245707404,0.5561073968743693,0.05950399539745627,null,{"$f":"J15","v":0.09},{"$f":"1/(a0+b0*SIN(xx)+c0*COS(xx))","v":0.30622352956021365},{"$f":"L15","v":0.09},{"$f":"IF(xx<=x0,1/(a0+b0*SIN(xx)+c0*COS(xx)),M14)","v":0.30622352956021365},{"$f":"N15","v":0.04503039962393285},{"$f":"IF(xx<=x0,2/((a0-c0)*zz^2+2*b0*zz+(a0+c0)),O14)","v":0.6112076907382876}]
[{"$f":"x0","v":2.445},{"$f":"LOOKUP(x0+dx/2,C3:C203,D3:D203)","v":0.31667709006714134},0.21000000000000008,0.2775148621813897,0.06369112881881364,0.10538758433670437,0.5489329766902004,0.06369069052532339,null,{"$f":"J15+dx","v":0.105},0,{"$f":"IF(xx<=x0,L15+dx,L15)","v":0.105},{"$f":"K17","v":0},{"$f":"IF(xx<=x0,TAN(xx/2),N15)","v":0.05254828761279192},0]
[null,null,0.2250000000000001,0.274415186057757,0.06783060418060724,0.11297702445693825,0.5419134923170862,0.06783014750377307,null,{"$f":"J17","v":0.105},{"$f":"1/(a0+b0*SIN(xx)+c0*COS(xx))","v":0.3022139526975235},{"$f":"L17","v":0.105},{"$f":"IF(xx<=x0,1/(a0+b0*SIN(xx)+c0*COS(xx)),M16)","v":0.3022139526975235},{"$f":"N17","v":0.05254828761279192},{"$f":"IF(xx<=x0,2/((a0-c0)*zz^2+2*b0*zz+(a0+c0)),O16)","v":0.6027634810140368}]
["Second graph",null,0.2400000000000001,0.2714112351191536,0.07192430233943407,0.12057933721130536,0.5350432745918803,0.07192382858626008,null,{"$f":"J17+dx","v":0.12},0,{"$f":"IF(xx<=x0,L17+dx,L17)","v":0.12},{"$f":"K19","v":0},{"$f":"IF(xx<=x0,TAN(xx/2),N17)","v":0.06007210383129728},0]
[{"$f":"x0","v":2.445},0,0.2550000000000001,0.26849965858996416,0.07597363404225246,0.12819541289766548,0.5283169231123862,0.07597314446004935,null,{"$f":"J19","v":0.12},{"$f":"1/(a0+b0*SIN(xx)+c0*COS(xx))","v":0.29833422777316354},{"$f":"L19","v":0.12},{"$f":"IF(xx<=x0,1/(a0+b0*SIN(xx)+c0*COS(xx)),M18)","v":0.29833422777316354},{"$f":"N19","v":0.06007210383129728},{"$f":"IF(xx<=x0,2/((a0-c0)*zz^2+2*b0*zz+(a0+c0)),O18)","v":0.5945230254771546}]
[{"$f":"x0","v":2.445},{"$f":"LOOKUP(x0+dx/2,C$3:C$203,E$3:E$203)","v":0.5646897585289976},0.27000000000000013,0.2656772698884309,0.07997996100584043,0.13582614814306412,0.5217292904328465,0.07997945678554785,null,{"$f":"J19+dx","v":0.135},0,{"$f":"IF(xx<=x0,L19+dx,L19)","v":0.135},{"$f":"K21","v":0},{"$f":"IF(xx<=x0,TAN(xx/2),N19)","v":0.06760270280492385},0]
[null,null,0.28500000000000014,0.26294103712346245,0.08394459830842962,0.14347244633482026,0.5152754673608154,0.08394408058772795,null,{"$f":"J21","v":0.135},{"$f":"1/(a0+b0*SIN(xx)+c0*COS(xx))","v":0.29457924717449263},{"$f":"L21","v":0.135},{"$f":"IF(xx<=x0,1/(a0+b0*SIN(xx)+c0*COS(xx)),M20)","v":0.29457924717449263},{"$f":"N21","v":0.06760270280492385},{"$f":"IF(xx<=x0,2/((a0-c0)*zz^2+2*b0*zz+(a0+c0)),O20)","v":0.5864782153449308}]
["Third graph",null,0.30000000000000016,0.26028807425083644,0.08786881664373687,0.15113521805829516,0.5089507692668956,0.08786828650996392,null,{"$f":"J21+dx","v":0.15000000000000002},0,{"$f":"IF(xx<=x0,L21+dx,L21)","v":0.15000000000000002},{"$f":"K23","v":0},{"$f":"IF(xx<=x0,TAN(xx/2),N21)","v":0.07514094212828505},0]
[{"$f":"th0","v":2.7540697327827077},0,0.31500000000000017,0.25771563283643123,0.09175384444689137,0.15881538154180297,0.5027507233268537,0.09175330293977835,null,{"$f":"J23","v":0.15000000000000002},{"$f":"1/(a0+b0*SIN(xx)+c0*COS(xx))","v":0.29094417557252616},{"$f":"L23","v":0.15000000000000002},{"$f":"IF(xx<=x0,1/(a0+b0*SIN(xx)+c0*COS(xx)),M22)","v":0.29094417557252616},{"$f":"N23","v":0.07514094212828505},{"$f":"IF(xx<=x0,2/((a0-c0)*zz^2+2*b0*zz+(a0+c0)),O22)","v":0.5786213616725859}]
[{"$f":"A24","v":2.7540697327827077},{"$f":"LOOKUP(x0+dx/2,C$3:C$203,G$3:G$203)","v":0.07377536992521483},0.3300000000000002,0.25522109437883156,0.09560086990100584,0.16651386310913624,0.496671056622861,0.09560031801524549,null,{"$f":"J23+dx","v":0.16500000000000004},0,{"$f":"IF(xx<=x0,L23+dx,L23)","v":0.16500000000000004},{"$f":"K25","v":0},{"$f":"IF(xx<=x0,TAN(xx/2),N23)","v":0.08268768285814712},0]
[null,null,0.3450000000000002,0.25280196314788983,0.09941104283245625,0.17423159764019197,0.49070768503710527,0.09941048152011522,null,{"$f":"J25","v":0.16500000000000004},{"$f":"1/(a0+b0*SIN(xx)+c0*COS(xx))","v":0.28742443248326305},{"$f":"L25","v":0.16500000000000004},{"$f":"IF(xx<=x0,1/(a0+b0*SIN(xx)+c0*COS(xx)),M24)","v":0.28742443248326305},{"$f":"N25","v":0.08268768285814712},{"$f":"IF(xx<=x0,2/((a0-c0)*zz^2+2*b0*zz+(a0+c0)),O24)","v":0.5709451684597607}]
[null,null,0.3600000000000002,0.2504558594996429,0.10318547650231275,0.18196952904019859,0.48485670287688587,0.10318490667509918,null,{"$f":"J25+dx","v":0.18000000000000005},0,{"$f":"IF(xx<=x0,L25+dx,L25)","v":0.18000000000000005},{"$f":"K27","v":0},{"$f":"IF(xx<=x0,TAN(xx/2),N25)","v":0.09024378990978547},0]
[null,null,0.3750000000000002,0.24818051363143165,0.1069252493007958,0.18972861071805924,0.47911437317559186,0.10692467183219238,null,{"$f":"J27","v":0.18000000000000005},{"$f":"1/(a0+b0*SIN(xx)+c0*COS(xx))","v":0.28401567615702206},{"$f":"L27","v":0.18000000000000005},{"$f":"IF(xx<=x0,1/(a0+b0*SIN(xx)+c0*COS(xx)),M26)","v":0.28401567615702206},{"$f":"N27","v":0.09024378990978547},{"$f":"IF(xx<=x0,2/((a0-c0)*zz^2+2*b0*zz+(a0+c0)),O26)","v":0.5634427077970618}]
[null,null,0.39000000000000024,0.24597375974418156,0.1106314063511129,0.19750980607434188,0.47347711861874114,0.1106308220783846,null,{"$f":"J27+dx","v":0.19500000000000006},0,{"$f":"IF(xx<=x0,L27+dx,L27)","v":0.19500000000000006},{"$f":"K29","v":0},{"$f":"IF(xx<=x0,TAN(xx/2),N27)","v":0.09781013245707404},0]
[null,null,0.40500000000000025,0.2438335305816192,0.1143049610285564,0.2053140889994651,0.46794151304857956,0.11430437075464167,null,{"$f":"J29","v":0.19500000000000006},{"$f":"1/(a0+b0*SIN(xx)+c0*COS(xx))","v":0.2807137886797086},{"$f":"L29","v":0.19500000000000006},{"$f":"IF(xx<=x0,1/(a0+b0*SIN(xx)+c0*COS(xx)),M28)","v":0.2807137886797086},{"$f":"N29","v":0.09781013245707404},{"$f":"IF(xx<=x0,2/((a0-c0)*zz^2+2*b0*zz+(a0+c0)),O28)","v":0.5561073968743693}]
[null,null,0.42000000000000026,0.2417578523187467,0.11794689640030914,0.21314244438264554,0.4625042735046506,0.11794630089560244,null,{"$f":"J29+dx","v":0.21000000000000008},0,{"$f":"IF(xx<=x0,L29+dx,L29)","v":0.21000000000000008},{"$f":"K31","v":0},{"$f":"IF(xx<=x0,TAN(xx/2),N29)","v":0.10538758433670437},0]
[null,null,0.4350000000000003,0.23974483977420918,0.12155816659100631,0.2209958686321929,0.45716225276129396,0.12155756659503941,null,{"$f":"J31","v":0.21000000000000008},{"$f":"1/(a0+b0*SIN(xx)+c0*COS(xx))","v":0.2775148621813897},{"$f":"L31","v":0.21000000000000008},{"$f":"IF(xx<=x0,1/(a0+b0*SIN(xx)+c0*COS(xx)),M30)","v":0.2775148621813897},{"$f":"N31","v":0.10538758433670437},{"$f":"IF(xx<=x0,2/((a0-c0)*zz^2+2*b0*zz+(a0+c0)),O30)","v":0.5489329766902004}]
[null,null,0.4500000000000003,0.2377926919232822,0.12513969807873748,0.22887537020775833,0.4519124323262445,0.12513909430176637,null,{"$f":"J31+dx","v":0.2250000000000001},0,{"$f":"IF(xx<=x0,L31+dx,L31)","v":0.2250000000000001},{"$f":"K33","v":0},{"$f":"IF(xx<=x0,TAN(xx/2),N31)","v":0.11297702445693825},0]
[null,null,0.4650000000000003,0.235899687690115,0.12869239092583795,0.23678197016516403,0.44675191586742996,0.12869178405034143,null,{"$f":"J33","v":0.2250000000000001},{"$f":"1/(a0+b0*SIN(xx)+c0*COS(xx))","v":0.274415186057757},{"$f":"L33","v":0.2250000000000001},{"$f":"IF(xx<=x0,1/(a0+b0*SIN(xx)+c0*COS(xx)),M32)","v":0.274415186057757},{"$f":"N33","v":0.11297702445693825},{"$f":"IF(xx<=x0,2/((a0-c0)*zz^2+2*b0*zz+(a0+c0)),O32)","v":0.5419134923170862}]
["x-axis",null,0.4800000000000003,0.23406418199959245,0.13221711994851076,0.24471670271446513,0.4416779230377172,0.13221651063060694,null,{"$f":"J33+dx","v":0.2400000000000001},0,{"$f":"IF(xx<=x0,L33+dx,L33)","v":0.2400000000000001},{"$f":"K35","v":0},{"$f":"IF(xx<=x0,TAN(xx/2),N33)","v":0.12057933721130536},0]
[{"$f":"a","v":0},0,{"$f":"C35+dx","v":0.49500000000000033},0.23228460207075782,{"$f":"E35+(D35+D36)*dx/2","v":0.1357147358290384},{"$f":"TAN(x/2)","v":0.25268061579191875},0.43668778366977856,0.13571412469982425,null,{"$f":"J35","v":0.2400000000000001},{"$f":"1/(a0+b0*SIN(xx)+c0*COS(xx))","v":0.2714112351191536},{"$f":"L35","v":0.2400000000000001},{"$f":"IF(xx<=x0,1/(a0+b0*SIN(xx)+c0*COS(xx)),M34)","v":0.2714112351191536},{"$f":"N35","v":0.12057933721130536},{"$f":"IF(xx<=x0,2/((a0-c0)*zz^2+2*b0*zz+(a0+c0)),O34)","v":0.5350432745918803}]
[{"$f":"b","v":3},0,0.5100000000000003,0.23055944393517128,0.13918606617408286,0.26067477164656117,0.4317789323154505,0.13918545384090195,null,{"$f":"J35+dx","v":0.2550000000000001},0,{"$f":"IF(xx<=x0,L35+dx,L35)","v":0.2550000000000001},{"$f":"K37","v":0},{"$f":"IF(xx<=x0,TAN(xx/2),N35)","v":0.12819541289766548},0]
[null,null,0.5250000000000004,0.22888726916489036,0.1426319165223333,0.26870024744212173,0.42694890310596434,0.14263130356997628,null,{"$f":"J37","v":0.2550000000000001},{"$f":"1/(a0+b0*SIN(xx)+c0*COS(xx))","v":0.26849965858996416},{"$f":"L37","v":0.2550000000000001},{"$f":"IF(xx<=x0,1/(a0+b0*SIN(xx)+c0*COS(xx)),M36)","v":0.26849965858996416},{"$f":"N37","v":0.12819541289766548},{"$f":"IF(xx<=x0,2/((a0-c0)*zz^2+2*b0*zz+(a0+c0)),O36)","v":0.5283169231123862}]
["z-axis",null,0.5400000000000004,0.22726670179595246,0.14605307130453962,0.2767581358750308,0.42219532491126427,0.14605245829638203,null,{"$f":"J37+dx","v":0.27000000000000013},0,{"$f":"IF(xx<=x0,L37+dx,L37)","v":0.27000000000000013},{"$f":"K39","v":0},{"$f":"IF(xx<=x0,TAN(xx/2),N37)","v":0.13582614814306412},0]
[{"$f":"theta0","v":0},0,0.5550000000000004,0.22569642543433294,0.14945029475876676,0.2848495458093087,0.4175159167782997,0.1494496822378479,null,{"$f":"J39","v":0.27000000000000013},{"$f":"1/(a0+b0*SIN(xx)+c0*COS(xx))","v":0.2656772698884309},{"$f":"L39","v":0.27000000000000013},{"$f":"IF(xx<=x0,1/(a0+b0*SIN(xx)+c0*COS(xx)),M38)","v":0.2656772698884309},{"$f":"N39","v":0.13582614814306412},{"$f":"IF(xx<=x0,2/((a0-c0)*zz^2+2*b0*zz+(a0+c0)),O38)","v":0.5217292904328465}]
[{"$f":"theta00","v":14.101419947171719},0,0.5700000000000004,0.22417518053234967,0.15282433180351687,0.2929756029291579,0.41290848362971244,0.15282372029356392,null,{"$f":"J39+dx","v":0.28500000000000014},0,{"$f":"IF(xx<=x0,L39+dx,L39)","v":0.28500000000000014},{"$f":"K41","v":0},{"$f":"IF(xx<=x0,TAN(xx/2),N39)","v":0.14347244633482026},0]
[null,null,0.5850000000000004,0.2227017618243999,0.15617590887119248,0.3011374504101105,0.4083709122057385,0.15617529887759282,null,{"$f":"J41","v":0.28500000000000014},{"$f":"1/(a0+b0*SIN(xx)+c0*COS(xx))","v":0.26294103712346245},{"$f":"L41","v":0.28500000000000014},{"$f":"IF(xx<=x0,1/(a0+b0*SIN(xx)+c0*COS(xx)),M40)","v":0.26294103712346245},{"$f":"N41","v":0.14347244633482026},{"$f":"IF(xx<=x0,2/((a0-c0)*zz^2+2*b0*zz+(a0+c0)),O40)","v":0.5152754673608154}]
[null,null,0.6000000000000004,0.22127501591175394,0.15950573470421364,0.30933624960962347,0.40390116723343017,0.15950512671493913,null,{"$f":"J41+dx","v":0.30000000000000016},0,{"$f":"IF(xx<=x0,L41+dx,L41)","v":0.30000000000000016},{"$f":"K43","v":0},{"$f":"IF(xx<=x0,TAN(xx/2),N41)","v":0.15113521805829516},0]
[null,null,0.6150000000000004,0.21989383898689574,0.16281450111595352,0.31757318077805063,0.39949728780847704,0.16281389560243958,null,{"$f":"J43","v":0.30000000000000016},{"$f":"1/(a0+b0*SIN(xx)+c0*COS(xx))","v":0.26028807425083644},{"$f":"L43","v":0.30000000000000016},{"$f":"IF(xx<=x0,1/(a0+b0*SIN(xx)+c0*COS(xx)),M42)","v":0.26028807425083644},{"$f":"N43","v":0.15113521805829516},{"$f":"IF(xx<=x0,2/((a0-c0)*zz^2+2*b0*zz+(a0+c0)),O42)","v":0.5089507692668956}]
["z0 =",{"$f":"TAN(a/2)","v":0},0.6300000000000004,0.21855717468860916,0.1661028837185198,0.32584944379096,0.3951573839759897,0.16610228113650227,null,{"$f":"J43+dx","v":0.31500000000000017},0,{"$f":"IF(xx<=x0,L43+dx,L43)","v":0.31500000000000017},{"$f":"K45","v":0},{"$f":"IF(xx<=x0,TAN(xx/2),N43)","v":0.15881538154180297},0]
["z00 =",{"$f":"TAN(b/2)","v":14.101419947171719},0.6450000000000005,0.21726401207965368,0.16937154261928178,0.33416625890380947,0.3908796334975954,0.169370943409594,null,{"$f":"J45","v":0.31500000000000017},{"$f":"1/(a0+b0*SIN(xx)+c0*COS(xx))","v":0.25771563283643123},{"$f":"L45","v":0.31500000000000017},{"$f":"IF(xx<=x0,1/(a0+b0*SIN(xx)+c0*COS(xx)),M44)","v":0.25771563283643123},{"$f":"N45","v":0.15881538154180297},{"$f":"IF(xx<=x0,2/((a0-c0)*zz^2+2*b0*zz+(a0+c0)),O44)","v":0.5027507233268537}]
["dz =",{"$f":"(theta00-theta0)/200","v":0.0705070997358586},0.6600000000000005,0.21601338373946993,0.1726211230879252,0.3425248675300392,0.38666227879311044,0.1726205276772581,null,{"$f":"J45+dx","v":0.3300000000000002},0,{"$f":"IF(xx<=x0,L45+dx,L45)","v":0.3300000000000002},{"$f":"K47","v":0},{"$f":"IF(xx<=x0,TAN(xx/2),N45)","v":0.16651386310913624},0]
[null,null,0.6750000000000005,0.2148043639649042,0.17585225619570802,0.3509265330436851,0.3825036240458889,0.17585166499733548,null,{"$f":"J47","v":0.3300000000000002},{"$f":"1/(a0+b0*SIN(xx)+c0*COS(xx))","v":0.25522109437883156},{"$f":"L47","v":0.3300000000000002},{"$f":"IF(xx<=x0,1/(a0+b0*SIN(xx)+c0*COS(xx)),M46)","v":0.25522109437883156},{"$f":"N47","v":0.16651386310913624},{"$f":"IF(xx<=x0,2/((a0-c0)*zz^2+2*b0*zz+(a0+c0)),O46)","v":0.496671056622861}]
[null,null,0.6900000000000005,0.21363606707244492,0.17906555942848815,0.3593725416076706,0.37840203246172255,0.17906497284295964,null,{"$f":"J47+dx","v":0.3450000000000002},0,{"$f":"IF(xx<=x0,L47+dx,L47)","v":0.3450000000000002},{"$f":"K49","v":0},{"$f":"IF(xx<=x0,TAN(xx/2),N47)","v":0.17423159764019197},0]
[null,null,0.7050000000000005,0.21250764579593004,0.18226163727500097,0.36786420302898687,0.37435592367187087,0.1822610556908039,null,{"$f":"J49","v":0.3450000000000002},{"$f":"1/(a0+b0*SIN(xx)+c0*COS(xx))","v":0.25280196314788983},{"$f":"L49","v":0.3450000000000002},{"$f":"IF(xx<=x0,1/(a0+b0*SIN(xx)+c0*COS(xx)),M48)","v":0.25280196314788983},{"$f":"N49","v":0.17423159764019197},{"$f":"IF(xx<=x0,2/((a0-c0)*zz^2+2*b0*zz+(a0+c0)),O48)","v":0.49070768503710527}]
[null,null,0.7200000000000005,0.2114182897741142,0.1854410817917763,0.37640285164202725,0.3703637712714631,0.18544050558596978,null,{"$f":"J49+dx","v":0.3600000000000002},0,{"$f":"IF(xx<=x0,L49+dx,L49)","v":0.3600000000000002},{"$f":"K51","v":0},{"$f":"IF(xx<=x0,TAN(xx/2),N49)","v":0.18196952904019859},0]
[null,null,0.7350000000000005,0.2103672241228793,0.18860447314600373,0.3849898472214034,0.3664241004851112,0.1886039026848256,null,{"$f":"J51","v":0.3600000000000002},{"$f":"1/(a0+b0*SIN(xx)+c0*COS(xx))","v":0.2504558594996429},{"$f":"L51","v":0.3600000000000002},{"$f":"IF(xx<=x0,1/(a0+b0*SIN(xx)+c0*COS(xx)),M50)","v":0.2504558594996429},{"$f":"N51","v":0.18196952904019859},{"$f":"IF(xx<=x0,2/((a0-c0)*zz^2+2*b0*zz+(a0+c0)),O50)","v":0.48485670287688587}]
[null,null,0.7500000000000006,0.20935370808724152,0.19175238013757964,0.3936265759256331,0.3625354859521352,0.1917518157770286,null,{"$f":"J51+dx","v":0.3750000000000002},0,{"$f":"IF(xx<=x0,L51+dx,L51)","v":0.3750000000000002},{"$f":"K53","v":0},{"$f":"IF(xx<=x0,TAN(xx/2),N51)","v":0.18972861071805924},0]
[null,null,0.7650000000000006,0.20837703376864325,0.19488536070149878,0.4023144512731571,0.3586965496243143,0.1948848027878932,null,{"$f":"J53","v":0.3750000000000002},{"$f":"1/(a0+b0*SIN(xx)+c0*COS(xx))","v":0.24818051363143165},{"$f":"L53","v":0.3750000000000002},{"$f":"IF(xx<=x0,1/(a0+b0*SIN(xx)+c0*COS(xx)),M52)","v":0.24818051363143165},{"$f":"N53","v":0.18972861071805924},{"$f":"IF(xx<=x0,2/((a0-c0)*zz^2+2*b0*zz+(a0+c0)),O52)","v":0.47911437317559186}]
[null,null,0.7800000000000006,0.20743652492333634,0.19800396239168863,0.41105491515221393,0.3549059587695573,0.19800341126220367,null,{"$f":"J53+dx","v":0.39000000000000024},0,{"$f":"IF(xx<=x0,L53+dx,L53)","v":0.39000000000000024},{"$f":"K55","v":0},{"$f":"IF(xx<=x0,TAN(xx/2),N53)","v":0.19750980607434188},0]
[null,null,0.7950000000000006,0.2065315358279494,0.20110872284732328,0.4198494388661757,0.35116242407532144,0.20110817883050763,null,{"$f":"J55","v":0.39000000000000024},{"$f":"1/(a0+b0*SIN(xx)+c0*COS(xx))","v":0.24597375974418156},{"$f":"L55","v":0.39000000000000024},{"$f":"IF(xx<=x0,1/(a0+b0*SIN(xx)+c0*COS(xx)),M54)","v":0.24597375974418156},{"$f":"N55","v":0.19750980607434188},{"$f":"IF(xx<=x0,2/((a0-c0)*zz^2+2*b0*zz+(a0+c0)),O54)","v":0.47347711861874114}]
[null,null,0.8100000000000006,0.20566145020860582,0.20420017024259746,0.4286995242160305,0.34746469784602324,0.2041996336588713,null,{"$f":"J55+dx","v":0.40500000000000025},0,{"$f":"IF(xx<=x0,L55+dx,L55)","v":0.40500000000000025},{"$f":"K57","v":0},{"$f":"IF(xx<=x0,TAN(xx/2),N55)","v":0.2053140889994651},0]
[null,null,0.8250000000000006,0.2048256802302073,0.20727882372088854,0.4376067046217777,0.3438115722890556,0.2072782948830239,null,{"$f":"J57","v":0.40500000000000025},{"$f":"1/(a0+b0*SIN(xx)+c0*COS(xx))","v":0.2438335305816192},{"$f":"L57","v":0.40500000000000025},{"$f":"IF(xx<=x0,1/(a0+b0*SIN(xx)+c0*COS(xx)),M56)","v":0.2438335305816192},{"$f":"N57","v":0.2053140889994651},{"$f":"IF(xx<=x0,2/((a0-c0)*zz^2+2*b0*zz+(a0+c0)),O56)","v":0.46794151304857956}]
[null,null,0.8400000000000006,0.2040236655427297,0.21034519381418557,0.4465725462845955,0.34020187788438194,0.21034467302777027,null,{"$f":"J57+dx","v":0.42000000000000026},0,{"$f":"IF(xx<=x0,L57+dx,L57)","v":0.42000000000000026},{"$f":"K59","v":0},{"$f":"IF(xx<=x0,TAN(xx/2),N57)","v":0.21314244438264554},0]
[null,null,0.8550000000000006,0.2032548723815978,0.21339978284861802,0.45559864939173356,0.33663448183299977,0.2133992704125048,null,{"$f":"J59","v":0.42000000000000026},{"$f":"1/(a0+b0*SIN(xx)+c0*COS(xx))","v":0.2417578523187467},{"$f":"L59","v":0.42000000000000026},{"$f":"IF(xx<=x0,1/(a0+b0*SIN(xx)+c0*COS(xx)),M58)","v":0.2417578523187467},{"$f":"N59","v":0.21314244438264554},{"$f":"IF(xx<=x0,2/((a0-c0)*zz^2+2*b0*zz+(a0+c0)),O58)","v":0.4625042735046506}]
{"$rows_left_out":343}