{"text_format":"3","workbook":"xlsx","n_sheets":4,"sheets":["Sheet1","Sheet2","Defining Function","Sheet3"],"not_rendered":{"charts":1,"images":1,"defined_names":7,"comments":1},"read":"whole","date_system":"1900"}

{"sheet":"Sheet1","index":0,"n_rows":40,"n_cols":11,"rows_kept":40,"merged":[[33,2,33,3]]}
[null,"  l'Hopital's Rule:  ∞/∞  as x → a"]
[]
[null,"      This DIGMath spreadsheet provides a "]
[null,"graphical representation of l'Hopital's Rule for"]
[null," finding the limit of the indeterminate form ¥/¥"]
[null,null,"        lim x → a f(x) / g(x)"]
[null,"     where  lim  x → a f(x) =  lim x → a g(x) = ¥"]
[]
[]
[]
["Enter the numerator function:   f(x) =  ",{"$nulls":3},"log(x^2)"]
[null,null,{"$f":"IF(ABS(Sheet2!D2)<10^5,\"That may not become infinite at the point a\",\"\")","v":"That may not become infinite at the point a"}]
["Enter the denominator function: g(x) = ",{"$nulls":3},"1/abs(x)"]
[null,null,{"$f":"IF(ABS(Sheet2!E2)<10^5,\"That may not become infinite at the point a\",\"\")","v":""}]
[]
["     What is the limit point a =  ",null,null,0]
[null,{"$f":"IF(OR(ABS(Sheet2!D2)<10^5,ABS(Sheet2!E2)<10^5),\"Both functions have to become infinite at this point!!\",\"\")","v":"Both functions have to become infinite at this point!!"}]
[{"$nulls":8},"The graphs of the ratios f(x) / g(x) and f '(x) / g'(x)"]
["Now enter the interval for x :  "]
[null,"Starting value xMin =",null,-0.5,{"$nulls":4},"Now trace along the curves:"]
[null,"Ending value xMax =",null,0.5,{"$nulls":4},"x  = ",{"$f":"D20+K21*dx","v":{"v":0.1467065868263473,"d":"0.147"}},324]
[{"$nulls":8},"f / g =",{"$f":"LOOKUP(J$21,Sheet2!C3:C504,Sheet2!F3:F504)","v":{"v":-0.24457466438544542,"d":"-0.245"}}]
[{"$nulls":8},"f '/g ' =",{"$f":"LOOKUP(J$21,Sheet2!C4:C505,Sheet2!I4:I505)","v":{"v":-0.12829067269933694,"d":"-0.128"}}]
[]
["Click each item below for suggestions and investigations"]
[null,"   Item 1"]
[null,"   Item 2"]
[null,"   Item 3"]
[null,"   Item 4"]
[]
[]
[]
["To access/download all the DIGMath Apps for Calculus"]
["     Click this link:",null,"DIGMath for Calculus"]
[]
["Created by:  Sheldon P. Gordon   "]
["                      Farmingdale State College    "]
["Development of this module was supported by the "]
["NSF's Division of Undergraduate Education  "]
["under grants DUE-0310123 and DUE-0442160."]

{"sheet":"Sheet2","index":1,"n_rows":504,"n_cols":11,"rows_kept":504}
[null,null,"x","y = f(x)","y = g(x)","f(x)/g(x)","f'","g'","f'/g/","Tracing points"]
[null,null,{"$f":"a0+0.0000001","v":1e-07},{"$f":"LOG(x^2)","v":-14},{"$f":"1/ABS(x)","v":10000000}]
[null,null,{"$f":"a","v":-0.5},-0.6020599913279624,2,{"$f":"D3/E3","v":-0.3010299956639812},{"$f":"(D4-D3)/dx","v":-1.7406546043434854},{"$f":"(E4-E3)/dx","v":4.016032064128261},{"$f":"G3/H3","v":-0.4334264708420151},0,0]
[null,null,{"$f":"C3+dx","v":-0.49800399201596807},-0.6055343518156739,2.0080160320641283,{"$f":"D4/E4","v":-0.30155852450700726},-1.7476452038379733,4.048354253779237,{"$f":"G4/H4","v":-0.43169275569362636},{"$f":"Sheet1!J$21","v":0.1467065868263473},{"$f":"Sheet1!J22","v":-0.24457466438544542}]
[null,null,-0.49600798403193613,-0.6090226655957897,2.0160965794768613,-0.3020801045919236,-1.7546921793628798,4.081068227547126,-0.4299590405077631,"on curve"]
[null,null,-0.4940119760479042,-0.6125250451953164,2.0242424242424244,-0.30259470795577004,-1.761796215651357,4.114180342983399,-0.42822532528406126]
[null,null,-0.49201596806387227,-0.6160416045079937,2.0324543610547665,-0.3031023064096217,-1.7689580085700574,4.147697087121938,-0.42649161002196684,0,0]
[null,null,-0.49001996007984033,-0.6195724588165168,2.040733197556008,-0.3036028715358381,-1.7761782653469638,4.181625079654622,-0.42475789472107955,{"$f":"Sheet1!J$21","v":0.1467065868263473},{"$f":"Sheet1!J23","v":-0.12829067269933694}]
[null,null,-0.4880239520958084,-0.6231177248152133,2.0490797546012267,-0.30409637468526884,-1.7834577048038889,4.215971076202127,-0.42302417938087017,"on derivatives"]
[null,null,-0.48602794411177647,-0.6266775206331852,2.057494866529774,-0.3045827869744124,-1.7907970575953729,4.250741971675958,-0.4212904640008784]
[null,null,-0.48403193612774453,-0.6302519658579264,2.0659793814432987,-0.30506207928252926,-1.7981970664530316,4.28594480373948,-0.4195567485806414]
["delta x = ",{"$f":"(Sheet1!D21-Sheet1!D20)/501","v":1.996007984031936E-3},-0.4820359281437126,-0.6338411815594295,2.074534161490683,-0.3055342222487071,-1.8056584864357452,4.32158675636952,-0.4178230331195858]
[null,null,-0.48003992015968067,-0.6374452903147902,2.083160083160083,-0.30599918626887634,-1.8131820851870775,4.357675163520527,-0.416089317617292]
[null,null,-0.47804391217564873,-0.6410644162333273,2.091858037578288,-0.3064569414927783,-1.8207686431982018,4.394217512900438,-0.41435560207314115]
[null,null,-0.4760479041916168,-0.6446986849822259,2.10062893081761,-0.30690745782088,-1.8284189540778353,4.431221449850868,-0.41262188648670906]
[null,null,-0.47405189620758487,-0.6483482238127206,2.109473684210526,-0.3073507049012399,-1.8361338248291268,4.46869478135103,-0.4108881708573537]
[null,null,-0.47205588822355293,-0.6520131615868306,2.1183932346723044,-0.3077866521263183,-1.843914076133218,4.506645480130872,-0.40915445518462906]
[null,null,-0.470059880239521,-0.6556936288046614,2.127388535031847,-0.3082152686297361,-1.851760542640537,4.5450816889166115,-0.4074207394679263]
[null,null,-0.46806387225548907,-0.6593897576322872,2.136460554371002,-0.3086365232829768,-1.8596740732690444,4.584011724795967,-0.40568702370668963]
[null,null,-0.46606786427145713,-0.6631016819302294,2.1456102783725908,-0.3090503846920331,-1.8676555315105445,4.623444083719095,-0.4039533079003313]
[null,null,-0.4640718562874252,-0.6668295372825459,2.1548387096774193,-0.30945682119399587,-1.8757057957447842,4.663387445133263,-0.4022195920483256]
[null,null,-0.46207584830339327,-0.6705734610265475,2.1641468682505396,-0.3098558008535844,-1.88382575956156,4.703850676761451,-0.40048587614999565]
[null,null,-0.46007984031936133,-0.6743335922831574,2.1735357917570495,-0.3102472914596164,-1.8920163320917267,4.744842839522033,-0.39875216020480825]
[null,null,-0.4580838323353294,-0.6781100719879313,2.183006535947712,-0.31063126052141765,-1.9002784383458242,4.786373192603063,-0.39701844421211135]
[null,null,-0.45608782435129747,-0.6819030429227533,2.1925601750547044,-0.3110076752651679,-1.9086130195632747,4.828451198691884,-0.3952847281712929]
[null,null,-0.45409181636726553,-0.6857126497482289,2.202197802197802,-0.3113765026301838,-1.917021033569086,4.871086529364687,-0.393551012081716]
[null,null,-0.4520958083832336,-0.6895390390367899,2.2119205298013243,-0.3117377092651356,-1.9255034551411265,4.914289070644951,-0.3918172959427524]
[null,null,-0.45009980039920167,-0.6933823593065327,2.2217294900221725,-0.3120912615241979,-1.9340612763865748,4.958068928735415,-0.39008357975367414]
[null,null,-0.44810379241516973,-0.6972427610558073,2.231625835189309,-0.3124371254631313,-1.9426955071294958,5.002436435927821,-0.3883498635138932]
[null,null,-0.4461077844311378,-0.7011203967985807,2.241610738255033,-0.31277526683529505,-1.9514071753068698,5.047402156700002,-0.3866161472226937]
[null,null,-0.44411177644710587,-0.7050154211005905,2.2516853932584264,-0.31310565108758764,-1.96019732737775,5.092976894006744,-0.38488243087936425]
[null,null,-0.44211576846307393,-0.7089279906163145,2.261851015801354,-0.31342824335631475,-1.969067028741485,5.139171695766221,-0.383148714483241]
[null,null,-0.440119760479042,-0.7128582641267766,2.2721088435374144,-0.3137430084629826,-1.9780173641686245,5.185997861559355,-0.38141499803354395]
[null,null,-0.43812375249501007,-0.7168064025782109,2.2824601366742594,-0.3140499109100146,-1.987049438242892,5.233466949536752,-0.37968128152959457]
[null,null,-0.43612774451097813,-0.7207725691216099,2.292906178489702,-0.31434891487639083,-1.9961643758161196,5.2815907835557,-0.37794756497061505]
[null,null,-0.4341317365269462,-0.724756929153179,2.3034482758620687,-0.3146399842132065,-2.005363322474417,5.330381460539863,-0.37621384835585725]
[null,null,-0.43213572854291427,-0.7287596503557228,2.314087759815242,-0.31492308243914974,-2.0146474450190808,5.379851358085512,-0.37448013168453387]
[null,null,-0.43013972055888233,-0.7327809027409904,2.324825986078886,-0.3151981727358951,-2.024017931959407,5.430013142310029,-0.37274641495588573]
[null,null,-0.4281437125748504,-0.7368208586930052,2.335664335664335,-0.3154652179434125,-2.0334759940197427,5.480879775961847,-0.37101269816904264]
[null,null,-0.42614770459081847,-0.7408796930124059,2.346604215456674,-0.315724180555187,-2.0430228646617783,5.532464526794252,-0.36927898132328263]
[null,null,-0.42415169660678653,-0.7449575829618306,2.3576470588235288,-0.3159750227133514,-2.0526598006196886,5.5847809762202,-0.3675452644176811]
[null,null,-0.4221556886227546,-0.7490547083123689,2.368794326241134,-0.3162177062037247,-2.0623880824527943,5.637843028251018,-0.3658115474514359]
[null,null,-0.42015968063872267,-0.753171251391117,2.3800475059382418,-0.3164521924507588,-2.0722090151117407,5.691664918735245,-0.36407783042368735]
[null,null,-0.41816367265469073,-0.757307397129863,2.391408114558472,-0.3166784425123879,-2.0821239285228637,5.746261224910301,-0.362344113333512]
[null,null,-0.4161676646706588,-0.7614633331149385,2.402877697841726,-0.3168964170747799,-2.0921341781881315,5.801646875270968,-0.360610396180036]
[null,null,-0.41417165668662687,-0.7656392496382681,2.4144578313253007,-0.31710607644698735,-2.1022411458031054,5.857837159776948,-0.3588766789623687]
[null,null,-0.41217564870259493,-0.7698353397496516,2.4261501210653744,-0.31730738055549523,-2.1124462398924244,5.9148477404077315,-0.35714296167948456]
[null,null,-0.410179640718563,-0.7740517993103151,2.4379562043795615,-0.3175002889386622,-2.1227508964648667,5.972694662074107,-0.35540924433054977]
[null,null,-0.40818363273453107,-0.7782888270477699,2.4498777506112464,-0.31768476074105584,-2.13315657968599,6.031394363912576,-0.3536755269145106]
[null,null,-0.40618762475049913,-0.7825466246120134,2.461916461916461,-0.3178607547076742,-2.1436647825726283,6.090963690963789,-0.3519418094303942]
[null,null,-0.4041916167664672,-0.7868253966331165,2.4740740740740734,-0.3180282291780561,-2.154277027706191,6.151419906258571,-0.35020809187719226]
[null,null,-0.40219560878243527,-0.7911253507802346,2.4863523573200985,-0.3181871420802741,-2.1649948679690465,6.212780703328464,-0.34847437425389277]
[null,null,-0.40019960079840333,-0.795446697822089,2.4987531172069817,-0.3183374509248082,-2.1758198873009262,6.2750642191514565,-0.3467406565593923]
[null,null,-0.3982035928143714,-0.7997896516889571,2.511278195488721,-0.3184791127982974,-2.186753701480416,6.338289047555807,-0.34500693879268246]
[null,null,-0.39620758483033947,-0.8041544295362234,2.5239294710327447,-0.3186120843571665,-2.1977979589281422,6.402474253100678,-0.3432732209526282]
[null,null,-0.39421157684630753,-0.8085412518095331,2.5367088607594925,-0.31873632182112344,-2.2089543415355966,6.467639385448008,-0.34153950303810643]
[null,null,-0.3922155688622756,-0.8129503423116001,2.549618320610686,-0.3188517809665259,-2.2202245655189916,6.533804494250348,-0.3398057850480155]
[null,null,-0.39021956087824367,-0.8173819282707199,2.5626598465473136,-0.31895841711961237,-2.2316103822993716,6.60099014457689,-0.3380720669811594]
[null,null,-0.38822355289421173,-0.821836240411038,2.575835475578405,-0.3190561851495947,-2.2431135794099193,6.669217432892827,-0.33633834883637176]
[null,null,-0.3862275449101798,-0.8263135130246306,2.5891472868217043,-0.319145039461609,-2.25473598143158,6.738508003624305,-0.334604630612425]
[null,null,-0.38423153692614787,-0.8308139840454521,2.6025974025974015,-0.3192249339895202,-2.2664794509576582,6.808884066325427,-0.3328709123080747]
[null,null,-0.38223552894211593,-0.835337895125208,2.616187989556135,-0.3192958221885776,-2.2783458895894553,6.880368413478242,-0.3311371939221028]
[null,null,-0.380239520958084,-0.8398854917112148,2.6299212598425186,-0.3193576570279172,-2.2903372389620547,6.9529844389504,-0.3294034754531676]
[null,null,-0.37824351297405207,-0.8444570231263088,2.6437994722955134,-0.31941039098290536,-2.302455481804034,7.026756157135418,-0.32766975689998484]
[null,null,-0.37624750499002013,-0.8490527426508677,2.6578249336870012,-0.3194539760273227,-2.3147026430301643,7.101708222811792,-0.3259360382611861]
[null,null,-0.3742514970059882,{"$f":"LOG(x^2)","v":-0.8536729076070158},{"$f":"1/ABS(x)","v":2.671999999999999},-0.3194883636253803,-2.327080790869314,7.177865951742558,-0.3242023195354286]
[null,null,-0.37225548902195627,-0.8583177794450783,2.686327077747988,-0.3195135047235672,{"$f":"(D68-D67)/dx","v":-2.3395920380289588},{"$f":"(E68-E67)/dx","v":7.255255342058018},-0.3224686007212687]
[null,null,{"$f":"C67+dx","v":-0.37025948103792433},-0.8629876238323616,2.700808625336926,{"$f":"D68/E68","v":-0.31952934974232167},-2.3522385428974504,7.333903096443199,{"$f":"G68/H68","v":-0.32073488181732873}]
[null,null,-0.3682634730538924,-0.8676827107443326,2.7154471544715433,-0.3195358485675238,-2.365022510785005,7.413836645178557,-0.31900116282209307]
[null,null,-0.36626746506986047,-0.8724033145582747,2.730245231607628,-0.31953295054180336,-2.3779461952058516,7.495084170057071,-0.31726744373409016]
[null,null,-0.36427145708582853,-0.8771497141495039,2.7452054794520535,-0.3195206044556578,-2.391011899202926,7.577674629231113,-0.3155337245517938]
[null,null,-0.3622754491017966,-0.8819221929902283,2.760330578512395,-0.31949875853837634,-2.4042219767155126,7.661637783017794,-0.3138000052736151]
[null,null,-0.36027944111776466,-0.8867210392511375,2.7756232686980593,-0.31946736044876334,-2.4175788339934345,7.747004220711531,-0.3120662858979816]
[null,null,-0.35828343313373273,-0.8915465459058151,2.7910863509749286,-0.3194263572656565,-2.4310849310581957,7.833805388450744,-0.3103325664232489]
[null,null,-0.3562874251497008,-0.896399010838067,2.8067226890756287,-0.31937569547823363,-2.444742783213288,7.922073618179664,-0.30859884684775774]
[null,null,-0.35429141716566886,-0.9012787369522651,2.822535211267604,-0.3193153209761021,-2.4585549626060623,8.011842157762395,-0.30686512716979253]
[null,null,-0.35229540918163693,-0.9061860322868082,2.8385269121813015,-0.31924517903916516,-2.472524099842495,8.103145202295307,-0.3051314073876061]
[null,null,-0.350299401197605,-0.9111212101308052,2.854700854700853,-0.3191652143272583,-2.4866528856574686,8.196017926676936,-0.30339768749940726]
[null,null,-0.34830339321357306,-0.9160845891440935,2.871060171919769,-0.31907537086954973,-2.500944072642783,8.290496519491668,-0.3016639675033756]
[null,null,-0.34630738522954113,-0.9210764934807059,2.8876080691642634,-0.31897559205369774,-2.515400477034797,8.38661821826843,-0.29993024739763907]
[null,null,-0.3443113772455092,-0.9260972529159051,2.904347826086955,-0.31886582061475793,-2.530024980564592,8.484421346178173,-0.29819652718028283]
[null,null,-0.34231536926147726,-0.9311472029769122,2.9212827988338175,-0.3187459986238334,-2.5448205323733717,8.583945350238988,-0.296462806849361]
[null,null,-0.34031936127744533,-0.9362266850774579,2.9384164222873883,-0.31861606747646043,-2.55979015099434,8.685230841097068,-0.2947290864028436]
[null,null,-0.3383233532934134,-0.9413360466562889,2.9557522123893785,-0.3184759678807207,-2.574936926407049,8.788319634463454,-0.2929953658386999]
[null,null,-0.33632734530938146,-0.946475641319776,2.973293768545992,-0.31832563984507456,-2.5902640221623328,8.893254794277729,-0.2912616451548213]
[null,null,-0.33433133732534953,-0.9516458289887627,2.991044776119401,-0.3181650226659039,-2.605774677586447,9.000080677692564,-0.2895279243490642]
[null,null,-0.3323353293413176,-0.9568469760498135,3.0090090090090067,-0.31799405491475863,-2.621472210062302,9.108842981954753,-0.287794203419207]
[null,null,-0.33033932135728566,-0.9620794555110157,3.0271903323262817,-0.31781267442529587,-2.637360017395963,9.219588793285542,-0.2860604823630208]
[null,null,-0.32834331337325373,-0.9673436471625046,3.045592705167171,-0.31762081827990446,-2.653441580267585,9.332366637851663,-0.28432676117817146]
[null,null,-0.3263473053892218,-0.9726399377418811,3.064220183486236,-0.31741842279600335,-2.6697204647745165,9.447226534933025,-0.28259303986230105]
[null,null,-0.32435129740518986,-0.9779687211047045,3.083076923076921,-0.31720542351200515,-2.6862003250670097,9.564220052393365,-0.28085931841298556]
[null,null,-0.32235528942115793,-0.9833303984002474,3.1021671826625363,-0.31698175517293425,-2.7028849060832734,9.683400364572702,-0.2791255968277362]
[null,null,-0.320359281437126,-0.988725378252709,3.121495327102801,-0.31674735171568846,-2.7197780463863186,9.804822312717926,-0.27739187510399543]
[null,null,-0.31836327345309406,-0.9941540769480909,3.1410658307210007,-0.31650214625393336,-2.736883681108481,9.9285424680835,-0.2756581532391612]
[null,null,-0.31636726546906213,-0.9996169186269501,3.1608832807570955,-0.3162460710626182,-2.7542058450073057,10.054619197836821,-0.2739244312305585]
[null,null,-0.3143712574850302,-1.0051143354832521,3.1809523809523785,-0.3159790575621005,-2.7717486756382907,10.183112733911365,-0.27219070907542176]
[null,null,-0.31237524950099826,-1.010646767969556,3.201277955271563,-0.3157010363018676,-2.789516416650168,10.31408524495841,-0.2704569867709501]
[null,null,-0.31037924151696633,-1.016214665008778,3.221864951768486,-0.31541193694384256,-2.8075134212068895,10.44760091156001,-0.2687232643142452]
[null,null,-0.3083832335329344,-1.0218184842127838,3.242718446601939,-0.3151116882452599,-2.825744155543497,10.583726004870073,-0.2669895417023493]
[null,null,-0.30638722554890246,-1.0274586921080802,3.263843648208466,-0.3148002180410987,-2.844213202661439,10.722528968868424,-0.2652558189322007]
[null,null,-0.30439121756487053,-1.0331357643688814,3.285245901639341,-0.314477453226057,-2.8629252661697238,10.864080506411431,-0.263522096000685]
[null,null,-0.3023952095808386,-1.038850186057843,3.306930693069304,-0.3141433197360546,-2.8818851742785943,11.00845366928697,-0.26178837290462587]
[null,null,-0.30039920159680666,-1.0446024518747663,3.3289036544850465,-0.31379774252924647,-2.9010978839524992,11.155723952488446,-0.2600546496406777]
[null,null,-0.29840319361277473,-1.0503930664135936,3.35117056856187,-0.31344064556653173,-2.920568485231717,11.305969392925904,-0.25832092620550556]
[null,null,-0.2964071856287428,-1.0562225444280282,3.3737373737373706,-0.31307195179154157,-2.9403022057275128,11.459270672829884,-0.2565872025956256]
[null,null,-0.29441117764471086,-1.062091411106127,3.396610169491522,-0.3126915831100876,-2.960304415301637,11.615711228090506,-0.25485347880745124]
[null,null,-0.29241516966067893,-1.068000202354234,3.419795221843,-0.31229946036905276,-2.980580630938601,11.775377361809905,-0.2531197548373497]
[null,null,-0.290419161676647,-1.0739494650906385,3.4432989690721616,-0.31189550333470667,-3.001136521818088,11.938358363357287,-0.2513860306815344]
[null,null,-0.28842315369261506,-1.0799397575493572,3.467128027681657,-0.3114796306704237,-3.021977914600616,12.104746633230006,-0.24965230633614985]
[null,null,-0.28642714570858313,-1.0859716495944682,3.491289198606268,-0.31105175991378514,-3.043110798933132,12.27463781404736,-0.24791858179721854]
[null,null,-0.2844311377245512,-1.0920457230454326,3.515789473684207,-0.3106118074530425,-3.0645413331883304,12.44813092802679,-0.2461848570606338]
[null,null,-0.28243512974051926,-1.0981625720138724,3.540636042402823,-0.31015968850292036,-3.086275850448821,12.625328521308301,-0.2444511321222242]
[null,null,-0.28043912175648733,-1.1043228032522932,3.5658362989323806,-0.30969531707973524,-3.108320864745264,12.806336815520423,-0.242717406977629]
[null,null,-0.2784431137724554,-1.1105270365152577,3.5913978494623615,-0.30921860597580564,-3.1306830775672836,12.991265867008256,-0.24098368162241646]
[null,null,-0.27644710578842346,-1.1167759049335557,3.6173285198555916,-0.308729466733129,-3.153369384654264,13.18022973416477,-0.239249956052006]
[null,null,-0.27445109780439153,-1.1230700554019275,3.6436363636363596,-0.3082278096162978,-3.1763868830856223,13.37334665334661,-0.23751623026168608]
[null,null,-0.2724550898203596,-1.1294101489809407,3.670329670329666,-0.30771354358462794,-3.1997428786830038,13.570739223875666,-0.23578250424660283]
[null,null,-0.27045908183632766,-1.1357968613136413,3.6974169741697374,-0.30718657626347023,-3.223444893741768,13.772534602669287,-0.2340487780017648]
[null,null,-0.26846307385229573,-1.1422308830576369,3.7249070631970214,-0.30664681391467535,-3.2475006751084368,13.978864709076511,-0.23231505152201856]
[null,null,-0.2664670658682638,-1.1487129203333024,3.7528089887640403,-0.3060941614061798,-3.2719182026228095,14.189866440534121,-0.2305813248020713]
{"$rows_left_out":385}
{"sheet":"Defining Function","index":2,"n_rows":12,"n_cols":1,"rows_kept":12}
["                                                     Defining a Function in Excel"]
[]
["Computers have very specific rules you must follow when defining a function.  If you don't, the program will either not work at all or will work incorrectly."]
[]
["1. The Variable used should be the one named in the instruction, usually x, though sometimes y, t, Q (for an angle theta), "]
[" or even x and y (for a function of two variables). "]
[]
["2.  Order of Operations:  There five arithmetic operations, addition (+), subtraction (-), multiplication (*), division (/), and  exponentiation or power (^).  When computers see any of these operation symbols, they perform the indicated steps in a very particular order.  First, the power is done.  Second, products and quotients of adjacent terms is done.  Third, and last, sums and differences of adjacent terms are done.  So, in 10*x^3 + 5*x – 7, say with x = 2, the first pass only calculates 2^3 and ignores the multiplications and the sums and differences to calculate 2^3 = 8.  The second pass looks at 10*8 + 5*2 – 7 and only does the multiplications, so it produces 80 + 10 -  7.  The third pass looks at the +’s and –‘s to produce 80 + 10 – 7 = 83.  "]
[]
["3.    Parentheses  If you need an operation involving more than two adjacent terms, as in Ö4^3 + 6^2, the computer would take the square root of  4 to produce 2^3 + 6^2;  it would then cube the 2 and square the 6 to produce 8 + 36; and finally it would add the 8 and the 36 to get 44.  If you actually wanted the square root of the entire expression, you would need to use parentheses, as in Ö(4^3 + 6^2) to tell the computer to do all the operations inside the parentheses before taking the square root.  Therefore, it would calculate (4^3 + 6^2) = 64 + 36 = 100 and then take the square root of Ö100  =  10."]
[]
["4.  Built-In Functions  Computer programs have built-in functions for most common algebraic functions.  In Excel, the square root function is denoted by SQRT(…), so SQRT(100) = 10.  Alternatively, you could enter it as 100^.5 or 100^(1/2); notice that parentheses are needed to have the ½ done first.  The common trig functions are SIN (…), COS (…), and TAN (…), where the arguments are automatically interpreted as being in radians, not degrees.  The logarithm to the base 10 is represented by LOG (…) and the logarithm with the base e, known as the natural logarithm, is LN (…). The corresponding exponential function with base e is EXP (x).  If x is the variable, then each of these would be SQRT (x), SIN (x), COS (x), TAN (x), LOG (x) (for log with base 10 ), LN (x) (for log with base e ), and EXP (x)."]

{"sheet":"Sheet3","index":3,"n_rows":0,"n_cols":0,"rows_kept":0}