{"text_format":"3","workbook":"xlsx","n_sheets":4,"sheets":["Sheet1","Sheet2","Defining Function","Sheet3"],"not_rendered":{"charts":2,"images":2,"defined_names":7,"comments":1},"read":"whole","date_system":"1900"}

{"sheet":"Sheet1","index":0,"n_rows":39,"n_cols":11,"rows_kept":39,"merged":[[32,2,32,3]]}
[null,"  l'Hopital's Rule:  ∞/∞  as x → ∞"]
[]
[null,"      This DIGMath spreadsheet provides a "]
[null,"graphical representation of l'Hopital's Rule for"]
[null," finding the limit of the indeterminate form ¥/¥"]
[null,null,"        lim x → a f(x) / g(x)"]
[null,"     where  lim  x → ¥ f(x) =  lim x → ¥ g(x) = ¥"]
[]
[]
[]
["Enter the numerator function:   f(x) =  ",{"$nulls":3},"x^3"]
[null,null,{"$f":"IF(Sheet2!D2<10^5,\"That may not become infinite as x → infinity\",\"\")","v":""}]
["Enter the denominator function: g(x) = ",{"$nulls":3},"x^3+50*x"]
[]
[]
[]
[{"$nulls":8},"The graphs of the ratios f(x) / g(x) and f '(x) / g'(x)"]
[]
["The interval for x starts at x = 1  ",{"$nulls":7},"Now trace along the curves:"]
["          and extends to xMax =",null,null,{"$f":"C21","v":50},{"$nulls":4},"x  = ",{"$f":"Sheet2!A15+K20*dx","v":{"v":36.4,"d":"36.400"}},364]
[null,null,50,{"$nulls":5},"f / g =",{"$f":"LOOKUP(J$20,Sheet2!C3:C504,Sheet2!F3:F504)","v":{"v":0.9634420080573819,"d":"0.963"}}]
[{"$nulls":8},"f '/g ' =",{"$f":"LOOKUP(J$20,Sheet2!C4:C505,Sheet2!I4:I505)","v":{"v":0.9875435043111935,"d":"0.988"}}]
[]
["Click each item below for suggestions and investigations"]
[null,null,"   Item 1"]
[null,null,"   Item 2"]
[null,null,"   Item 3"]
[null,null,"   Item 4"]
[null,null,"   Item 5"]
[]
[]
["To access/download all the DIGMath Apps for Calculus"]
["     Click this link:",null,"DIGMath for Calculus"]
[]
["Created by:  Sheldon P. Gordon   "]
["                      Farmingdale State College    "]
["Development of this module was supported by the "]
["NSF's Division of Undergraduate Education  "]
["under grants DUE-0310123 and DUE-0442160."]

{"sheet":"Sheet2","index":1,"n_rows":504,"n_cols":14,"rows_kept":504}
[null,null,"x","y = f(x)","y = g(x)","f(x)/g(x)","f'","g'","f'/g/","Tracing points",null,null,"log x"]
[null,null,1000,{"$f":"x^3","v":1000000000},{"$f":"x^3+50*x","v":1000050000},{"$nulls":7},{"$f":"LOG(C2)","v":3}]
[null,null,{"$f":"a","v":0},0,0,{"$f":"D3/E3","v":{"$error":"#DIV/0!"}},{"$f":"(D4-D3)/dx","v":0.010000000000000002},{"$f":"(E4-E3)/dx","v":50.01},{"$f":"G3/H3","v":1.9996000799840037E-4},0,0,null,{"$f":"LOG(C3)","v":{"$error":"#NUM!"}}]
[null,null,{"$f":"C3+dx","v":0.1},1.0000000000000002E-3,5.001,{"$f":"D4/E4","v":1.9996000799840037E-4},0.07000000000000002,50.069999999999986,{"$f":"G4/H4","v":1.3980427401637716E-3},{"$f":"Sheet1!J$20","v":36.4},{"$f":"Sheet1!J21","v":0.9634420080573819},null,-1,{"$f":"LOG(J4)","v":1.561101383649056}]
[null,null,0.2,0.008000000000000002,10.008,7.9936051159072772E-4,0.19000000000000009,50.19000000000002,3.7856146642757525E-3,"on curve",null,null,-0.6989700043360187]
[null,null,0.30000000000000004,0.02700000000000001,15.027000000000001,1.7967658215212623E-3,0.37000000000000005,50.36999999999999,0.007345642247369468,{"$nulls":3},-0.5228787452803375]
[null,null,0.4,0.06400000000000002,20.064,0.003189792663476875,0.6099999999999998,50.61,0.01205295396166765,0,0,null,-0.3979400086720376]
[null,null,0.5,0.125,25.125,0.004975124378109453,0.9099999999999999,50.91000000000001,0.017874680809271258,{"$f":"Sheet1!J$20","v":36.4},{"$f":"Sheet1!J22","v":0.9875435043111935},null,-0.3010299956639812,{"$f":"N4","v":1.561101383649056}]
[null,null,0.6,0.216,30.216,0.007148530579825257,1.2699999999999991,51.26999999999995,0.024770821142968604,"on derivatives",null,null,-0.2218487496163564]
[null,null,0.7,0.3429999999999999,35.342999999999996,0.009704892057833233,1.6899999999999997,51.69000000000004,0.03269491197523696,{"$nulls":3},-0.1549019599857432]
[null,null,0.7999999999999999,0.5119999999999999,40.512,0.012638230647709319,2.1699999999999986,52.169999999999916,0.04159478627563738,{"$nulls":3},-0.09691001300805645]
["delta x = ",{"$f":"(Sheet1!D20-Sheet2!A15)/500","v":0.1},0.8999999999999999,0.7289999999999998,45.72899999999999,0.01594174375123007,2.709999999999999,52.71000000000001,0.05141339404287609,{"$nulls":3},-0.04575749056067517]
[null,null,0.9999999999999999,0.9999999999999997,50.99999999999999,0.019607843137254898,3.3099999999999983,53.30999999999996,0.062089664228099806,{"$nulls":3},-4.821637332766436E-17]
[null,null,1.0999999999999999,1.3309999999999995,56.33099999999999,0.023628197617652797,3.9700000000000046,53.97000000000013,0.07355938484343146,{"$nulls":3},0.04139268515822499]
[0,"=a",1.2,1.728,61.728,0.027993779160186624,4.690000000000005,54.69000000000001,0.08575607972206992,{"$nulls":3},0.07918124604762482]
[null,null,1.3,2.1970000000000005,67.197,0.032694911975236995,5.4700000000000015,55.46999999999997,0.09861186226789263,{"$nulls":3},0.11394335230683679]
[null,null,1.4000000000000001,2.7440000000000007,72.744,0.03772132409545805,6.310000000000011,56.310000000000144,0.1120582489788669,{"$nulls":3},0.14612803567823807]
[null,null,1.5000000000000002,3.3750000000000018,78.37500000000001,0.043062200956937816,7.210000000000001,57.210000000000036,0.12602691837091412,{"$nulls":3},0.1760912590556813]
[null,null,1.6000000000000003,4.096000000000002,84.09600000000002,0.048706240487062416,8.17000000000002,58.16999999999993,0.14045040398831063,{"$nulls":3},0.20411998265592488]
[null,null,1.7000000000000004,4.913000000000004,89.91300000000001,0.05464170920778979,9.190000000000005,59.19000000000025,0.1552627132961643,{"$nulls":3},0.23044892137827402]
[null,null,1.8000000000000005,5.832000000000004,95.83200000000004,0.06085649887302782,10.27000000000002,60.27000000000001,0.17039986726397904,{"$nulls":3},0.2552725051033062]
[null,null,1.9000000000000006,6.859000000000006,101.85900000000004,0.06733818317478087,11.409999999999991,61.40999999999991,0.1858003582478425,{"$nulls":3},0.2787536009528291]
[null,null,2.0000000000000004,8.000000000000005,108.00000000000003,0.0740740740740741,12.61000000000001,62.6100000000001,0.20140552627375802,{"$nulls":3},0.3010299956639813]
[null,null,2.1000000000000005,9.261000000000006,114.26100000000004,0.08105127733872453,13.870000000000022,63.870000000000005,0.21715985595741383,{"$nulls":3},0.32221929473391936]
[null,null,2.2000000000000006,10.648000000000009,120.64800000000004,0.08825674690007299,15.190000000000037,65.19000000000005,0.23301119803650905,{"$nulls":3},0.34242268082220634]
[null,null,2.3000000000000007,12.167000000000012,127.16700000000004,0.09567733767408218,16.570000000000018,66.57000000000025,0.2489109208352104,{"$nulls":3},0.361727836017593]
[null,null,2.400000000000001,13.824000000000014,133.82400000000007,0.1032998565279771,18.01000000000002,68.00999999999988,0.26481399794148,{"$nulls":3},0.38021124171160614]
[null,null,2.500000000000001,15.625000000000016,140.62500000000006,0.11111111111111117,19.510000000000023,69.51000000000022,0.28067903898719554,{"$nulls":3},0.39794000867203777]
[null,null,2.600000000000001,17.57600000000002,147.57600000000008,0.1190979563072587,21.07000000000003,71.07,0.2964682707190099,{"$nulls":3},0.41497334797081814]
[null,null,2.700000000000001,19.68300000000002,154.68300000000008,0.1272473381043813,22.690000000000055,72.69000000000005,0.3121474755812359,{"$nulls":3},0.4313637641589875]
[null,null,2.800000000000001,21.952000000000027,161.95200000000008,0.1355463347164593,24.370000000000047,74.37000000000012,0.32768589485007404,{"$nulls":3},0.4471580313422194]
[null,null,2.9000000000000012,24.38900000000003,169.3890000000001,0.14398219482965255,26.110000000000007,76.1099999999999,0.34305610300880357,{"$nulls":3},0.46239799789895625]
[null,null,3.0000000000000013,27.000000000000032,177.00000000000009,0.15254237288135605,27.910000000000075,77.91000000000025,0.3582338595815683,{"$nulls":3},0.47712125471966266]
[null,null,3.1000000000000014,29.79100000000004,184.7910000000001,0.1612145613152157,29.77000000000004,79.77000000000032,0.3731979440892556,{"$nulls":3},0.49136169383427286]
[null,null,3.2000000000000015,32.76800000000004,192.76800000000014,0.1699867197875167,31.69000000000011,81.68999999999983,0.38792997918962147,{"$nulls":3},0.5051499783199062]
[null,null,3.3000000000000016,35.937000000000054,200.93700000000013,0.17884710133026785,33.670000000000044,83.67000000000019,0.4024142464443644,{"$nulls":3},0.5185139398778877]
[null,null,3.4000000000000017,39.30400000000006,209.30400000000014,0.1877842755035739,35.71000000000005,85.70999999999998,0.41663749854159443,{"$nulls":3},0.5314789170422554]
[null,null,3.5000000000000018,42.875000000000064,217.87500000000014,0.19678714859437768,37.81000000000006,87.81000000000006,0.43058877121056865,{"$nulls":3},0.5440680443502759]
[null,null,3.600000000000002,46.65600000000007,226.65600000000015,0.20584498094027973,39.97000000000007,89.97000000000014,0.4442591975102813,{"$nulls":3},0.5563025007672875]
[null,null,3.700000000000002,50.65300000000008,235.65300000000016,0.21494740147589905,42.19000000000008,92.19000000000023,0.4576418266623276,{"$nulls":3},0.5682017240669952]
[null,null,3.800000000000002,54.872000000000085,244.87200000000018,0.22408441961514605,44.4700000000001,94.47000000000031,0.47073144913729176,{"$nulls":3},0.5797835966168103]
[null,null,3.900000000000002,59.319000000000095,254.31900000000022,0.23324643459592104,46.8099999999999,96.80999999999955,0.48352442929449563,{"$nulls":3},0.5910646070264994]
[null,null,4.000000000000002,64.00000000000009,264.00000000000017,0.2424242424242426,49.20999999999992,99.20999999999992,0.4960185465174878,{"$nulls":3},0.6020599913279626]
[null,null,4.100000000000001,68.92100000000008,273.92100000000016,0.25160904056279015,51.66999999999973,101.66999999999916,0.5082128454804776,{"$nulls":3},0.6127838567197357]
[null,null,4.200000000000001,74.08800000000005,284.0880000000001,0.2607924305144886,54.18999999999983,104.18999999999983,0.5201074959209129,{"$nulls":3},0.6232492903979006]
[null,null,4.300000000000001,79.50700000000003,294.50700000000006,0.269966418455249,56.769999999999925,106.77000000000021,0.5317036620773609,{"$nulls":3},0.6334684555795866]
[null,null,4.4,85.18400000000003,305.1840000000001,0.279123414071511,59.40999999999974,109.40999999999917,0.5430033817749766,{"$nulls":3},0.6434526764861874]
[null,null,4.5,91.125,316.125,0.28825622775800713,62.1099999999997,112.10999999999956,0.5540094549995536,{"$nulls":3},0.6532125137753437]
[null,null,4.6,97.33599999999997,327.33599999999996,0.2973580663293985,64.8699999999998,114.86999999999966,0.5647253416906067,{"$nulls":3},0.6627578316815741]
[null,null,4.699999999999999,103.82299999999995,338.8229999999999,0.3064225273963101,67.68999999999963,117.68999999999949,0.5751550684000334,{"$nulls":3},0.6720978579357174]
[null,null,4.799999999999999,110.59199999999991,350.59199999999987,0.31544359255202614,70.56999999999988,120.5699999999996,0.5853031434021739,{"$nulls":3},0.6812412373755872]
[null,null,4.899999999999999,117.6489999999999,362.64899999999983,0.3244156195108768,73.5099999999997,123.50999999999942,0.5951744797992069,{"$nulls":3},0.6901960800285135]
[null,null,4.999999999999998,124.99999999999987,374.9999999999998,0.3333333333333332,76.5099999999994,126.50999999999954,0.6047743261402235,{"$nulls":3},0.6989700043360186]
[null,null,5.099999999999998,132.6509999999998,387.6509999999997,0.3421918168662016,79.56999999999994,129.56999999999994,0.6141082040595816,{"$nulls":3},0.7075701760979362]
[null,null,5.1999999999999975,140.6079999999998,400.6079999999997,0.35098650051921054,82.68999999999977,132.6899999999995,0.623181852438014,{"$nulls":3},0.716003343634799]
[null,null,5.299999999999997,148.87699999999978,413.87699999999967,0.3597131514918681,85.86999999999932,135.86999999999875,0.6320011775962325,{"$nulls":3},0.7242758696007888]
[null,null,5.399999999999997,157.46399999999971,427.46399999999954,0.3683678625568466,89.10999999999973,139.11,0.6405722090432012,{"$nulls":3},0.7323937598229683]
[null,null,5.4999999999999964,166.3749999999997,441.37499999999955,0.376947040498442,92.40999999999957,142.4099999999993,0.648901060318798,{"$nulls":3},0.7403626894942436]
[null,null,5.599999999999996,175.61599999999964,455.6159999999995,0.38544739429695146,95.76999999999941,145.76999999999884,0.6569938944913232,{"$nulls":3},0.7481880270062001]
[null,null,5.699999999999996,185.19299999999959,470.19299999999936,0.3938659231421987,99.18999999999926,149.18999999999926,0.664856893893691,{"$nulls":3},0.755874855672491]
[null,null,5.799999999999995,195.1119999999995,485.1119999999993,0.40219990435198427,102.66999999999939,152.6699999999994,0.6724962337066863,{"$nulls":3},0.7634279935629369]
[null,null,5.899999999999995,205.37899999999945,500.3789999999992,0.4104468812640014,106.20999999999981,156.20999999999867,0.6799180590231144,{"$nulls":3},0.7708520116421438]
[null,null,5.999999999999995,215.99999999999943,515.9999999999991,0.41860465116279033,109.80999999999938,159.80999999999995,0.6871284650522459,{"$nulls":3},0.7781512503836433]
[null,null,6.099999999999994,226.98099999999937,531.9809999999991,0.42667125329663985,113.46999999999952,163.4699999999998,0.6941334801492608,{"$nulls":3},0.7853298350107666]
[null,null,6.199999999999994,238.32799999999932,548.3279999999991,0.43464495703301625,117.18999999999909,167.18999999999824,0.700939051378673,{"$nulls":3},0.7923916894982534]
[null,null,6.299999999999994,{"$f":"x^3","v":250.04699999999923},{"$f":"x^3+50*x","v":565.0469999999989},0.44252425019511604,120.9699999999998,170.9699999999998,0.7075510323448555,{"$nulls":3},0.7993405494535812]
[null,null,6.399999999999993,262.1439999999992,582.1439999999989,0.45030782761653426,{"$f":"(D68-D67)/dx","v":124.80999999999881},{"$f":"(E68-E67)/dx","v":174.8099999999988},0.7139751730450183,{"$nulls":3},{"$f":"LOG(C67)","v":0.8061799739838867}]
[null,null,{"$f":"C67+dx","v":6.499999999999993},274.6249999999991,599.6249999999987,{"$f":"D68/E68","v":0.4579945799457989},128.70999999999924,178.70999999999867,{"$f":"G68/H68","v":0.7202171115214604},{"$nulls":3},0.8129133566428551]
[null,null,6.5999999999999925,287.495999999999,617.4959999999986,0.4655835827276608,132.6699999999994,182.6699999999994,0.7262823671100883,{"$nulls":3},0.8195439355418682]
[null,null,6.699999999999992,300.76299999999895,635.7629999999986,0.47307408578353827,136.68999999999926,186.6899999999987,0.7321763351009707,{"$nulls":3},0.8260748027008259]
[null,null,6.799999999999992,314.4319999999989,654.4319999999984,0.4804655029093926,140.7699999999994,190.76999999999998,0.7379042826440186,{"$nulls":3},0.8325089127062358]
[null,null,6.8999999999999915,328.5089999999988,673.5089999999984,0.48775740190554184,144.90999999999872,194.90999999999758,0.7434713457493228,{"$nulls":3},0.8388490907372548]
[null,null,6.999999999999991,342.9999999999987,692.9999999999982,0.49494949494949436,149.10999999999888,199.10999999999945,0.7488825272462423,{"$nulls":3},0.8450980400142563]
[null,null,7.099999999999991,357.9109999999986,712.9109999999981,0.5020416293197882,153.36999999999932,203.36999999999875,0.754142695579487,{"$nulls":3},0.8512583487190747]
[null,null,7.19999999999999,373.2479999999985,733.247999999998,0.5090337784760403,157.68999999999892,207.68999999999892,0.7592565843324173,{"$nulls":3},0.8573324964312679]
[null,null,7.29999999999999,389.0169999999984,754.0169999999979,0.5159260334979178,162.06999999999937,212.06999999999994,0.7642287923798718,{"$nulls":3},0.8633228601204553]
[null,null,7.39999999999999,405.22399999999834,775.2239999999979,0.5227185948835427,166.50999999999897,216.5099999999984,0.7690637845826992,{"$nulls":3},0.8692317197309756]
[null,null,7.499999999999989,421.87499999999824,796.8749999999977,0.5294117647058817,171.00999999999885,221.00999999999885,0.7737658929460194,{"$nulls":3},0.8750612633916994]
[null,null,7.599999999999989,438.9759999999981,818.9759999999976,0.5360059391239785,175.56999999999846,225.5699999999979,0.7783393181717432,{"$nulls":3},0.8808135922807907]
[null,null,7.699999999999989,456.53299999999797,841.5329999999974,0.542501601244395,180.18999999999892,230.18999999999892,0.7827881315435066,{"$nulls":3},0.8864907251724812]
[null,null,7.799999999999988,474.55199999999786,864.5519999999973,0.548899314326957,184.8699999999991,234.86999999999853,0.7871162770894549,{"$nulls":3},0.8920946026904798]
[null,null,7.899999999999988,493.03899999999777,888.0389999999971,0.5551997153278171,189.60999999999842,239.609999999999,0.7913275739743718,{"$nulls":3},0.8976270912904407]
[null,null,7.999999999999988,511.9999999999976,911.999999999997,0.561403508771929,194.40999999999804,244.40999999999804,0.7954257190785958,{"$nulls":3},0.9030899869919429]
[null,null,8.099999999999987,531.4409999999974,936.4409999999968,0.5675114609462841,199.26999999999907,249.26999999999794,0.7994142897260028,{"$nulls":3},0.9084850188786491]
[null,null,8.199999999999987,551.3679999999973,961.3679999999966,0.5735243944046393,204.1899999999987,254.1899999999987,0.8032967465281866,{"$nulls":3},0.913813852383716]
[null,null,8.299999999999986,571.7869999999972,986.7869999999965,0.579443182773992,209.16999999999803,259.169999999998,0.8070764363159302,{"$nulls":3},0.9190780923760732]
[null,null,8.399999999999986,592.703999999997,1012.7039999999963,0.5852687458526866,214.20999999999935,264.2100000000005,0.8107565951326556,{"$nulls":3},0.9242792860618809]
[null,null,8.499999999999986,614.1249999999969,1039.1249999999964,0.5910020449897742,219.30999999999813,269.30999999999585,0.814340351268061,{"$nulls":3},0.929418925714292]
[null,null,8.599999999999985,636.0559999999967,1066.055999999996,0.5966440787350751,224.4699999999989,274.4699999999989,0.8178307283127475,{"$nulls":3},0.934498451243567]
[null,null,8.699999999999985,658.5029999999966,1093.5029999999958,0.602195878749303,229.68999999999824,279.68999999999824,0.8212306482176684,{"$nulls":3},0.9395192526186178]
[null,null,8.799999999999985,681.4719999999965,1121.4719999999957,0.60765850596359,234.96999999999844,284.96999999999844,0.8245429343439651,{"$nulls":3},0.9444826721501679]
[null,null,8.899999999999984,704.9689999999963,1149.9689999999955,0.6130330469777873,240.30999999999835,290.3099999999995,0.8277703144914015,{"$nulls":3},0.949390006644912]
[null,null,8.999999999999984,728.9999999999961,1178.9999999999955,0.618320610687022,245.709999999998,295.70999999999685,0.8309154238950344,{"$nulls":3},0.9542425094393241]
[null,null,9.099999999999984,753.5709999999959,1208.5709999999951,0.6235223251261192,251.16999999999734,301.16999999999734,0.8339808081814243,{"$nulls":3},0.9590413923210929]
[null,null,9.199999999999983,778.6879999999957,1238.6879999999949,0.6286393345216865,256.6899999999987,306.6899999999987,0.8369689262773478,{"$nulls":3},0.9637878273455545]
[null,null,9.299999999999983,804.3569999999955,1269.3569999999947,0.6336727965418703,262.2699999999986,312.2699999999986,0.8398821532648022,{"$nulls":3},0.9684829485539344]
[null,null,9.399999999999983,830.5839999999954,1300.5839999999946,0.6386238797340262,267.9099999999971,317.90999999999485,0.8427227831776335,{"$nulls":3},0.9731278535996979]
[null,null,9.499999999999982,857.3749999999951,1332.374999999994,0.6434937611408191,273.60999999999876,323.60999999999876,0.8454930317357306,{"$nulls":3},0.9777236052888469]
[null,null,9.599999999999982,884.735999999995,1364.735999999994,0.6482836240855366,279.369999999999,329.369999999999,0.8481950390138745,{"$nulls":3},0.9822712330395676]
[null,null,9.699999999999982,912.6729999999949,1397.6729999999939,0.6529946561177035,285.1899999999978,335.1899999999978,0.850830872042721,{"$nulls":3},0.986771734266244]
[null,null,9.799999999999981,941.1919999999947,1431.1919999999936,0.6576280471103799,291.06999999999744,341.06999999999744,0.8534025273404275,{"$nulls":3},0.991226075692494]
[null,null,9.89999999999998,970.2989999999944,1465.2989999999934,0.6621849875008438,297.0099999999968,347.00999999999794,0.8559119333736739,{"$nulls":3},0.9956351945975491]
[null,null,9.99999999999998,999.9999999999941,1499.9999999999932,0.6666666666666657,303.00999999999704,353.00999999999476,0.8583609529475129,{"$nulls":3},0.9999999999999991]
[null,null,10.09999999999998,1030.3009999999938,1535.3009999999927,0.6710742714295104,309.06999999999925,359.0700000000015,0.8607513855237083,{"$nulls":3},1.0043213737826417]
[null,null,10.19999999999998,1061.2079999999937,1571.2079999999928,0.6754089846793032,315.1899999999978,365.1899999999978,0.8630849694679473,{"$nulls":3},1.0086001717619166]
[null,null,10.29999999999998,1092.7269999999935,1607.7269999999926,0.6796719841117295,321.36999999999716,371.36999999999716,0.865363384225973,{"$nulls":3},1.0128372247051713]
[null,null,10.399999999999979,1124.8639999999932,1644.8639999999923,0.6838644410723309,327.6099999999974,377.6099999999951,0.8675882524297599,{"$nulls":3},1.0170333392987794]
[null,null,10.499999999999979,1157.624999999993,1682.6249999999918,0.6879875195007792,333.9099999999985,383.9099999999985,0.869761141934307,{"$nulls":3},1.0211892990699372]
[null,null,10.599999999999978,1191.0159999999928,1721.0159999999917,0.6920423749692034,340.2699999999959,390.2699999999959,0.871883567786403,{"$nulls":3},1.0253058652647693]
[null,null,10.699999999999978,1225.0429999999924,1760.0429999999913,0.6960301538087413,346.6899999999987,396.6899999999987,0.8739569941263955,{"$nulls":3},1.0293837776852088]
[null,null,10.799999999999978,1259.7119999999923,1799.7119999999911,0.6999519923187701,353.1699999999955,403.1699999999955,0.8759828360245044,{"$nulls":3},1.0334237554869488]
[null,null,10.899999999999977,1295.0289999999918,1840.0289999999907,0.7038090160535504,359.70999999999776,409.70999999999776,0.8779624612530808,{"$nulls":3},1.0374264979406227]
[null,null,10.999999999999977,1330.9999999999916,1880.9999999999905,0.7076023391812857,366.3099999999986,416.3099999999986,0.8798971919963484,{"$nulls":3},1.041392685158224]
[null,null,11.099999999999977,1367.6309999999914,1922.6309999999903,0.7113330639108588,372.9699999999957,422.9699999999957,0.8817883064992778,{"$nulls":3},1.0453229787866565]
[null,null,11.199999999999976,1404.927999999991,1964.9279999999899,0.7150022799817592,379.68999999999824,429.68999999999596,0.8836370406572222,{"$nulls":3},1.0492180226701806]
[null,null,11.299999999999976,1442.8969999999908,2007.8969999999895,0.7186110642129544,386.4699999999948,436.4699999999948,0.885444589547963,{"$nulls":3},1.0530784434834188]
[null,null,11.399999999999975,1481.5439999999903,2051.543999999989,0.7221604801066895,393.30999999999904,443.3100000000013,0.8872121089079829,{"$nulls":3},1.0569048513364716]
[null,null,11.499999999999975,1520.8749999999902,2095.874999999989,0.7256515775034285,400.20999999999503,450.20999999999276,0.8889407165545,{"$nulls":3},1.0606978403536107]
[null,null,11.599999999999975,1560.8959999999897,2140.8959999999884,0.7290853922843511,407.16999999999643,457.16999999999643,0.8906314937550575,{"$nulls":3},1.0644579892269175]
[null,null,11.699999999999974,1601.6129999999894,2186.612999999988,0.7324629461180365,414.1899999999964,464.1899999999987,0.8922854865464521,{"$nulls":3},1.0681858617461606]
{"$rows_left_out":385}
{"sheet":"Defining Function","index":2,"n_rows":12,"n_cols":1,"rows_kept":12}
["                                                     Defining a Function in Excel"]
[]
["Computers have very specific rules you must follow when defining a function.  If you don't, the program will either not work at all or will work incorrectly."]
[]
["1. The Variable used should be the one named in the instruction, usually x, though sometimes y, t, Q (for an angle theta), "]
[" or even x and y (for a function of two variables). "]
[]
["2.  Order of Operations:  There five arithmetic operations, addition (+), subtraction (-), multiplication (*), division (/), and  exponentiation or power (^).  When computers see any of these operation symbols, they perform the indicated steps in a very particular order.  First, the power is done.  Second, products and quotients of adjacent terms is done.  Third, and last, sums and differences of adjacent terms are done.  So, in 10*x^3 + 5*x – 7, say with x = 2, the first pass only calculates 2^3 and ignores the multiplications and the sums and differences to calculate 2^3 = 8.  The second pass looks at 10*8 + 5*2 – 7 and only does the multiplications, so it produces 80 + 10 -  7.  The third pass looks at the +’s and –‘s to produce 80 + 10 – 7 = 83.  "]
[]
["3.    Parentheses  If you need an operation involving more than two adjacent terms, as in Ö4^3 + 6^2, the computer would take the square root of  4 to produce 2^3 + 6^2;  it would then cube the 2 and square the 6 to produce 8 + 36; and finally it would add the 8 and the 36 to get 44.  If you actually wanted the square root of the entire expression, you would need to use parentheses, as in Ö(4^3 + 6^2) to tell the computer to do all the operations inside the parentheses before taking the square root.  Therefore, it would calculate (4^3 + 6^2) = 64 + 36 = 100 and then take the square root of Ö100  =  10."]
[]
["4.  Built-In Functions  Computer programs have built-in functions for most common algebraic functions.  In Excel, the square root function is denoted by SQRT(…), so SQRT(100) = 10.  Alternatively, you could enter it as 100^.5 or 100^(1/2); notice that parentheses are needed to have the ½ done first.  The common trig functions are SIN (…), COS (…), and TAN (…), where the arguments are automatically interpreted as being in radians, not degrees.  The logarithm to the base 10 is represented by LOG (…) and the logarithm with the base e, known as the natural logarithm, is LN (…). The corresponding exponential function with base e is EXP (x).  If x is the variable, then each of these would be SQRT (x), SIN (x), COS (x), TAN (x), LOG (x) (for log with base 10 ), LN (x) (for log with base e ), and EXP (x)."]

{"sheet":"Sheet3","index":3,"n_rows":0,"n_cols":0,"rows_kept":0}