{"text_format":"3","workbook":"xlsx","n_sheets":3,"sheets":["Sheet1","Sheet2","Sheet3"],"not_rendered":{"charts":2,"images":5,"macros":1,"defined_names":10,"comments":1},"read":"whole","date_system":"1900"}

{"sheet":"Sheet1","index":0,"n_rows":49,"n_cols":17,"rows_kept":49,"merged":[[42,2,42,3]]}
[null,"  Smallest Lot for a Building"]
[]
[null,"This DIGMath module lets you investigate "]
[null,"       the calculus problem of finding"]
[null,"       the smallest lot that will contain "]
[null,"          a building having a given area"]
[null,null,"given required distances"]
[null,null,"        on all sides."]
[]
["What is the area A of the building?"]
[null,"   (1000 - 10,000 square feet)?",{"$nulls":3},{"$f":"D12*500+500","v":3000}]
[{"$nulls":3},5,{"$f":"#REF!+D12*(#REF!-#REF!)/100","v":{"$error":"#REF!"}}]
[]
[]
["How much distance a in front (10 - 50 ft)?",{"$nulls":4},{"$f":"D16","v":31}]
[{"$nulls":3},31]
[{"$nulls":11},"The graph of the Area  =",null,null,{"$f":"TEXT(a+b,\"0\")&\"x + \" & TEXT(cc*RR,\"0\") & \"/x +\" & TEXT(RR+(a+b)*cc,\"0\")","v":"59x + 57000/x +4121"}]
["How much distance b in back (10 - 50 ft)?",{"$nulls":4},{"$f":"D19","v":28}]
[{"$nulls":3},28]
[{"$nulls":11},"  Select a horizontal length: x0 =",{"$nulls":3},{"$f":"LOOKUP(O22,Sheet2!A3:A1003,Sheet2!B3:B1003)","v":31.84000000000009},"feet"]
["How much distance c on sides (10 - 25 ft)?",{"$nulls":4},{"$f":"D22","v":19}]
[{"$nulls":3},19,{"$nulls":10},156,{"$f":"Sheet2!H7+O22*(Sheet2!H8-Sheet2!H7)/100","v":228.4}]
[]
[]
[{"$f":"\"With a horizontal length of \"&TEXT(x0,\"0\") &\" feet for the building,\"","v":"With a horizontal length of 32 feet for the building,"}]
[{"$f":"\"   the vertical length of the building is \"&TEXT(RR/x0,\"0\") &\" feet,\"","v":"   the vertical length of the building is 94 feet,"}]
[]
[{"$f":"\"The corresponding plot of land needed for the building\"","v":"The corresponding plot of land needed for the building"}]
[{"$f":"\"   measures \"&TEXT(x0+2*cc,\"0\")&\" feet by \"&TEXT(y0+a+b,\"0\")&\" feet.\"","v":"   measures 70 feet by 153 feet."}]
[]
[]
[]
[]
["Click each item below for suggestions and investigations"]
[null,"   Item 1"]
[null,"   Item 2"]
[null,"   Item 3"]
[]
[]
[]
[]
["To access/download all the DIGMath Apps for Calculus"]
["      Click this link:",null,"DIGMath for Calculus"]
[]
["Created by:  Sheldon P. Gordon   "]
["                      Farmingdale State College    "]
["Development of this module was supported by the "]
["NSF's Division of Undergraduate Education  "]
["under grants DUE-0310123 and DUE-0442160."]

{"sheet":"Sheet2","index":1,"n_rows":1003,"n_cols":12,"rows_kept":1003}
[null,"x","f(x)",{"$nulls":3},"xl=",{"$f":"IF(Sheet1!$P$22<Sheet2!H7+80*Sheet2!H5,Sheet2!H7,Sheet1!P22-80*Sheet2!H5)","v":217.20000000000002},{"$f":"LOOKUP(Sheet1!P22,Sheet2!B3:B1002,Sheet2!C3:C1002)+LOOKUP(Sheet1!P22,Sheet2!B3:B1002,Sheet2!D3:D1002)*(H1-Sheet1!P22)","v":13343.094997998038},"\"=yl"]
[{"$nulls":6},"xr=",{"$f":"IF(Sheet1!$P$22>Sheet2!H8-80*Sheet2!H5,Sheet2!H8,Sheet1!P22+80*Sheet2!H5)","v":150},{"$f":"LOOKUP(Sheet1!P22,Sheet2!B3:B1003,Sheet2!C3:C1003)+LOOKUP(Sheet1!P22,Sheet2!B3:B1003,Sheet2!D3:D1003)*(H2-Sheet1!P22)","v":13350.999999999905},"\"=yR"]
[0,{"$f":"xMin","v":{"v":10,"d":"10.0"}},{"$f":"(a+b)*x+cc*RR/x+RR+(a+b)*cc","v":10411}]
[1,{"$f":"B3+dx","v":{"v":10.14,"d":"10.1"}},10340.56177514793]
[2,{"v":10.280000000000001,"d":"10.3"},10272.267081712063,{"$nulls":3},"delta x = ",{"$f":"(xMax-xMin)/1000","v":0.14},null,null,"swim distance"]
[3,{"v":10.420000000000002,"d":"10.4"},10206.02952015355,{"$nulls":7},"distance =",{"$f":"SQRT(x0^2+200^2)","v":202.51860556501964}]
[4,{"v":10.560000000000002,"d":"10.6"},10141.767272727271,{"$nulls":3},"xMin =",10,null,null,"time =",{"$f":"L6/s","v":{"$error":"#NAME?"}}]
[5,{"v":10.700000000000003,"d":"10.7"},10079.402803738318,{"$nulls":3},"xMax =",{"$f":"RR/20","v":150}]
[6,{"v":10.840000000000003,"d":"10.8"},10018.862583025828]
[7,{"v":10.980000000000004,"d":"11.0"},9960.07683060109,{"$nulls":6},"alpha =",{"$f":"LOOKUP(x0,B3:B1003:C3:C1003)","v":7789.761005025126},"radians"]
[8,{"v":11.120000000000005,"d":"11.1"},9902.979280575539,{"$nulls":3},"Point",{"$nulls":3},{"$f":"180/PI()*K10","v":446320.42900352617},"degrees"]
[9,{"v":11.260000000000005,"d":"11.3"},9847.50696269982,{"$nulls":3},{"$f":"x0","v":31.84000000000009},{"$f":"LOOKUP(Sheet1!O22,Sheet2!A3:A1003,Sheet2!C3:C1003)","v":7789.761005025126}]
[10,{"v":11.400000000000006,"d":"11.4"},9793.599999999999]
[11,{"v":11.540000000000006,"d":"11.5"},9741.201421143845,{"$nulls":3},"Horizontal Line"]
[12,{"v":11.680000000000007,"d":"11.7"},9690.256986301367,{"$nulls":3},0,0]
[13,{"v":11.820000000000007,"d":"11.8"},9640.715025380709,{"$nulls":3},{"$f":"G12","v":31.84000000000009},0]
[14,{"v":11.960000000000008,"d":"12.0"},9592.526287625416]
[15,{"v":12.100000000000009,"d":"12.1"},9545.64380165289,{"$nulls":3},"Diagnonal Line"]
[16,{"v":12.240000000000009,"d":"12.2"},9500.022745098036,{"$nulls":3},0,200]
[17,{"v":12.38000000000001,"d":"12.4"},9455.620323101773,{"$nulls":3},997,0]
[18,{"v":12.52000000000001,"d":"12.5"},9412.395654952074]
[19,{"v":12.66000000000001,"d":"12.7"},9370.309668246442]
[20,{"v":12.800000000000011,"d":"12.8"},9329.324999999997,{"$nulls":3},"Point on curve"]
[21,{"v":12.940000000000012,"d":"12.9"},9289.405904173103,{"$nulls":3},"x=",{"$f":"G12*H5","v":4.457600000000013}]
[22,{"v":13.080000000000013,"d":"13.1"},9250.518165137612,{"$nulls":3},{"$f":"x0","v":31.84000000000009},{"$f":"H12","v":7789.761005025126}]
[23,{"v":13.220000000000013,"d":"13.2"},9212.629016641447]
[24,{"v":13.360000000000014,"d":"13.4"},9175.70706586826,{"$nulls":3},"Vertical length of building y =",null,null,{"$f":"RR/x0","v":94.22110552763793}]
[25,{"v":13.500000000000014,"d":"13.5"},9139.722222222219]
[26,{"v":13.640000000000015,"d":"13.6"},9104.64563049853]
[27,{"v":13.780000000000015,"d":"13.8"},9070.449608127718]
[28,{"v":13.920000000000016,"d":"13.9"},9037.107586206894]
[29,{"v":14.060000000000016,"d":"14.1"},9004.59405405405]
[30,{"v":14.200000000000017,"d":"14.2"},8972.88450704225]
[31,{"v":14.340000000000018,"d":"14.3"},8941.955397489535]
[32,{"v":14.480000000000018,"d":"14.5"},8911.784088397786]
[33,{"v":14.620000000000019,"d":"14.6"},8882.348809849518]
[34,{"v":14.76000000000002,"d":"14.8"},8853.628617886174]
[35,{"v":14.90000000000002,"d":"14.9"},8825.603355704694]
[36,{"v":15.04000000000002,"d":"15.0"},8798.253617021273]
[37,{"v":15.180000000000021,"d":"15.2"},8771.560711462447]
[38,{"v":15.320000000000022,"d":"15.3"},8745.506631853783]
[39,{"v":15.460000000000022,"d":"15.5"},8720.074023285895]
[40,{"v":15.600000000000023,"d":"15.6"},8695.24615384615]
[41,{"v":15.740000000000023,"d":"15.7"},8671.00688691232]
[42,{"v":15.880000000000024,"d":"15.9"},8647.340654911835]
[43,{"v":16.020000000000024,"d":"16.0"},8624.232434456924]
[44,{"v":16.160000000000025,"d":"16.2"},8601.667722772272]
[45,{"v":16.300000000000026,"d":"16.3"},8579.63251533742]
[46,{"v":16.440000000000026,"d":"16.4"},8558.11328467153]
[47,{"v":16.580000000000027,"d":"16.6"},8537.096960193]
[48,{"v":16.720000000000027,"d":"16.7"},8516.570909090904]
[49,{"v":16.860000000000028,"d":"16.9"},8496.522918149461]
[50,{"v":17.00000000000003,"d":"17.0"},8476.941176470584]
[51,{"v":17.14000000000003,"d":"17.1"},8457.81425904317]
[52,{"v":17.28000000000003,"d":"17.3"},8439.131111111106]
[53,{"v":17.42000000000003,"d":"17.4"},8420.88103329506]
[54,{"v":17.56000000000003,"d":"17.6"},8403.053667425964]
[55,{"v":17.70000000000003,"d":"17.7"},8385.638983050843]
[56,{"v":17.840000000000032,"d":"17.8"},8368.627264573988]
[57,{"v":17.980000000000032,"d":"18.0"},8352.009098998884]
[58,{"v":18.120000000000033,"d":"18.1"},8335.775364238407]
[59,{"v":18.260000000000034,"d":"18.3"},8319.917217962757]
[60,{"v":18.400000000000034,"d":"18.4"},8304.426086956519]
[61,{"v":18.540000000000035,"d":"18.5"},8289.293656957925]
[62,{"v":18.680000000000035,"d":"18.7"},8274.511862955029]
[63,{"v":18.820000000000036,"d":"18.8"},8260.07287991498]
[64,{"v":18.960000000000036,"d":"19.0"},{"$f":"(a+b)*x+cc*RR/x+RR+(a+b)*cc","v":8245.969113924048}]
[65,{"$f":"B67+dx","v":{"v":19.100000000000037,"d":"19.1"}},8232.193193717274]
[66,{"v":19.240000000000038,"d":"19.2"},8218.73796257796]
[67,{"v":19.380000000000038,"d":"19.4"},8205.596470588232]
[68,{"v":19.52000000000004,"d":"19.5"},8192.761967213111]
[69,{"v":19.66000000000004,"d":"19.7"},8180.227894201421]
[70,{"v":19.80000000000004,"d":"19.8"},8167.987878787875]
[71,{"v":19.94000000000004,"d":"19.9"},8156.035727181541]
[72,{"v":20.08000000000004,"d":"20.1"},8144.36541832669]
[73,{"v":20.22000000000004,"d":"20.2"},8132.971097922846]
[74,{"v":20.360000000000042,"d":"20.4"},8121.847072691549]
[75,{"v":20.500000000000043,"d":"20.5"},8110.987804878046]
[76,{"v":20.640000000000043,"d":"20.6"},8100.387906976741]
[77,{"v":20.780000000000044,"d":"20.8"},8090.042136669872]
[78,{"v":20.920000000000044,"d":"20.9"},8079.945391969404]
[79,{"v":21.060000000000045,"d":"21.1"},8070.092706552703]
[80,{"v":21.200000000000045,"d":"21.2"},8060.479245283016]
[81,{"v":21.340000000000046,"d":"21.3"},8051.100299906277]
[82,{"v":21.480000000000047,"d":"21.5"},8041.951284916198]
[83,{"v":21.620000000000047,"d":"21.6"},8033.027733580016]
[84,{"v":21.760000000000048,"d":"21.8"},8024.325294117644]
[85,{"v":21.90000000000005,"d":"21.9"},8015.839726027394]
[86,{"v":22.04000000000005,"d":"22.0"},8007.566896551722]
[87,{"v":22.18000000000005,"d":"22.2"},7999.5027772768235]
[88,{"v":22.32000000000005,"d":"22.3"},7991.643440860213]
[89,{"v":22.46000000000005,"d":"22.5"},7983.9850578806745]
[90,{"v":22.60000000000005,"d":"22.6"},7976.523893805307]
[91,{"v":22.74000000000005,"d":"22.7"},7969.256306068599]
[92,{"v":22.880000000000052,"d":"22.9"},7962.178741258738]
[93,{"v":23.020000000000053,"d":"23.0"},7955.2877324066]
[94,{"v":23.160000000000053,"d":"23.2"},7948.579896373054]
[95,{"v":23.300000000000054,"d":"23.3"},7942.051931330469]
[96,{"v":23.440000000000055,"d":"23.4"},7935.700614334468]
[97,{"v":23.580000000000055,"d":"23.6"},7929.522798982186]
[98,{"v":23.720000000000056,"d":"23.7"},7923.515413153455]
[99,{"v":23.860000000000056,"d":"23.9"},7917.6754568315155]
[100,{"v":24.000000000000057,"d":"24.0"},7911.999999999998]
[101,{"v":24.140000000000057,"d":"24.1"},7906.486180613088]
[102,{"v":24.280000000000058,"d":"24.3"},7901.131202635912]
[103,{"v":24.42000000000006,"d":"24.4"},7895.932334152332]
[104,{"v":24.56000000000006,"d":"24.6"},7890.886905537457]
[105,{"v":24.70000000000006,"d":"24.7"},7885.992307692306]
[106,{"v":24.84000000000006,"d":"24.8"},7881.245990338162]
[107,{"v":24.98000000000006,"d":"25.0"},7876.645460368292]
[108,{"v":25.12000000000006,"d":"25.1"},7872.188280254775]
[109,{"v":25.260000000000062,"d":"25.3"},7867.872066508312]
[110,{"v":25.400000000000063,"d":"25.4"},7863.694488188975]
[111,{"v":25.540000000000063,"d":"25.5"},7859.653265465934]
[112,{"v":25.680000000000064,"d":"25.7"},7855.746168224297]
[113,{"v":25.820000000000064,"d":"25.8"},7851.971014717272]
[114,{"v":25.960000000000065,"d":"26.0"},7848.32567026194]
[115,{"v":26.100000000000065,"d":"26.1"},7844.80804597701]
[116,{"v":26.240000000000066,"d":"26.2"},7841.416097560974]
[117,{"v":26.380000000000067,"d":"26.4"},7838.147824109172]
[118,{"v":26.520000000000067,"d":"26.5"},7835.001266968324]
[119,{"v":26.660000000000068,"d":"26.7"},7831.974508627155]
[120,{"v":26.800000000000068,"d":"26.8"},7829.065671641789]
[121,{"v":26.94000000000007,"d":"26.9"},7826.272917594653]
[122,{"v":27.08000000000007,"d":"27.1"},7823.594446085671]
[123,{"v":27.22000000000007,"d":"27.2"},7821.028493754591]
[124,{"v":27.36000000000007,"d":"27.4"},7818.573333333332]
[125,{"v":27.50000000000007,"d":"27.5"},7816.227272727272]
[126,{"v":27.64000000000007,"d":"27.6"},7813.988654124456]
[127,{"v":27.780000000000072,"d":"27.8"},7811.8558531317485]
[128,{"v":27.920000000000073,"d":"27.9"},{"$f":"(a+b)*x+cc*RR/x+RR+(a+b)*cc","v":7809.827277936962}]
[129,{"$f":"B131+dx","v":{"v":28.060000000000073,"d":"28.1"}},7807.901368496079]
[130,{"v":28.200000000000074,"d":"28.2"},7806.07659574468]
[131,{"v":28.340000000000074,"d":"28.3"},7804.351460832744]
[132,{"v":28.480000000000075,"d":"28.5"},7802.7244943820215]
[133,{"v":28.620000000000076,"d":"28.6"},7801.194255765198]
[134,{"v":28.760000000000076,"d":"28.8"},7799.759332406119]
[135,{"v":28.900000000000077,"d":"28.9"},7798.418339100345]
[136,{"v":29.040000000000077,"d":"29.0"},7797.169917355372]
[137,{"v":29.180000000000078,"d":"29.2"},7796.012734749828]
[138,{"v":29.32000000000008,"d":"29.3"},7794.94548431105]
[139,{"v":29.46000000000008,"d":"29.5"},7793.966883910387]
[140,{"v":29.60000000000008,"d":"29.6"},7793.075675675675]
[141,{"v":29.74000000000008,"d":"29.7"},7792.2706254203085]
[142,{"v":29.88000000000008,"d":"29.9"},7791.550522088353]
[143,{"v":30.02000000000008,"d":"30.0"},7790.91417721519]
[144,{"v":30.160000000000082,"d":"30.2"},7790.360424403183]
[145,{"v":30.300000000000082,"d":"30.3"},7789.888118811881]
[146,{"v":30.440000000000083,"d":"30.4"},7789.4961366622865]
[147,{"v":30.580000000000084,"d":"30.6"},7789.183374754742]
[148,{"v":30.720000000000084,"d":"30.7"},7788.94875]
[149,{"v":30.860000000000085,"d":"30.9"},7788.791198963059]
[150,{"v":31.000000000000085,"d":"31.0"},7788.709677419355]
[151,{"v":31.140000000000086,"d":"31.1"},7788.7031599229285]
[152,{"v":31.280000000000086,"d":"31.3"},7788.770639386189]
[153,{"v":31.420000000000087,"d":"31.4"},7788.911126670911]
[154,{"v":31.560000000000088,"d":"31.6"},7789.123650190114]
[155,{"v":31.700000000000088,"d":"31.7"},7789.407255520505]
[156,{"v":31.84000000000009,"d":"31.8"},7789.761005025126]
[157,{"v":31.98000000000009,"d":"32.0"},7790.183977485929]
[158,{"v":32.12000000000009,"d":"32.1"},7790.6752677459535]
[159,{"v":32.26000000000009,"d":"32.3"},7791.233986360819]
[160,{"v":32.40000000000009,"d":"32.4"},7791.8592592592595]
[161,{"v":32.54000000000009,"d":"32.5"},7792.550227412416]
[162,{"v":32.68000000000009,"d":"32.7"},7793.306046511629]
[163,{"v":32.82000000000009,"d":"32.8"},7794.1258866544795]
[164,{"v":32.96000000000009,"d":"33.0"},7795.008932038836]
[165,{"v":33.100000000000094,"d":"33.1"},7795.954380664653]
[166,{"v":33.240000000000094,"d":"33.2"},7796.9614440433215]
[167,{"v":33.380000000000095,"d":"33.4"},7798.029346914321]
[168,{"v":33.520000000000095,"d":"33.5"},7799.157326968974]
[169,{"v":33.660000000000096,"d":"33.7"},7800.344634581106]
[170,{"v":33.8000000000001,"d":"33.8"},7801.59053254438]
[171,{"v":33.9400000000001,"d":"33.9"},7802.894295816147]
[172,{"v":34.0800000000001,"d":"34.1"},7804.255211267607]
[173,{"v":34.2200000000001,"d":"34.2"},7805.672577440095]
[174,{"v":34.3600000000001,"d":"34.4"},7807.145704307335]
[175,{"v":34.5000000000001,"d":"34.5"},7808.67391304348]
[176,{"v":34.6400000000001,"d":"34.6"},7810.256535796768]
[177,{"v":34.7800000000001,"d":"34.8"},7811.892915468661]
[178,{"v":34.9200000000001,"d":"34.9"},7813.582405498283]
[179,{"v":35.0600000000001,"d":"35.1"},7815.324369652026]
[180,{"v":35.2000000000001,"d":"35.2"},7817.118181818183]
[181,{"v":35.3400000000001,"d":"35.3"},7818.963225806453]
[182,{"v":35.4800000000001,"d":"35.5"},7820.8588951522]
[183,{"v":35.620000000000104,"d":"35.6"},7822.804592925324]
[184,{"v":35.760000000000105,"d":"35.8"},7824.799731543626]
[185,{"v":35.900000000000105,"d":"35.9"},7826.843732590531]
[186,{"v":36.040000000000106,"d":"36.0"},7828.936026637071]
[187,{"v":36.180000000000106,"d":"36.2"},7831.0760530679945]
[188,{"v":36.32000000000011,"d":"36.3"},7833.263259911896]
[189,{"v":36.46000000000011,"d":"36.5"},7835.497103675262]
[190,{"v":36.60000000000011,"d":"36.6"},7837.777049180329]
[191,{"v":36.74000000000011,"d":"36.7"},7840.102569406643]
[192,{"v":36.88000000000011,"d":"36.9"},{"$f":"(a+b)*x+cc*RR/x+RR+(a+b)*cc","v":7842.473145336227}]
[193,{"$f":"B195+dx","v":{"v":37.02000000000011,"d":"37.0"}},7844.888265802271]
[194,{"v":37.16000000000011,"d":"37.2"},7847.3474273412285]
[195,{"v":37.30000000000011,"d":"37.3"},7849.85013404826]
[196,{"v":37.44000000000011,"d":"37.4"},7852.395897435899]
[197,{"v":37.58000000000011,"d":"37.6"},7854.984236295904]
{"$rows_left_out":804}
{"sheet":"Sheet3","index":2,"n_rows":1003,"n_cols":2,"rows_kept":1003}
[{"$f":"xMin","v":10},{"$f":"9","v":9}]
[{"$f":"A1+dx","v":10.14},{"$f":"9","v":9}]
[10.280000000000001,{"$f":"9","v":9}]
[10.420000000000002,{"$f":"9","v":9}]
[10.560000000000002,{"$f":"9","v":9}]
[10.700000000000003,{"$f":"9","v":9}]
[10.840000000000003,{"$f":"9","v":9}]
[10.980000000000004,{"$f":"9","v":9}]
[11.120000000000005,{"$f":"9","v":9}]
[11.260000000000005,{"$f":"9","v":9}]
[11.400000000000006,{"$f":"9","v":9}]
[11.540000000000006,{"$f":"9","v":9}]
[11.680000000000007,{"$f":"9","v":9}]
[11.820000000000007,{"$f":"9","v":9}]
[11.960000000000008,{"$f":"9","v":9}]
[12.100000000000009,{"$f":"9","v":9}]
[12.240000000000009,{"$f":"9","v":9}]
[12.38000000000001,{"$f":"9","v":9}]
[12.52000000000001,{"$f":"9","v":9}]
[12.66000000000001,{"$f":"9","v":9}]
[12.800000000000011,{"$f":"9","v":9}]
[12.940000000000012,{"$f":"9","v":9}]
[13.080000000000013,{"$f":"9","v":9}]
[13.220000000000013,{"$f":"9","v":9}]
[13.360000000000014,{"$f":"9","v":9}]
[13.500000000000014,{"$f":"9","v":9}]
[13.640000000000015,{"$f":"9","v":9}]
[13.780000000000015,{"$f":"9","v":9}]
[13.920000000000016,{"$f":"9","v":9}]
[14.060000000000016,{"$f":"9","v":9}]
[14.200000000000017,{"$f":"9","v":9}]
[14.340000000000018,{"$f":"9","v":9}]
[14.480000000000018,{"$f":"9","v":9}]
[14.620000000000019,{"$f":"9","v":9}]
[14.76000000000002,{"$f":"9","v":9}]
[14.90000000000002,{"$f":"9","v":9}]
[15.04000000000002,{"$f":"9","v":9}]
[15.180000000000021,{"$f":"9","v":9}]
[15.320000000000022,{"$f":"9","v":9}]
[15.460000000000022,{"$f":"9","v":9}]
[15.600000000000023,{"$f":"9","v":9}]
[15.740000000000023,{"$f":"9","v":9}]
[15.880000000000024,{"$f":"9","v":9}]
[16.020000000000024,{"$f":"9","v":9}]
[16.160000000000025,{"$f":"9","v":9}]
[16.300000000000026,{"$f":"9","v":9}]
[16.440000000000026,{"$f":"9","v":9}]
[16.580000000000027,{"$f":"9","v":9}]
[16.720000000000027,{"$f":"9","v":9}]
[16.860000000000028,{"$f":"9","v":9}]
[17.00000000000003,{"$f":"9","v":9}]
[17.14000000000003,{"$f":"9","v":9}]
[17.28000000000003,{"$f":"9","v":9}]
[17.42000000000003,{"$f":"9","v":9}]
[17.56000000000003,{"$f":"9","v":9}]
[17.70000000000003,{"$f":"9","v":9}]
[17.840000000000032,{"$f":"9","v":9}]
[17.980000000000032,{"$f":"9","v":9}]
[18.120000000000033,{"$f":"9","v":9}]
[18.260000000000034,{"$f":"9","v":9}]
[18.400000000000034,{"$f":"9","v":9}]
[18.540000000000035,{"$f":"9","v":9}]
[18.680000000000035,{"$f":"9","v":9}]
[18.820000000000036,{"$f":"9","v":9}]
[18.960000000000036,{"$f":"9","v":9}]
[{"$f":"A65+dx","v":19.100000000000037},{"$f":"9","v":9}]
[19.240000000000038,{"$f":"9","v":9}]
[19.380000000000038,{"$f":"9","v":9}]
[19.52000000000004,{"$f":"9","v":9}]
[19.66000000000004,{"$f":"9","v":9}]
[19.80000000000004,{"$f":"9","v":9}]
[19.94000000000004,{"$f":"9","v":9}]
[20.08000000000004,{"$f":"9","v":9}]
[20.22000000000004,{"$f":"9","v":9}]
[20.360000000000042,{"$f":"9","v":9}]
[20.500000000000043,{"$f":"9","v":9}]
[20.640000000000043,{"$f":"9","v":9}]
[20.780000000000044,{"$f":"9","v":9}]
[20.920000000000044,{"$f":"9","v":9}]
[21.060000000000045,{"$f":"9","v":9}]
[21.200000000000045,{"$f":"9","v":9}]
[21.340000000000046,{"$f":"9","v":9}]
[21.480000000000047,{"$f":"9","v":9}]
[21.620000000000047,{"$f":"9","v":9}]
[21.760000000000048,{"$f":"9","v":9}]
[21.90000000000005,{"$f":"9","v":9}]
[22.04000000000005,{"$f":"9","v":9}]
[22.18000000000005,{"$f":"9","v":9}]
[22.32000000000005,{"$f":"9","v":9}]
[22.46000000000005,{"$f":"9","v":9}]
[22.60000000000005,{"$f":"9","v":9}]
[22.74000000000005,{"$f":"9","v":9}]
[22.880000000000052,{"$f":"9","v":9}]
[23.020000000000053,{"$f":"9","v":9}]
[23.160000000000053,{"$f":"9","v":9}]
[23.300000000000054,{"$f":"9","v":9}]
[23.440000000000055,{"$f":"9","v":9}]
[23.580000000000055,{"$f":"9","v":9}]
[23.720000000000056,{"$f":"9","v":9}]
[23.860000000000056,{"$f":"9","v":9}]
[24.000000000000057,{"$f":"9","v":9}]
[24.140000000000057,{"$f":"9","v":9}]
[24.280000000000058,{"$f":"9","v":9}]
[24.42000000000006,{"$f":"9","v":9}]
[24.56000000000006,{"$f":"9","v":9}]
[24.70000000000006,{"$f":"9","v":9}]
[24.84000000000006,{"$f":"9","v":9}]
[24.98000000000006,{"$f":"9","v":9}]
[25.12000000000006,{"$f":"9","v":9}]
[25.260000000000062,{"$f":"9","v":9}]
[25.400000000000063,{"$f":"9","v":9}]
[25.540000000000063,{"$f":"9","v":9}]
[25.680000000000064,{"$f":"9","v":9}]
[25.820000000000064,{"$f":"9","v":9}]
[25.960000000000065,{"$f":"9","v":9}]
[26.100000000000065,{"$f":"9","v":9}]
[26.240000000000066,{"$f":"9","v":9}]
[26.380000000000067,{"$f":"9","v":9}]
[26.520000000000067,{"$f":"9","v":9}]
[26.660000000000068,{"$f":"9","v":9}]
[26.800000000000068,{"$f":"9","v":9}]
[26.94000000000007,{"$f":"9","v":9}]
[27.08000000000007,{"$f":"9","v":9}]
[27.22000000000007,{"$f":"9","v":9}]
[27.36000000000007,{"$f":"9","v":9}]
[27.50000000000007,{"$f":"9","v":9}]
[27.64000000000007,{"$f":"9","v":9}]
[27.780000000000072,{"$f":"9","v":9}]
[27.920000000000073,{"$f":"9","v":9}]
[{"$f":"A129+dx","v":28.060000000000073},{"$f":"9","v":9}]
[28.200000000000074,{"$f":"9","v":9}]
[28.340000000000074,{"$f":"9","v":9}]
[28.480000000000075,{"$f":"9","v":9}]
[28.620000000000076,{"$f":"9","v":9}]
[28.760000000000076,{"$f":"9","v":9}]
[28.900000000000077,{"$f":"9","v":9}]
[29.040000000000077,{"$f":"9","v":9}]
[29.180000000000078,{"$f":"9","v":9}]
[29.32000000000008,{"$f":"9","v":9}]
[29.46000000000008,{"$f":"9","v":9}]
[29.60000000000008,{"$f":"9","v":9}]
[29.74000000000008,{"$f":"9","v":9}]
[29.88000000000008,{"$f":"9","v":9}]
[30.02000000000008,{"$f":"9","v":9}]
[30.160000000000082,{"$f":"9","v":9}]
[30.300000000000082,{"$f":"9","v":9}]
[30.440000000000083,{"$f":"9","v":9}]
[30.580000000000084,{"$f":"9","v":9}]
[30.720000000000084,{"$f":"9","v":9}]
[30.860000000000085,{"$f":"9","v":9}]
[31.000000000000085,{"$f":"9","v":9}]
[31.140000000000086,{"$f":"9","v":9}]
[31.280000000000086,{"$f":"9","v":9}]
[31.420000000000087,{"$f":"9","v":9}]
[31.560000000000088,{"$f":"9","v":9}]
[31.700000000000088,{"$f":"9","v":9}]
[31.84000000000009,{"$f":"9","v":9}]
[31.98000000000009,{"$f":"9","v":9}]
[32.12000000000009,{"$f":"9","v":9}]
[32.26000000000009,{"$f":"9","v":9}]
[32.40000000000009,{"$f":"9","v":9}]
[32.54000000000009,{"$f":"9","v":9}]
[32.68000000000009,{"$f":"9","v":9}]
[32.82000000000009,{"$f":"9","v":9}]
[32.96000000000009,{"$f":"9","v":9}]
[33.100000000000094,{"$f":"9","v":9}]
[33.240000000000094,{"$f":"9","v":9}]
[33.380000000000095,{"$f":"9","v":9}]
[33.520000000000095,{"$f":"9","v":9}]
[33.660000000000096,{"$f":"9","v":9}]
[33.8000000000001,{"$f":"9","v":9}]
[33.9400000000001,{"$f":"9","v":9}]
[34.0800000000001,{"$f":"9","v":9}]
[34.2200000000001,{"$f":"9","v":9}]
[34.3600000000001,{"$f":"9","v":9}]
[34.5000000000001,{"$f":"9","v":9}]
[34.6400000000001,{"$f":"9","v":9}]
[34.7800000000001,{"$f":"9","v":9}]
[34.9200000000001,{"$f":"9","v":9}]
[35.0600000000001,{"$f":"9","v":9}]
[35.2000000000001,{"$f":"9","v":9}]
[35.3400000000001,{"$f":"9","v":9}]
[35.4800000000001,{"$f":"9","v":9}]
[35.620000000000104,{"$f":"9","v":9}]
[35.760000000000105,{"$f":"9","v":9}]
[35.900000000000105,{"$f":"9","v":9}]
[36.040000000000106,{"$f":"9","v":9}]
[36.180000000000106,{"$f":"9","v":9}]
[36.32000000000011,{"$f":"9","v":9}]
[36.46000000000011,{"$f":"9","v":9}]
[36.60000000000011,{"$f":"9","v":9}]
[36.74000000000011,{"$f":"9","v":9}]
[36.88000000000011,{"$f":"9","v":9}]
[{"$f":"A193+dx","v":37.02000000000011},{"$f":"9","v":9}]
[37.16000000000011,{"$f":"9","v":9}]
[37.30000000000011,{"$f":"9","v":9}]
[37.44000000000011,{"$f":"9","v":9}]
[37.58000000000011,{"$f":"9","v":9}]
[37.72000000000011,{"$f":"9","v":9}]
[37.86000000000011,{"$f":"9","v":9}]
{"$rows_left_out":803}