{"text_format":"3","workbook":"xlsx","n_sheets":3,"sheets":["Length of Shadow","Tip of Shadow","Sheet2"],"not_rendered":{"charts":8,"images":8,"macros":1,"defined_names":18,"comments":2},"read":"whole","date_system":"1900"}

{"sheet":"Length of Shadow","index":0,"n_rows":36,"n_cols":20,"rows_kept":36,"merged":[[29,2,29,3]]}
[null," Length of a Shadow Problem"]
[]
[null," This DIGMath module lets you investigate "]
[null,"the related rates calculus problem of finding"]
[null,"       the rate dS/dt at which the length S"]
[null,"          of a person's shadow increases"]
[null," as the person walks away from a lamppost "]
[null,null,"        at a given rate."]
[]
[]
["What is the height L of the lamppost (10 - 30 feet)?"]
[{"$nulls":3},10,{"$f":"#REF!+D12*(#REF!-#REF!)/100","v":{"$error":"#REF!"}},{"$f":"D12","v":10}]
[]
["How tall  is the person H (60-75, in inches)?"]
[{"$nulls":3},68,{"$f":"#REF!+D15*(#REF!-#REF!)/100","v":{"$error":"#REF!"}},{"$f":"D15","v":68}]
[]
["How fast is the person walking (1 - 6 feet per second)?"]
[{"$nulls":3},3,{"$f":"#REF!+D18*(#REF!-#REF!)/100","v":{"$error":"#REF!"}},{"$f":"D18","v":3}]
[]
[]
[]
["Click each item below for suggestions and investigations",{"$nulls":10},"   Select the distance from the lamppost: x0 =",{"$nulls":3},{"$f":"O23/5","v":26.6},"feet","Time =",{"$f":"x0/rate","v":{"v":8.866666666666667,"d":"8.9"}},"seconds"]
[null,null,"   Item 1",{"$nulls":11},133,{"$f":"Sheet2!#REF!+O23*(Sheet2!#REF!-Sheet2!#REF!)/100","v":{"$error":"#REF!"}}]
[null,null,"   Item 2"]
[null,null,"   Item 3",{"$nulls":10},"  The length of the shadow is",null,{"$f":"LOOKUP(x0+0.1,Sheet2!B3:B203,Sheet2!E3:E203)","v":{"v":61.384615384615245,"d":"61.4"}},"feet"]
[null,null,"   Item 4"]
[{"$nulls":11},"   The length of the shadow is growing at a rate of",{"$nulls":4},{"$f":"Sheet2!F4","v":{"v":2.3076923076923075,"d":"2.3"}}," feet per second"]
[]
["To access/download all the DIGMath Apps for Calculus"]
["Click this link:",null,"DIGMath for Calculus"]
[]
["Created by:  Sheldon P. Gordon   "]
["                      Farmingdale State College    "]
["Development of this module was supported by the "]
["NSF's Division of Undergraduate Education  "]
["under grants DUE-0310123 and DUE-0442160."]

{"sheet":"Tip of Shadow","index":1,"n_rows":36,"n_cols":19,"rows_kept":36,"merged":[[29,2,29,3]]}
[null,"  Length of a Shadow Problem"]
[]
[null," This DIGMath module lets you investigate "]
[null,"the related rates calculus problem of finding"]
[null,"               the rate at which the tip"]
[null,"          of a person's shadow moves"]
[null," as the person walks away from a lamppost "]
[null,null,"        at a given rate."]
[]
[]
["What is the height L of the lamppost (10 - 20 feet)?"]
[{"$nulls":3},13,{"$f":"#REF!+D12*(#REF!-#REF!)/100","v":{"$error":"#REF!"}},{"$f":"D12","v":13}]
[]
["How tall  is the person H (60-75, in inches)?"]
[{"$nulls":3},68,{"$f":"#REF!+D15*(#REF!-#REF!)/100","v":{"$error":"#REF!"}},{"$f":"D15","v":68}]
[]
["How fast is the person walking (1 - 6 feet per second)?"]
[{"$nulls":3},3,{"$f":"#REF!+D18*(#REF!-#REF!)/100","v":{"$error":"#REF!"}},{"$f":"D18","v":3}]
[]
[]
[]
["Click each item below for suggestions and investigations",{"$nulls":9},"   Select the distance from the lamppost: x0 =",{"$nulls":3},{"$f":"N23/5","v":25},"feet","Time =",{"$f":"xx0/rate2","v":{"v":8.333333333333334,"d":"8.3"}},"seconds"]
[null,null,"   Item 1",{"$nulls":10},125,{"$f":"Sheet2!#REF!+N23*(Sheet2!#REF!-Sheet2!#REF!)/100","v":{"$error":"#REF!"}}]
[null,null,"   Item 2"]
[null,null,"   Item 3",{"$nulls":9},"The length of the shadow is",null,{"$f":"LOOKUP(xx0,Sheet2!B3:B203,Sheet2!E3:E203)","v":{"v":57.69230769230756,"d":"57.7"}},"feet"]
[null,null,"   Item 4",{"$nulls":9},"The distance from the lamppost to the tip =",{"$nulls":3},{"$f":"O25+xx0","v":{"v":82.69230769230757,"d":"82.7"}},"feet"]
[{"$nulls":10},"   The length of the shadow is growing at a rate of",{"$nulls":4},{"$f":"Sheet2!F4","v":{"v":2.3076923076923075,"d":"2.3"}}," feet per second"]
[{"$nulls":10},"    The tip of the shadow is moving at a rate of",{"$nulls":4},{"$f":"Sheet2!S5","v":{"v":6.000000000000002,"d":"6.0"}}," feet per second"]
["To access/download all the DIGMath Apps for Calculus"]
["Click this link:",null,"DIGMath for Calculus"]
[]
["Created by:  Sheldon P. Gordon   "]
["                      Farmingdale State College    "]
["Development of this module was supported by the "]
["NSF's Division of Undergraduate Education  "]
["under grants DUE-0310123 and DUE-0442160."]

{"sheet":"Sheet2","index":2,"n_rows":203,"n_cols":25,"rows_kept":203}
[null,"x","t","slope","S","dS/dt",null,null,"Lamppost",0,0,{"$nulls":3},"x","t","slope","S","d(S+x)/dt",null,"Lamppost",0,0]
[{"$nulls":9},0.1,{"$f":"L","v":10},null,"slope",{"$nulls":8},0.1,{"$f":"LL","v":13},null,"slope"]
[0,{"v":0,"d":"0.0"},{"$f":"B3/rate","v":0},{"$f":"($K$2-$K$5)/B3","v":{"$error":"#DIV/0!"}},{"$f":"L/D3","v":{"$error":"#DIV/0!"}},{"$f":"(E4-E3)/0.2","v":{"$error":"#DIV/0!"}},{"$nulls":6},{"$f":"($K2-$K5)/x0","v":0.16290726817042606},null,{"v":0,"d":"0.0"},{"$f":"O3/rate2","v":0},{"$f":"($K$2-$K$5)/O3","v":{"$error":"#DIV/0!"}},{"$f":"LL/Q3","v":{"$error":"#DIV/0!"}},{"$f":"(R4-R3)/0.2+rate2","v":{"$error":"#DIV/0!"}},{"$nulls":5},{"$f":"($W2-$W5)/xx0","v":0.29333333333333333}]
[1,{"$f":"B3+0.2","v":0.2},0.06666666666666667,{"$f":"($K$2-$K$5)/B4","v":21.666666666666664},0.46153846153846156,{"$f":"(E5-E4)/0.2","v":2.3076923076923075},null,null,"Person",{"$f":"x0","v":26.6},0,{"$nulls":3},{"$f":"O3+0.2","v":0.2},0.06666666666666667,{"$f":"($K$2-$K$5)/O4","v":21.666666666666664},0.6000000000000001,6,null,"Person",{"$f":"xx0","v":25},0]
[2,{"$f":"B4+0.2","v":0.4},0.13333333333333333,10.833333333333332,0.9230769230769231,2.3076923076923093,{"$nulls":3},{"$f":"x0","v":26.6},{"$f":"H/12","v":{"v":5.666666666666667,"d":"5.67"}},"feet tall",null,null,{"$f":"O4+0.2","v":0.4},0.13333333333333333,10.833333333333332,1.2000000000000002,6.000000000000002,null,null,{"$f":"xx0","v":25},{"$f":"HH/12","v":{"v":5.666666666666667,"d":"5.67"}},"feet tall"]
[3,{"v":0.6000000000000001,"d":"0.6"},0.20000000000000004,7.2222222222222205,1.384615384615385,2.307692307692306,{"$nulls":8},{"v":0.6000000000000001,"d":"0.6"},0.20000000000000004,7.2222222222222205,1.8000000000000005,5.999999999999999]
[4,0.8,0.26666666666666666,5.416666666666666,1.8461538461538463,2.3076923076923084,null,null,"Line of Sight",{"$nulls":5},0.8,0.26666666666666666,5.416666666666666,2.4000000000000004,5.999999999999998,null,"Line of Sight"]
[5,{"v":1,"d":"1.0"},0.3333333333333333,4.333333333333333,2.307692307692308,2.307692307692306,{"$nulls":3},0,{"$f":"K2","v":10},{"$nulls":3},{"v":1,"d":"1.0"},0.3333333333333333,4.333333333333333,3,6,null,null,0,{"$f":"W2","v":13}]
[6,1.2,0.39999999999999997,3.611111111111111,2.769230769230769,2.3076923076923084,{"$nulls":3},{"$f":"K8/M3","v":{"v":61.38461538461539,"d":"61.4"}},{"v":0,"d":"0.00"},null,null,"x=x0+y0/m",1.2,0.39999999999999997,3.611111111111111,3.6,6,null,null,{"$f":"W8/Y3","v":{"v":44.31818181818182,"d":"44.3"}},{"v":0,"d":"0.00"}]
[7,1.4,0.4666666666666666,3.0952380952380953,3.230769230769231,2.307692307692306,{"$nulls":8},1.4,0.4666666666666666,3.0952380952380953,4.2,5.999999999999998]
[8,{"v":1.5999999999999999,"d":"1.6"},0.5333333333333333,2.7083333333333335,3.692307692307692,2.3076923076923106,null,null,"Shadow",{"$f":"x0","v":26.6},0,{"$nulls":3},{"v":1.5999999999999999,"d":"1.6"},0.5333333333333333,2.7083333333333335,4.8,6.000000000000003,null,"Shadow",{"$f":"xx0","v":25},0]
[9,{"v":1.7999999999999998,"d":"1.8"},0.6,2.4074074074074074,4.153846153846154,2.307692307692304,{"$nulls":3},{"$f":"J9","v":{"v":61.38461538461539,"d":"61.4"}},0,{"$nulls":3},{"v":1.7999999999999998,"d":"1.8"},0.6,2.4074074074074074,5.4,5.999999999999994,null,null,{"$f":"V9","v":{"v":44.31818181818182,"d":"44.3"}},0]
[10,{"v":1.9999999999999998,"d":"2.0"},0.6666666666666666,2.166666666666667,4.615384615384615,2.3076923076923084,{"$nulls":8},{"v":1.9999999999999998,"d":"2.0"},0.6666666666666666,2.166666666666667,5.999999999999999,6.000000000000003]
[11,{"v":2.1999999999999997,"d":"2.2"},0.7333333333333333,1.9696969696969697,5.076923076923077,2.3076923076923084,null,null,"First Chart",{"$nulls":5},{"v":2.1999999999999997,"d":"2.2"},0.7333333333333333,1.9696969696969697,6.6,6.000000000000003,null,"First Chart"]
[12,2.4,0.7999999999999999,1.8055555555555556,5.538461538461538,2.307692307692313,null,null,"Vertical Line",{"$nulls":5},2.4,0.7999999999999999,1.8055555555555556,7.2,6.000000000000003,null,"Vertical Line"]
[13,2.6,0.8666666666666667,1.6666666666666665,6.000000000000001,2.3076923076923084,{"$nulls":3},{"$f":"I20","v":26.6},0,{"$nulls":3},2.6,0.8666666666666667,1.6666666666666665,7.800000000000001,5.999999999999998,null,null,{"$f":"U20","v":25},0]
[14,{"v":2.8000000000000003,"d":"2.8"},0.9333333333333335,1.5476190476190474,6.461538461538463,2.3076923076923084,{"$nulls":3},{"$f":"I20","v":26.6},{"$f":"K5","v":{"v":5.666666666666667,"d":"5.67"}},{"$nulls":3},{"v":2.8000000000000003,"d":"2.8"},0.9333333333333335,1.5476190476190474,8.4,6.000000000000007,null,null,{"$f":"U20","v":25},{"$f":"W5","v":{"v":5.666666666666667,"d":"5.67"}}]
[15,{"v":3.0000000000000004,"d":"3.0"},1.0000000000000002,1.4444444444444442,6.923076923076924,2.307692307692313,{"$nulls":8},{"v":3.0000000000000004,"d":"3.0"},1.0000000000000002,1.4444444444444442,9.000000000000002,6.000000000000007]
[16,{"v":3.2000000000000006,"d":"3.2"},1.0666666666666669,1.3541666666666663,7.384615384615387,2.3076923076923084,null,null,"Point",{"$nulls":5},{"v":3.2000000000000006,"d":"3.2"},1.0666666666666669,1.3541666666666663,9.600000000000003,5.999999999999998,null,"Point"]
[17,{"v":3.400000000000001,"d":"3.4"},1.1333333333333335,1.2745098039215683,7.8461538461538485,2.3076923076923084,null,null,{"$f":"x0","v":26.6},0,{"$nulls":4},{"v":3.400000000000001,"d":"3.4"},1.1333333333333335,1.2745098039215683,10.200000000000003,6.000000000000007,null,{"$f":"xx0","v":25},0]
[18,{"v":3.600000000000001,"d":"3.6"},1.2000000000000004,1.2037037037037033,8.30769230769231,2.3076923076923084,{"$nulls":8},{"v":3.600000000000001,"d":"3.6"},1.2000000000000004,1.2037037037037033,10.800000000000004,5.999999999999998]
[19,{"v":3.800000000000001,"d":"3.8"},1.266666666666667,1.140350877192982,8.769230769230772,2.3076923076923084,null,null,"Second Chart",{"$nulls":5},{"v":3.800000000000001,"d":"3.8"},1.266666666666667,1.140350877192982,11.400000000000004,5.999999999999998,null,"Second Chart"]
[20,{"v":4.000000000000001,"d":"4.0"},1.3333333333333337,1.083333333333333,9.230769230769234,2.3076923076923084,null,null,"Vertical Line",{"$nulls":5},{"v":4.000000000000001,"d":"4.0"},1.3333333333333337,1.083333333333333,12.000000000000004,6.000000000000007,null,"Vertical Line"]
[21,{"v":4.200000000000001,"d":"4.2"},1.4000000000000004,1.0317460317460314,9.692307692307695,2.3076923076923084,{"$nulls":3},{"$f":"I38","v":26.6},0,{"$nulls":3},{"v":4.200000000000001,"d":"4.2"},1.4000000000000004,1.0317460317460314,12.600000000000005,5.999999999999998,null,null,{"$f":"U38","v":25},0]
[22,{"v":4.400000000000001,"d":"4.4"},1.466666666666667,0.9848484848484845,10.153846153846157,2.3076923076923173,{"$nulls":3},{"$f":"I38","v":26.6},{"$f":"LOOKUP(x0+0.01,B3:B203,E3:E203)","v":61.384615384615245},{"$nulls":3},{"v":4.400000000000001,"d":"4.4"},1.466666666666667,0.9848484848484845,13.200000000000005,6.000000000000007,null,null,{"$f":"U38","v":25},{"$f":"LOOKUP(xx0+0.01,O3:O203,R3:R203)","v":74.99999999999983}]
[23,{"v":4.600000000000001,"d":"4.6"},1.5333333333333339,0.942028985507246,10.61538461538462,2.3076923076922995,{"$nulls":8},{"v":4.600000000000001,"d":"4.6"},1.5333333333333339,0.942028985507246,13.800000000000006,5.999999999999998]
[24,{"v":4.800000000000002,"d":"4.8"},1.6000000000000005,0.9027777777777775,11.07692307692308,2.3076923076923173,null,null,"Third Chart",{"$nulls":5},{"v":4.800000000000002,"d":"4.8"},1.6000000000000005,0.9027777777777775,14.400000000000006,6.000000000000007,null,"Third Chart"]
[25,{"v":5.000000000000002,"d":"5.0"},1.6666666666666672,0.8666666666666663,11.538461538461544,2.3076923076923084,null,null,"Vertical Line",{"$nulls":5},{"v":5.000000000000002,"d":"5.0"},1.6666666666666672,0.8666666666666663,15.000000000000007,5.999999999999998,null,"Vertical Line"]
[26,{"v":5.200000000000002,"d":"5.2"},1.733333333333334,0.8333333333333329,12.000000000000005,2.3076923076923084,{"$nulls":3},{"$f":"LOOKUP(x0,B3:B203,C3:C203)","v":8.866666666666646},0,{"$nulls":3},{"v":5.200000000000002,"d":"5.2"},1.733333333333334,0.8333333333333329,15.600000000000007,5.999999999999998,null,null,{"$f":"LOOKUP(xx0+0.01,O3:O203,P3:P203)","v":8.333333333333314},0]
[27,{"v":5.400000000000002,"d":"5.4"},1.8000000000000007,0.8024691358024688,12.461538461538467,2.3076923076923173,{"$nulls":3},{"$f":"J29","v":8.866666666666646},{"$f":"LOOKUP(x0+0.1,B3:B203,E3:E203)","v":61.384615384615245},{"$nulls":3},{"v":5.400000000000002,"d":"5.4"},1.8000000000000007,0.8024691358024688,16.200000000000006,6.000000000000007,null,null,{"$f":"V29","v":8.333333333333314},{"$f":"LOOKUP(xx0+0.01,O3:O203,R3:R203)","v":74.99999999999983}]
[28,{"v":5.600000000000002,"d":"5.6"},1.8666666666666674,0.7738095238095234,12.92307692307693,2.3076923076922995,{"$nulls":8},{"v":5.600000000000002,"d":"5.6"},1.8666666666666674,0.7738095238095234,16.800000000000008,6.000000000000007]
[29,{"v":5.8000000000000025,"d":"5.8"},1.9333333333333342,0.7471264367816088,13.38461538461539,2.3076923076923084,null,null,"Fourth Chart",{"$nulls":5},{"v":5.8000000000000025,"d":"5.8"},1.9333333333333342,0.7471264367816088,17.40000000000001,5.999999999999989,null,"Fourth Chart"]
[30,{"v":6.000000000000003,"d":"6.0"},2.000000000000001,0.7222222222222219,13.846153846153852,2.3076923076923173,null,null,"Vertical Line",{"$nulls":5},{"v":6.000000000000003,"d":"6.0"},2.000000000000001,0.7222222222222219,18.000000000000007,6.000000000000025,null,"Vertical Line"]
[31,{"v":6.200000000000003,"d":"6.2"},2.0666666666666678,0.6989247311827953,14.307692307692315,2.3076923076923173,{"$nulls":3},{"$f":"LOOKUP(x0,B3:B203,C3:C203)","v":8.866666666666646},0,{"$nulls":3},{"v":6.200000000000003,"d":"6.2"},2.0666666666666678,0.6989247311827953,18.600000000000012,5.999999999999989,null,null,{"$f":"LOOKUP(xx0+0.01,O3:O203,P3:P203)","v":8.333333333333314},0]
[32,{"v":6.400000000000003,"d":"6.4"},2.133333333333334,0.6770833333333329,14.769230769230779,2.3076923076922995,{"$nulls":3},{"$f":"J34","v":8.866666666666646},{"$f":"LOOKUP(x0,B3:B203,F3:F203)","v":2.3076923076922995},{"$nulls":3},{"v":6.400000000000003,"d":"6.4"},2.133333333333334,0.6770833333333329,19.20000000000001,{"$f":"(R36-R35)/0.2+rate2","v":6.000000000000007},null,null,{"$f":"V34","v":8.333333333333314},{"$f":"LOOKUP(xx0+0.01,O3:O203,S3:S203)","v":6.000000000000043}]
[33,{"v":6.600000000000003,"d":"6.6"},2.200000000000001,0.6565656565656562,15.230769230769239,2.3076923076923173,{"$nulls":8},{"v":6.600000000000003,"d":"6.6"},2.200000000000001,0.6565656565656562,19.80000000000001,6.000000000000007]
[34,{"v":6.800000000000003,"d":"6.8"},2.266666666666668,0.6372549019607839,15.692307692307702,2.3076923076922906,null,null,"Point",{"$nulls":5},{"v":6.800000000000003,"d":"6.8"},2.266666666666668,0.6372549019607839,20.400000000000013,5.999999999999989,null,"Point"]
[35,{"v":7.0000000000000036,"d":"7.0"},2.3333333333333344,0.6190476190476187,16.15384615384616,2.3076923076923173,null,null,{"$f":"x0","v":26.6},0,{"$nulls":4},{"v":7.0000000000000036,"d":"7.0"},2.3333333333333344,0.6190476190476187,21.00000000000001,6.000000000000007,null,{"$f":"xx0","v":25},0]
[36,{"v":7.200000000000004,"d":"7.2"},2.4000000000000012,0.6018518518518515,16.615384615384624,2.3076923076923173,{"$nulls":8},{"v":7.200000000000004,"d":"7.2"},2.4000000000000012,0.6018518518518515,21.600000000000012,6.000000000000007]
[37,{"v":7.400000000000004,"d":"7.4"},2.466666666666668,0.5855855855855853,17.076923076923087,2.3076923076922995,null,null,"Point on curve",{"$nulls":5},{"v":7.400000000000004,"d":"7.4"},2.466666666666668,0.5855855855855853,22.200000000000014,6.000000000000007,null,"Point on curve"]
[38,{"v":7.600000000000004,"d":"7.6"},2.5333333333333345,0.5701754385964909,17.538461538461547,2.3076923076923173,null,null,"x=",{"$f":"I20*J14","v":0},{"$nulls":4},{"v":7.600000000000004,"d":"7.6"},2.5333333333333345,0.5701754385964909,22.800000000000015,5.999999999999989,null,"x=",{"$f":"U20*V14","v":0}]
[39,{"v":7.800000000000004,"d":"7.8"},2.6000000000000014,0.5555555555555552,18.00000000000001,2.3076923076922995,null,null,{"$f":"x0","v":26.6},{"$f":"LOOKUP(x0,B3:B84,C3:C84)","v":5.3999999999999915},{"$nulls":4},{"v":7.800000000000004,"d":"7.8"},2.6000000000000014,0.5555555555555552,23.400000000000013,5.999999999999989,null,{"$f":"xx0","v":25},{"$f":"LOOKUP(xx0,O3:O203,P3:P203)","v":8.333333333333314}]
[40,{"v":8.000000000000004,"d":"8.0"},2.666666666666668,0.5416666666666664,18.46153846153847,2.3076923076922995,{"$nulls":8},{"v":8.000000000000004,"d":"8.0"},2.666666666666668,0.5416666666666664,24.00000000000001,6.000000000000007]
[41,{"v":8.200000000000003,"d":"8.2"},2.7333333333333343,0.5284552845528453,18.92307692307693,2.3076923076922995,{"$nulls":8},{"v":8.200000000000003,"d":"8.2"},2.7333333333333343,0.5284552845528453,24.600000000000012,5.999999999999989]
[42,{"v":8.400000000000002,"d":"8.4"},2.8000000000000007,0.5158730158730157,19.38461538461539,2.3076923076922995,{"$nulls":8},{"v":8.400000000000002,"d":"8.4"},2.8000000000000007,0.5158730158730157,25.20000000000001,5.999999999999972]
[43,{"v":8.600000000000001,"d":"8.6"},2.866666666666667,0.503875968992248,19.84615384615385,2.3076923076922995,{"$nulls":8},{"v":8.600000000000001,"d":"8.6"},2.866666666666667,0.503875968992248,25.800000000000004,5.999999999999989]
[44,8.8,2.9333333333333336,0.4924242424242424,20.30769230769231,2.3076923076922995,{"$nulls":8},8.8,2.9333333333333336,0.4924242424242424,26.400000000000002,5.999999999999989]
[45,{"v":9,"d":"9.0"},3,0.48148148148148145,20.76923076923077,2.3076923076922995,{"$nulls":8},{"v":9,"d":"9.0"},3,0.48148148148148145,27,6.000000000000007]
[46,9.2,3.0666666666666664,0.47101449275362317,21.23076923076923,2.3076923076922995,{"$nulls":8},9.2,3.0666666666666664,0.47101449275362317,27.6,5.999999999999972]
[47,{"v":9.399999999999999,"d":"9.4"},3.133333333333333,0.4609929078014185,21.69230769230769,2.3076923076922995,{"$nulls":8},{"v":9.399999999999999,"d":"9.4"},3.133333333333333,0.4609929078014185,28.199999999999996,6.000000000000007]
[48,{"v":9.599999999999998,"d":"9.6"},3.1999999999999993,0.45138888888888895,22.15384615384615,2.3076923076922995,{"$nulls":8},{"v":9.599999999999998,"d":"9.6"},3.1999999999999993,0.45138888888888895,28.799999999999997,5.999999999999972]
[49,{"v":9.799999999999997,"d":"9.8"},3.2666666666666657,0.4421768707482994,22.61538461538461,2.3076923076922995,{"$nulls":8},{"v":9.799999999999997,"d":"9.8"},3.2666666666666657,0.4421768707482994,29.39999999999999,6.000000000000007]
[50,{"v":9.999999999999996,"d":"10.0"},3.333333333333332,0.43333333333333346,23.07692307692307,2.3076923076922995,{"$nulls":8},{"v":9.999999999999996,"d":"10.0"},3.333333333333332,0.43333333333333346,29.999999999999993,5.999999999999972]
[51,{"v":10.199999999999996,"d":"10.2"},3.3999999999999986,0.4248366013071897,23.53846153846153,2.3076923076922995,{"$nulls":8},{"v":10.199999999999996,"d":"10.2"},3.3999999999999986,0.4248366013071897,30.599999999999987,5.999999999999989]
[52,{"v":10.399999999999995,"d":"10.4"},3.466666666666665,0.41666666666666685,23.99999999999999,2.3076923076922995,{"$nulls":8},{"v":10.399999999999995,"d":"10.4"},3.466666666666665,0.41666666666666685,31.199999999999985,6.000000000000007]
[53,{"v":10.599999999999994,"d":"10.6"},3.5333333333333314,0.40880503144654107,24.46153846153845,2.3076923076922995,{"$nulls":8},{"v":10.599999999999994,"d":"10.6"},3.5333333333333314,0.40880503144654107,31.799999999999986,5.999999999999989]
[54,{"v":10.799999999999994,"d":"10.8"},3.599999999999998,0.4012345679012348,24.92307692307691,2.3076923076923173,{"$nulls":8},{"v":10.799999999999994,"d":"10.8"},3.599999999999998,0.4012345679012348,32.399999999999984,6.000000000000007]
[55,{"v":10.999999999999993,"d":"11.0"},3.6666666666666643,0.39393939393939414,25.384615384615373,2.3076923076922817,{"$nulls":8},{"v":10.999999999999993,"d":"11.0"},3.6666666666666643,0.39393939393939414,32.999999999999986,5.999999999999972]
[56,{"v":11.199999999999992,"d":"11.2"},3.7333333333333307,0.38690476190476214,25.84615384615383,2.3076923076922995,{"$nulls":8},{"v":11.199999999999992,"d":"11.2"},3.7333333333333307,0.38690476190476214,33.59999999999998,5.999999999999972]
[57,{"v":11.399999999999991,"d":"11.4"},3.799999999999997,0.38011695906432774,26.30769230769229,2.3076923076922995,{"$nulls":8},{"v":11.399999999999991,"d":"11.4"},3.799999999999997,0.38011695906432774,34.199999999999974,6.000000000000007]
[58,{"v":11.59999999999999,"d":"11.6"},3.8666666666666636,0.37356321839080486,26.76923076923075,2.3076923076922995,{"$nulls":8},{"v":11.59999999999999,"d":"11.6"},3.8666666666666636,0.37356321839080486,34.799999999999976,5.999999999999972]
[59,{"v":11.79999999999999,"d":"11.8"},3.93333333333333,0.3672316384180794,27.23076923076921,2.3076923076923173,{"$nulls":8},{"v":11.79999999999999,"d":"11.8"},3.93333333333333,0.3672316384180794,35.39999999999997,6.000000000000007]
[60,{"v":11.99999999999999,"d":"12.0"},3.9999999999999964,0.3611111111111114,27.692307692307672,2.3076923076922995,{"$nulls":8},{"v":11.99999999999999,"d":"12.0"},3.9999999999999964,0.3611111111111114,35.99999999999997,6.000000000000007]
[61,{"v":12.199999999999989,"d":"12.2"},4.066666666666663,0.3551912568306014,28.153846153846132,2.3076923076922995,{"$nulls":8},{"v":12.199999999999989,"d":"12.2"},4.066666666666663,0.3551912568306014,36.59999999999997,5.999999999999972]
[62,{"v":12.399999999999988,"d":"12.4"},4.133333333333329,0.34946236559139815,28.615384615384592,2.3076923076922995,{"$nulls":8},{"v":12.399999999999988,"d":"12.4"},4.133333333333329,0.34946236559139815,37.19999999999997,6.000000000000007]
[63,{"v":12.599999999999987,"d":"12.6"},4.199999999999996,0.34391534391534423,29.076923076923052,2.3076923076922817,{"$nulls":8},{"v":12.599999999999987,"d":"12.6"},4.199999999999996,0.34391534391534423,37.79999999999997,5.999999999999972]
[64,{"v":12.799999999999986,"d":"12.8"},{"$f":"B67/rate","v":4.266666666666662},0.338541666666667,{"$f":"L/D67","v":29.538461538461508},2.3076923076923173,{"$nulls":8},{"v":12.799999999999986,"d":"12.8"},{"$f":"O67/rate2","v":4.266666666666662},0.338541666666667,{"$f":"LL/Q67","v":38.39999999999996},{"$f":"(R68-R67)/0.2+rate2","v":6.000000000000007}]
[65,{"v":12.999999999999986,"d":"13.0"},4.333333333333329,{"$f":"($K$2-$K$5)/B68","v":0.33333333333333365},29.99999999999997,{"$f":"(E69-E68)/0.2","v":2.3076923076922995},{"$nulls":8},{"v":12.999999999999986,"d":"13.0"},4.333333333333329,{"$f":"($K$2-$K$5)/O68","v":0.33333333333333365},38.999999999999964,5.999999999999972]
[66,{"$f":"B68+0.2","v":{"v":13.199999999999985,"d":"13.2"}},4.399999999999995,0.3282828282828286,30.46153846153843,2.3076923076922817,{"$nulls":8},{"$f":"O68+0.2","v":{"v":13.199999999999985,"d":"13.2"}},4.399999999999995,0.3282828282828286,39.59999999999996,5.999999999999972]
[67,{"v":13.399999999999984,"d":"13.4"},4.4666666666666615,0.3233830845771148,30.923076923076888,2.3076923076922995,{"$nulls":8},{"v":13.399999999999984,"d":"13.4"},4.4666666666666615,0.3233830845771148,40.19999999999995,6.000000000000007]
[68,{"v":13.599999999999984,"d":"13.6"},4.533333333333328,0.3186274509803925,31.384615384615348,2.3076923076923173,{"$nulls":8},{"v":13.599999999999984,"d":"13.6"},4.533333333333328,0.3186274509803925,40.799999999999955,6.000000000000007]
[69,{"v":13.799999999999983,"d":"13.8"},4.599999999999994,0.31400966183574913,31.84615384615381,2.307692307692264,{"$nulls":8},{"v":13.799999999999983,"d":"13.8"},4.599999999999994,0.31400966183574913,41.399999999999956,5.999999999999936]
[70,{"v":13.999999999999982,"d":"14.0"},4.666666666666661,0.3095238095238099,32.307692307692264,2.307692307692335,{"$nulls":8},{"v":13.999999999999982,"d":"14.0"},4.666666666666661,0.3095238095238099,41.99999999999994,6.000000000000043]
[71,{"v":14.199999999999982,"d":"14.2"},4.733333333333327,0.30516431924882664,32.76923076923073,2.3076923076922995,{"$nulls":8},{"v":14.199999999999982,"d":"14.2"},4.733333333333327,0.30516431924882664,42.59999999999995,5.999999999999972]
[72,{"v":14.39999999999998,"d":"14.4"},4.799999999999994,0.3009259259259263,33.23076923076919,2.3076923076922995,{"$nulls":8},{"v":14.39999999999998,"d":"14.4"},4.799999999999994,0.3009259259259263,43.199999999999946,6.000000000000007]
[73,{"v":14.59999999999998,"d":"14.6"},4.86666666666666,0.2968036529680369,33.69230769230765,2.3076923076922995,{"$nulls":8},{"v":14.59999999999998,"d":"14.6"},4.86666666666666,0.2968036529680369,43.79999999999995,5.999999999999972]
[74,{"v":14.79999999999998,"d":"14.8"},4.9333333333333265,0.2927927927927932,34.15384615384611,2.307692307692264,{"$nulls":8},{"v":14.79999999999998,"d":"14.8"},4.9333333333333265,0.2927927927927932,44.39999999999994,5.999999999999972]
[75,{"v":14.999999999999979,"d":"15.0"},4.999999999999993,0.2888888888888893,34.61538461538456,2.307692307692335,{"$nulls":8},{"v":14.999999999999979,"d":"15.0"},4.999999999999993,0.2888888888888893,44.999999999999936,6.000000000000007]
[76,{"v":15.199999999999978,"d":"15.2"},5.066666666666659,0.285087719298246,35.07692307692303,2.3076923076922995,{"$nulls":8},{"v":15.199999999999978,"d":"15.2"},5.066666666666659,0.285087719298246,45.59999999999994,5.999999999999972]
[77,{"v":15.399999999999977,"d":"15.4"},5.133333333333326,0.2813852813852818,35.53846153846149,2.3076923076922995,{"$nulls":8},{"v":15.399999999999977,"d":"15.4"},5.133333333333326,0.2813852813852818,46.19999999999993,6.000000000000007]
{"$rows_left_out":123}