{"text_format":"3","workbook":"xlsx","n_sheets":5,"sheets":["Find c","Slide line","Sheet3","Defining Function","Sheet4"],"not_rendered":{"charts":2,"images":3,"macros":1,"external_links":1,"defined_names":18,"comments":2},"read":"whole","date_system":"1900"}

{"sheet":"Find c","index":0,"n_rows":33,"n_cols":17,"rows_kept":33,"merged":[[26,2,26,3]]}
[null,"      The Mean Value Theorem"]
[]
[null,"This graphing utility lets you investigate "]
[null,null,"the Mean Value Theorem:"]
[null,"There is a number c between x = a and x = b "]
[{"$nulls":3},"where"]
[null,"        f '(c )  = [ f(b) - f(a) ]/(b - a)"]
[]
["Enter the function in terms of x:   f(x)  =  ",{"$nulls":4},"x^4-3*x^2+6*x-2"]
[]
["Now enter the interval for x:  "]
[null,null,"xMin =",-4]
[null,null,"xMax =",4]
[]
[]
[]
[]
[]
["Click each item below for suggestions and investigations",{"$nulls":11},"The graph of the function y = ",null,null,{"$f":"F9","v":"x^4-3*x^2+6*x-2"}]
[null,"   Item 1"]
[null,"   Item 2",{"$nulls":9},"       The slope of the secant line is ",{"$nulls":3},{"$f":"Sheet3!F6","v":{"v":5.768742235300654,"d":"5.769"}}]
[null,"   Item 3"]
[{"$nulls":11},"Move the green tangent line until it is parallel to the red secant line"]
[]
[]
["To access/download all the DIGMath Apps for Calculus",{"$nulls":13},41,{"$f":"D12+O26*(D13-D12)/200","v":-2.3600000000000003}]
["    Click this link:",null,"DIGMath for Calculus"]
[{"$nulls":13},"   The point of tangency is c =",null,null,{"$f":"P26","v":-2.3600000000000003}]
["Created by:  Sheldon P. Gordon   "]
["                      Farmingdale State College    ",{"$nulls":11},"The slope of the tangent line at x = c is",{"$nulls":3},{"$f":"LOOKUP(Q28,Sheet3!A3:A1002,Sheet3!C3:C1002)","v":-32.27390430709061}]
["Development of this module was supported by the "]
["NSF's Division of Undergraduate Education  "]
["under grants DUE-0310123 and DUE-0442160."]

{"sheet":"Slide line","index":1,"n_rows":31,"n_cols":13,"rows_kept":31,"merged":[[24,2,24,3]]}
[null,"   The Mean Value Theorem"]
[]
[null,"This graphing utility lets you investigate "]
[null,null,"the Mean Value Theorem:"]
[null,"There is a number c between x = a and x = b "]
[{"$nulls":3},"where"]
[null,"        f '( c )  = [ f(b) - f(a) ] / (b - a)"]
[]
[]
["First move the line parallel to the secant line "]
[null,"to find where it is tangent to the curve"]
[]
["Then find the point x = c on the curve."]
[]
[]
[]
[{"$nulls":8},"The graph of the function y",null,null,"=x^4-5*x^2+6*x+1"]
[]
["Click each item below for suggestions and investigations",{"$nulls":6},"First move the green line until it is tangent to the curve"]
["   Item 1"]
["   Item 2",{"$nulls":10},13,{"$f":"Sheet3!F13+L21*(Sheet3!F14-Sheet3!F13)/100","v":18.570620431732124}]
["   Item 3"]
[]
["To access/download all the DIGMath Apps for Calculus",{"$nulls":6}," Then locate the point of tangency c =",{"$nulls":3},{"$f":"M26","v":1.5999999999999996}]
["    Click this link:",null,"DIGMath for Calculus"]
[{"$nulls":11},70,{"$f":"'Find c'!D12+L26*('Find c'!D13-'Find c'!D12)/100","v":1.5999999999999996}]
["Created by:  Sheldon P. Gordon"]
["                     Farmingdale StateCollege"]
["Development of this module was supported by the "]
["NSF's Division of Undergraduate Education  "]
["under grants DUE-0310123 and DUE-0442160."]

{"sheet":"Sheet3","index":2,"n_rows":1004,"n_cols":13,"rows_kept":1004}
["x","f(x)","slope",null,"move line","xl=",{"$f":"IF('Find c'!$P$26<'Find c'!D12+150*Sheet3!G11,'Find c'!D12,'Find c'!P$26-150*Sheet3!G11)","v":-3.5588011988011994},{"$f":"LOOKUP('Find c'!P26,Sheet3!A3:A1002,Sheet3!B3:B1002)+LOOKUP('Find c'!P26,Sheet3!A3:A1002,Sheet3!C3:C1002)*(G1-'Find c'!P26)","v":36.894831831207256},"\"=yl"]
[null,{"$f":"'Find c'!#REF!","v":{"$error":"#REF!"}},{"$nulls":3},"xr=",{"$f":"IF('Find c'!$P$26>'Find c'!D13-150*Sheet3!G11,'Find c'!D13,'Find c'!P$26+150*Sheet3!G11)","v":-1.1611988011988015},{"$f":"LOOKUP('Find c'!P26,Sheet3!A3:A1003,Sheet3!B3:B1003)+LOOKUP('Find c'!P26,Sheet3!A3:A1003,Sheet3!C3:C1003)*(G2-'Find c'!P26)","v":-40.48515851546354},"\"=yR",null,null,"sorted values by y"]
[{"$f":"'Find c'!D12","v":{"v":-4,"d":"-4.00"}},{"$f":"x^4-3*x^2+6*x-2","v":{"v":182,"d":"182.0000"}},{"$f":"(B4-B3)/Sheet3!$G$11","v":-225.2577647013546},{"$nulls":8},-1.8261738261737839,-15.509966840612133]
[{"$f":"A3+Sheet3!G$11","v":{"v":-3.992007992007992,"d":"-3.99"}},{"v":180.19973814424492,"d":"180.1997"},{"$f":"(B5-B4)/Sheet3!$G$11","v":-223.7773757986953},null,"secant line","xL =",{"$f":"A3","v":{"v":-4,"d":"-4.00"}},{"$f":"B3","v":182},{"$nulls":3},-1.818181818181776,-15.509801243084482]
[{"$f":"A4+Sheet3!G$11","v":{"v":-3.9840159840159837,"d":"-3.98"}},{"v":178.41130756843117,"d":"178.4113"},{"$f":"(B6-B5)/Sheet3!$G$11","v":-222.30310024966033},null,null,"xR =",{"$f":"A1003","v":{"v":3.992007992008061,"d":"3.99"}},{"$f":"B1003","v":228.10383404835727},{"$nulls":3},-1.8341658341657918,-15.508215055119834]
[{"$f":"A5+Sheet3!G$11","v":{"v":-3.9760239760239755,"d":"-3.98"}},{"v":176.63465941458773,"d":"176.6347"},{"$f":"(B7-B6)/Sheet3!$G$11","v":-220.83492580297596},null,"slope =",{"$f":"(H5-H4)/(G5-G4)","v":5.768742235300654},{"$nulls":5},-1.810189810189768,-15.507740586419317]
[{"$f":"A6+Sheet3!G$11","v":{"v":-3.9680319680319673,"d":"-3.97"}},{"v":174.86974492265585,"d":"174.8697"},{"$f":"(B8-B7)/Sheet3!$G$11","v":-219.37284020748942},{"$nulls":8},-1.8421578421577998,-15.504523464813385]
[{"$f":"A7+Sheet3!G$11","v":{"v":-3.960039960039959,"d":"-3.96"}},{"v":173.1165154304881,"d":"173.1165"},{"$f":"(B9-B8)/Sheet3!$G$11","v":-217.916831211959},null,"Point display",null,{"$f":"'Slide line'!L24","v":1.5999999999999996},{"$f":"LOOKUP(G8,A3:A1003,B3:B1003)","v":6.4024668348257805},{"$nulls":3},-1.80219780219776,-15.503807096587312]
[{"$f":"A8+Sheet3!G$11","v":{"v":-3.952047952047951,"d":"-3.95"}},{"v":171.37492237384907,"d":"171.3749"},{"$f":"(B10-B9)/Sheet3!$G$11","v":-216.4668865651821},{"$nulls":3},{"$f":"'Slide line'!L24","v":1.5999999999999996},{"$f":"LOOKUP(G9,A3:A1003,B3:B1003)","v":6.4024668348257805},{"$nulls":3},-1.8501498501498077,-15.498869549986814]
[{"$f":"A9+Sheet3!G$11","v":{"v":-3.944055944055943,"d":"-3.94"}},{"v":169.64491728641505,"d":"169.6449"},{"$f":"(B11-B10)/Sheet3!$G$11","v":-215.02299401595263},{"$nulls":8},-1.794205794205752,-15.498022901647374]
[{"$f":"A10+Sheet3!G$11","v":{"v":-3.9360639360639347,"d":"-3.94"}},{"v":167.92645179977407,"d":"167.9265"},{"$f":"(B12-B11)/Sheet3!$G$11","v":-213.58514131305373},null,null,"delta x = ",{"$f":"('Find c'!D13-'Find c'!D12)/1001","v":7.992007992007992E-3},{"$nulls":4},-1.8581418581418156,-15.491230693022388]
[{"$f":"A11+Sheet3!G$11","v":{"v":-3.9280719280719265,"d":"-3.93"}},{"v":166.219477643426,"d":"166.2195"},{"$f":"(B13-B12)/Sheet3!$G$11","v":-212.15331620528997},{"$nulls":8},-1.7862137862137442,-15.490410031746649]
[{"$f":"A12+Sheet3!G$11","v":{"v":-3.9200799200799183,"d":"-3.92"}},{"v":164.5239466447823,"d":"164.5239"},{"$f":"(B14-B13)/Sheet3!$G$11","v":-210.7275064414338},null,"Fmin =",{"$f":"MIN(B3:B1003)","v":{"v":-12.738940223625658,"d":"-12.7389"}},{"$f":"LOOKUP(F13,M3:M1003,L3:L1003)","v":-1.3386613386612993},"=x",{"$nulls":3},-1.8661338661338236,-15.481584178390605]
[{"$f":"A13+Sheet3!G$11","v":{"v":-3.91208791208791,"d":"-3.91"}},{"v":162.83981072916646,"d":"162.8398"},{"$f":"(B15-B14)/Sheet3!$G$11","v":-209.3076997702863},null,"Fmax =",{"$f":"MAX(B3:B1003)","v":228.10383404835727},{"$f":"LOOKUP(F14,M3:M1003,L3:L1003)","v":3.992007992008061},"=x",{"$nulls":3},-1.7782217782217362,-15.480990419120506]
[{"$f":"A14+Sheet3!G$11","v":{"v":-3.904095904095902,"d":"-3.90"}},{"v":161.16702191981352,"d":"161.1670"},{"$f":"(B16-B15)/Sheet3!$G$11","v":-207.8938839406341},null,"F value =",{"$f":"'Slide line'!M21","v":18.570620431732124},{"$nulls":5},-1.8741258741258315,-15.469907192650211]
[{"$f":"A15+Sheet3!G$11","v":{"v":-3.896103896103894,"d":"-3.90"}},{"v":159.5055323378704,"d":"159.5055"},{"$f":"(B17-B16)/Sheet3!$G$11","v":-206.4860467012747},null,"x Mid =",{"$f":"(a+b)/2","v":-0.003996003995969444},{"$nulls":5},-1.7702297702297283,-15.469785898092564]
[{"$f":"A16+Sheet3!G$11","v":{"v":-3.8881118881118857,"d":"-3.89"}},{"v":157.85529420239567,"d":"157.8553"},{"$f":"(B18-B17)/Sheet3!$G$11","v":-205.08417580099126},{"$nulls":8},-1.7622377622377203,-15.456818205074669]
[{"$f":"A17+Sheet3!G$11","v":{"v":-3.8801198801198775,"d":"-3.88"}},{"v":156.21625983035977,"d":"156.2163"},{"$f":"(B19-B18)/Sheet3!$G$11","v":-203.6882589885741},null,"Sheet 2 line segment:",{"$nulls":6},-1.8821178821178395,-15.456176824448178]
[{"$f":"A18+Sheet3!G$11","v":{"v":-3.8721278721278694,"d":"-3.87"}},{"v":154.5883816366449,"d":"154.5884"},{"$f":"(B20-B19)/Sheet3!$G$11","v":-202.2982840128135},null,null,"xL=",{"$f":"IF(m=0,G$4,(IF(AND(m>0,J19<Fmin),F$16+F$28,(IF(AND(m<0,J19>Fmax),F$16+xL,a)))))","v":-4},{"$f":"Fvalue+m*(xL-xMid)","v":-4.481296592446512},"\"=yL",{"$f":"IF(m=0,Fvalue,IF(m>0,Fmin,Fmax))","v":-12.738940223625658},null,-1.7542457542457124,-15.4421089785669]
[{"$f":"A19+Sheet3!G$11","v":{"v":-3.864135864135861,"d":"-3.86"}},{"v":152.971612134045,"d":"152.9716"},{"$f":"(B21-B20)/Sheet3!$G$11","v":-200.91423862250687},null,null,"xR=",{"$f":"IF(m=0,G$5,(IF(AND(m>0,J20>Fmax),F$16+F$29,(IF(AND(F$6<0,J20<Fmin),F$16+F$28,b)))))","v":3.992007992008061},{"$f":"Fvalue+m*(xR-xMid)","v":41.62253745591076},"\"=yR",{"$f":"IF(m=0,F16,IF(m>0,Fmax,Fvalue))","v":228.10383404835727},null,-1.8901098901098474,-15.440370064519705]
[{"$f":"A20+Sheet3!G$11","v":{"v":-3.856143856143853,"d":"-3.86"}},{"v":151.3659039332657,"d":"151.3659"},{"$f":"(B22-B21)/Sheet3!$G$11","v":-199.53611056643746},{"$nulls":8},-1.7462537462537044,-15.425679759157578]
[{"$f":"A21+Sheet3!G$11","v":{"v":-3.848151848151845,"d":"-3.85"}},{"v":149.77120974292455,"d":"149.7712"},{"$f":"(B23-B22)/Sheet3!$G$11","v":-198.16388759339551},{"$nulls":3},"fix xL and xR",{"$nulls":4},-1.8981018981018554,-15.422463805688235]
[{"$f":"A22+Sheet3!G$11","v":{"v":-3.8401598401598367,"d":"-3.84"}},{"v":148.18748236955076,"d":"148.1875"},{"$f":"(B24-B23)/Sheet3!$G$11","v":-196.79755745218202},{"$nulls":8},-1.7382617382616965,-15.407551989523256]
[{"$f":"A23+Sheet3!G$11","v":{"v":-3.8321678321678285,"d":"-3.83"}},{"v":146.61467471758527,"d":"146.6147"},{"$f":"(B25-B24)/Sheet3!$G$11","v":-195.43710789156236},{"$nulls":8},-1.9060939060938633,-15.402434842865453]
[{"$f":"A24+Sheet3!G$11","v":{"v":-3.8241758241758204,"d":"-3.82"}},{"v":145.05273978938098,"d":"145.0527"},{"$f":"(B26-B25)/Sheet3!$G$11","v":-194.08252666035892},{"$nulls":8},-1.7302697302696886,-15.387747014428715]
[{"$f":"A25+Sheet3!G$11","v":{"v":-3.816183816183812,"d":"-3.82"}},{"v":143.5016306852023,"d":"143.5016"},{"$f":"(B27-B26)/Sheet3!$G$11","v":-192.7338015073406},{"$nulls":8},-1.9140859140858713,-15.380259873051259]
[{"$f":"A26+Sheet3!G$11","v":{"v":-3.808191808191804,"d":"-3.81"}},{"v":141.96130060322554,"d":"141.9613"},{"$f":"(B28-B27)/Sheet3!$G$11","v":-191.39092018131194},{"$nulls":8},-1.7222777222776806,-15.36628608072698]
[{"$f":"A27+Sheet3!G$11","v":{"v":-3.800199800199796,"d":"-3.80"}},{"v":140.43170283953873,"d":"140.4317"},{"$f":"(B29-B28)/Sheet3!$G$11","v":-190.05387043104548},null,"Ratio1=",{"$f":"(Fmin-'Slide line'!M21)/m","v":-5.427450105807336},{"$nulls":5},-1.9220779220778792,-15.35591549533381]
[{"$f":"A28+Sheet3!G$11","v":{"v":-3.7922077922077877,"d":"-3.79"}},{"v":138.91279078814176,"d":"138.9128"},{"$f":"(B30-B29)/Sheet3!$G$11","v":-188.72264000534574},null,"Ratio2=",{"$f":"(Fmax-'Slide line'!M21)/m","v":36.32216609271063},{"$nulls":5},-1.7142857142856727,-15.34319033735931]
[{"$f":"A29+Sheet3!G$11","v":{"v":-3.7842157842157795,"d":"-3.78"}},{"v":137.4045179409462,"d":"137.4045"},{"$f":"(B31-B30)/Sheet3!$G$11","v":-187.39721665299592},{"$nulls":8},-1.9300699300698871,-15.329378210889484]
[{"$f":"A30+Sheet3!G$11","v":{"v":-3.7762237762237714,"d":"-3.78"}},{"v":135.9068378877754,"d":"135.9068"},{"$f":"(B32-B31)/Sheet3!$G$11","v":-186.07758812279343},{"$nulls":8},-1.7062937062936647,-15.318480835355192]
[{"$f":"A31+Sheet3!G$11","v":{"v":-3.768231768231763,"d":"-3.77"}},{"v":134.41970431636446,"d":"134.4197"},{"$f":"(B33-B32)/Sheet3!$G$11","v":-184.76374216352144},{"$nulls":8},-1.938061938061895,-15.300624422982896]
[{"$f":"A32+Sheet3!G$11","v":{"v":-3.760239760239755,"d":"-3.76"}},{"v":132.9430710123603,"d":"132.9431"},{"$f":"(B34-B33)/Sheet3!$G$11","v":-183.45566652397738},{"$nulls":8},-1.6983016983016568,-15.292178527832355]
[{"$f":"A33+Sheet3!G$11","v":{"v":-3.752247752247747,"d":"-3.75"}},{"v":131.4768918593215,"d":"131.4769"},{"$f":"(B35-B34)/Sheet3!$G$11","v":-182.1533489529409},{"$nulls":8},-1.946053946053903,-15.269630436966892]
[{"$f":"A34+Sheet3!G$11","v":{"v":-3.7442557442557387,"d":"-3.74"}},{"v":130.0211208387186,"d":"130.0211"},{"$f":"(B36-B35)/Sheet3!$G$11","v":-180.8567771992165},{"$nulls":8},-1.6903096903096488,-15.264304269996764]
[{"$f":"A35+Sheet3!G$11","v":{"v":-3.7362637362637305,"d":"-3.74"}},{"v":128.57571202993364,"d":"128.5757"},{"$f":"(B37-B36)/Sheet3!$G$11","v":-179.5659390115874},{"$nulls":8},-1.954045954045911,-15.236372460282567]
[{"$f":"A36+Sheet3!G$11","v":{"v":-3.7282717282717224,"d":"-3.73"}},{"v":127.14061961026061,"d":"127.1406"},{"$f":"(B38-B37)/Sheet3!$G$11","v":-178.28082213883678},{"$nulls":8},-1.682317682317641,-15.234878819142608]
[{"$f":"A37+Sheet3!G$11","v":{"v":-3.720279720279714,"d":"-3.72"}},{"v":125.71579785490528,"d":"125.7158"},{"$f":"(B39-B38)/Sheet3!$G$11","v":-177.00141432977094},{"$nulls":8},-1.674325674325633,-15.203922834652325]
[{"$f":"A38+Sheet3!G$11","v":{"v":-3.712287712287706,"d":"-3.71"}},{"v":124.30120113698503,"d":"124.3012"},{"$f":"(B40-B39)/Sheet3!$G$11","v":-175.72770333316595},{"$nulls":8},-1.962037962037919,-15.200826602459237]
[{"$f":"A39+Sheet3!G$11","v":{"v":-3.704295704295698,"d":"-3.70"}},{"v":122.89678392752916,"d":"122.8968"},{"$f":"(B41-B40)/Sheet3!$G$11","v":-174.45967689781747},{"$nulls":8},-1.666333666333625,-15.171456877996576]
[{"$f":"A40+Sheet3!G$11","v":{"v":-3.6963036963036897,"d":"-3.70"}},{"v":121.50250079547867,"d":"121.5025"},{"$f":"(B42-B41)/Sheet3!$G$11","v":-173.19732277251936},{"$nulls":8},-1.9700299700299269,-15.162968875114466]
[{"$f":"A41+Sheet3!G$11","v":{"v":-3.6883116883116815,"d":"-3.69"}},{"v":120.1183064076863,"d":"120.1183"},{"$f":"(B43-B42)/Sheet3!$G$11","v":-171.9406287060637},{"$nulls":8},-1.658341658341617,-15.137501412734263]
[{"$f":"A42+Sheet3!G$11","v":{"v":-3.6803196803196734,"d":"-3.68"}},{"v":118.74415552891656,"d":"118.7442"},{"$f":"(B44-B43)/Sheet3!$G$11","v":-170.68958244722478},{"$nulls":8},-1.9780219780219348,-15.122775191954034]
[{"$f":"A43+Sheet3!G$11","v":{"v":-3.672327672327665,"d":"-3.67"}},{"v":117.38000302184584,"d":"117.3800"},{"$f":"(B45-B44)/Sheet3!$G$11","v":-169.44417174480535},{"$nulls":8},-1.6503496503496091,-15.102076804512528]
[{"$f":"A44+Sheet3!G$11","v":{"v":-3.664335664335657,"d":"-3.66"}},{"v":116.02580384706218,"d":"116.0258"},{"$f":"(B46-B45)/Sheet3!$G$11","v":-168.20438434760104},{"$nulls":8},-1.9860139860139427,-15.080221368771973]
[{"$f":"A45+Sheet3!G$11","v":{"v":-3.656343656343649,"d":"-3.66"}},{"v":114.68151306306537,"d":"114.6815"},{"$f":"(B47-B46)/Sheet3!$G$11","v":-166.97020800439506},{"$nulls":8},-1.6423576423576012,-15.065203321066733]
[{"$f":"A46+Sheet3!G$11","v":{"v":-3.6483516483516407,"d":"-3.65"}},{"v":113.347085826267,"d":"113.3471"},{"$f":"(B48-B47)/Sheet3!$G$11","v":-165.74163046397948},{"$nulls":8},-1.9940059940059507,-15.03528312345054]
[{"$f":"A47+Sheet3!G$11","v":{"v":-3.6403596403596326,"d":"-3.64"}},{"v":112.02247739099045,"d":"112.0225"},{"$f":"(B49-B48)/Sheet3!$G$11","v":-164.5186394751375},{"$nulls":8},-1.6343656343655932,-15.026901132220491]
[{"$f":"A48+Sheet3!G$11","v":{"v":-3.6323676323676244,"d":"-3.63"}},{"v":110.70764310947087,"d":"110.7076"},{"$f":"(B50-B49)/Sheet3!$G$11","v":-163.30122278667187},{"$nulls":8},-2.0019980019979586,-14.987936075960233]
[{"$f":"A49+Sheet3!G$11","v":{"v":-3.6243756243756162,"d":"-3.62"}},{"v":109.4025384318551,"d":"109.4025"},{"$f":"(B51-B50)/Sheet3!$G$11","v":-162.08936814736754},{"$nulls":8},-1.6263736263735853,-14.98719030988564]
[{"$f":"A50+Sheet3!G$11","v":{"v":-3.616383616383608,"d":"-3.62"}},{"v":108.10711890620182,"d":"108.1071"},{"$f":"(B52-B51)/Sheet3!$G$11","v":-160.88306330600773},{"$nulls":8},-1.6183816183815773,-14.946090828062259]
[{"$f":"A51+Sheet3!G$11","v":{"v":-3.6083916083916,"d":"-3.61"}},{"v":106.82134017848148,"d":"106.8213"},{"$f":"(B53-B52)/Sheet3!$G$11","v":-159.68229601140405},{"$nulls":8},-2.009990009989967,-14.938155748359787]
[{"$f":"A52+Sheet3!G$11","v":{"v":-3.6003996003995917,"d":"-3.60"}},{"v":105.54515799257615,"d":"105.5452"},{"$f":"(B54-B53)/Sheet3!$G$11","v":-158.48705401231481},{"$nulls":8},-1.6103896103895694,-14.903622562838652]
[{"$f":"A53+Sheet3!G$11","v":{"v":-3.5924075924075836,"d":"-3.59"}},{"v":104.27852819027993,"d":"104.2785"},{"$f":"(B55-B54)/Sheet3!$G$11","v":-157.29732505755345},{"$nulls":8},-2.017982017981975,-14.88591756479616]
[{"$f":"A54+Sheet3!G$11","v":{"v":-3.5844155844155754,"d":"-3.58"}},{"v":103.02140671129848,"d":"103.0214"},{"$f":"(B56-B55)/Sheet3!$G$11","v":-156.11309689591027},{"$nulls":8},-1.6023976023975615,-14.859805292391371]
[{"$f":"A55+Sheet3!G$11","v":{"v":-3.5764235764235672,"d":"-3.58"}},{"v":101.77374959324925,"d":"101.7737"},{"$f":"(B57-B56)/Sheet3!$G$11","v":-154.9343572761684},{"$nulls":8},-2.025974025973983,-14.831196851504558]
[{"$f":"A56+Sheet3!G$11","v":{"v":-3.568431568431559,"d":"-3.57"}},{"v":100.53551297166149,"d":"100.5355"},{"$f":"(B58-B57)/Sheet3!$G$11","v":-153.76109394711824},{"$nulls":8},-1.5944055944055535,-14.814658696985195]
[{"$f":"A57+Sheet3!G$11","v":{"v":-3.560439560439551,"d":"-3.56"}},{"v":99.30665307997623,"d":"99.3067"},{"$f":"(B59-B58)/Sheet3!$G$11","v":-152.59329465755357},{"$nulls":8},-2.0339660339659913,-14.773968836808413]
[{"$f":"A58+Sheet3!G$11","v":{"v":-3.5524475524475427,"d":"-3.55"}},{"v":98.08712624954623,"d":"98.0871"},{"$f":"(B60-B59)/Sheet3!$G$11","v":-151.43094715625764},{"$nulls":8},-1.5864135864135456,-14.768202358973134]
[{"$f":"A59+Sheet3!G$11","v":{"v":-3.5444555444555346,"d":"-3.54"}},{"v":96.87688890963608,"d":"96.8769"},{"$f":"(B61-B60)/Sheet3!$G$11","v":-150.2740391920367},{"$nulls":8},-1.5784215784215376,-14.720455762796444]
[{"$f":"A60+Sheet3!G$11","v":{"v":-3.5364635364635264,"d":"-3.54"}},{"v":95.675897587422,"d":"95.6759"},{"$f":"(B62-B61)/Sheet3!$G$11","v":-149.12255851365975},{"$nulls":8},-2.0419580419579995,-14.714208651119392]
[{"$f":"A61+Sheet3!G$11","v":{"v":-3.5284715284715182,"d":"-3.53"}},{"v":94.48410890799215,"d":"94.4841"},{"$f":"(B63-B62)/Sheet3!$G$11","v":-147.97649286993666},{"$nulls":8},-1.5704295704295297,-14.671438294984611]
[{"$f":"A62+Sheet3!G$11","v":{"v":-3.52047952047951,"d":"-3.52"}},{"v":93.3014795943463,"d":"93.3015"},{"$f":"(B64-B63)/Sheet3!$G$11","v":-146.83583000964705},{"$nulls":8},-2.0499500499500076,-14.65189132693741]
[{"$f":"A63+Sheet3!G$11","v":{"v":-3.512487512487502,"d":"-3.51"}},{"v":92.12796646739608,"d":"92.1280"},{"$f":"(B65-B64)/Sheet3!$G$11","v":-145.70055768158656},{"$nulls":8},-1.5624375624375217,-14.621169244155356]
[{"$f":"A64+Sheet3!G$11","v":{"v":-3.5044955044954937,"d":"-3.50"}},{"v":90.96352644596482,"d":"90.9635"},{"$f":"(B66-B65)/Sheet3!$G$11","v":-144.57066363453302},{"$nulls":8},-2.057942057942016,-14.586991798850597]
[{"$f":"A65+Sheet3!G$11","v":{"v":-3.4965034965034856,"d":"-3.50"}},{"v":89.80811654678773,"d":"89.8081"},{"$f":"(B67-B66)/Sheet3!$G$11","v":-143.44613561730168},{"$nulls":8},-1.5544455544455138,-14.56966780101463]
[{"$f":"A66+Sheet3!G$11","v":{"v":-3.4885114885114774,"d":"-3.49"}},{"$f":"x^4-3*x^2+6*x-2","v":{"v":88.66169388451159,"d":"88.6617"}},{"$f":"(B68-B67)/Sheet3!$G$11","v":-142.3269613786508},{"$nulls":8},-2.065934065934024,-14.519484903535341]
[{"$f":"A67+Sheet3!G$11","v":{"v":-3.4805194805194692,"d":"-3.48"}},{"v":87.5242156716952,"d":"87.5242"},{"$f":"(B69-B68)/Sheet3!$G$11","v":-141.21312866739916},{"$nulls":8},-1.5464535464535059,-14.516953058356622]
[{"$f":"A68+Sheet3!G$11","v":{"v":-3.472527472527461,"d":"-3.47"}},{"v":86.3956392188089,"d":"86.3956"},{"$f":"(B70-B69)/Sheet3!$G$11","v":-140.1046252323246},{"$nulls":8},-1.538461538461498,-14.463044011063761]
[{"$f":"A69+Sheet3!G$11","v":{"v":-3.464535464535453,"d":"-3.46"}},{"v":85.27592193423487,"d":"85.2759"},{"$f":"(B71-B70)/Sheet3!$G$11","v":-139.0014388222174},{"$nulls":8},-2.073926073926032,-14.449345379756242]
[{"$f":"A70+Sheet3!G$11","v":{"v":-3.4565434565434447,"d":"-3.46"}},{"v":84.1650213242671,"d":"84.1650"},{"$f":"(B72-B71)/Sheet3!$G$11","v":-137.90355718587145},{"$nulls":8},-1.53046953046949,-14.407959556106707]
[{"$f":"A71+Sheet3!G$11","v":{"v":-3.4485514485514366,"d":"-3.45"}},{"v":83.06289499311129,"d":"83.0629"},{"$f":"(B73-B72)/Sheet3!$G$11","v":-136.81096807206816},{"$nulls":8},-2.0819180819180403,-14.376547868366146]
[{"$f":"A72+Sheet3!G$11","v":{"v":-3.4405594405594284,"d":"-3.44"}},{"v":81.96950064288497,"d":"81.9695"},{"$f":"(B74-B73)/Sheet3!$G$11","v":-135.7236592296103},{"$nulls":8},-1.522477522477482,-14.351718492544354]
[{"$f":"A73+Sheet3!G$11","v":{"v":-3.4325674325674203,"d":"-3.43"}},{"v":80.88479607361735,"d":"80.8848"},{"$f":"(B75-B74)/Sheet3!$G$11","v":-134.64161840728278},{"$nulls":8},-2.0899100899100485,-14.30106691230613]
[{"$f":"A74+Sheet3!G$11","v":{"v":-3.424575424575412,"d":"-3.42"}},{"v":79.80873918324946,"d":"79.8087"},{"$f":"(B76-B75)/Sheet3!$G$11","v":-133.56483335387776},{"$nulls":8},-1.514485514485474,-14.29433952152383]
[{"$f":"A75+Sheet3!G$11","v":{"v":-3.416583416583404,"d":"-3.42"}},{"v":78.74128796763405,"d":"78.7413"},{"$f":"(B77-B76)/Sheet3!$G$11","v":-132.49329181817836},{"$nulls":8},-1.5064935064934661,-14.2358412462805]
[{"$f":"A76+Sheet3!G$11","v":{"v":-3.4085914085913958,"d":"-3.41"}},{"v":77.68240052053572,"d":"77.6824"},{"$f":"(B78-B77)/Sheet3!$G$11","v":-131.4269815489767},{"$nulls":8},-2.0979020979020566,-14.22287695660552]
[{"$f":"A77+Sheet3!G$11","v":{"v":-3.4005994005993876,"d":"-3.40"}},{"v":76.63203503363081,"d":"76.6320"},{"$f":"(B79-B78)/Sheet3!$G$11","v":-130.36589029508085},{"$nulls":8},-1.4985014985014582,-14.176242172137966]
[{"$f":"A78+Sheet3!G$11","v":{"v":-3.3926073926073794,"d":"-3.39"}},{"v":75.59014979650729,"d":"75.5901"},{"$f":"(B80-B79)/Sheet3!$G$11","v":-129.31000580526157},{"$nulls":8},-2.105894105894065,-14.141952348381857]
[{"$f":"A79+Sheet3!G$11","v":{"v":-3.3846153846153713,"d":"-3.38"}},{"v":74.55670319666504,"d":"74.5567"},{"$f":"(B81-B80)/Sheet3!$G$11","v":-128.25931582830378},{"$nulls":8},-1.4905094905094503,-14.11556070650806]
{"$rows_left_out":925}
{"sheet":"Defining Function","index":3,"n_rows":12,"n_cols":1,"rows_kept":12}
["                                                     Defining a Function in Excel"]
[]
["Computers have very specific rules you must follow when defining a function.  If you don't, the program will either not work at all or will work incorrectly."]
[]
["1. The Variable used should be the one named in the instruction, usually x, though sometimes y, t, Q (for an angle theta), "]
[" or even x and y (for a function of two variables). "]
[]
["2.  Order of Operations:  There five arithmetic operations, addition (+), subtraction (-), multiplication (*), division (/), and  exponentiation or power (^).  When computers see any of these operation symbols, they perform the indicated steps in a very particular order.  First, the power is done.  Second, products and quotients of adjacent terms is done.  Third, and last, sums and differences of adjacent terms are done.  So, in 10*x^3 + 5*x – 7, say with x = 2, the first pass only calculates 2^3 and ignores the multiplications and the sums and differences to calculate 2^3 = 8.  The second pass looks at 10*8 + 5*2 – 7 and only does the multiplications, so it produces 80 + 10 -  7.  The third pass looks at the +’s and –‘s to produce 80 + 10 – 7 = 83.  "]
[]
["3.    Parentheses  If you need an operation involving more than two adjacent terms, as in Ö4^3 + 6^2, the computer would take the square root of  4 to produce 2^3 + 6^2;  it would then cube the 2 and square the 6 to produce 8 + 36; and finally it would add the 8 and the 36 to get 44.  If you actually wanted the square root of the entire expression, you would need to use parentheses, as in Ö(4^3 + 6^2) to tell the computer to do all the operations inside the parentheses before taking the square root.  Therefore, it would calculate (4^3 + 6^2) = 64 + 36 = 100 and then take the square root of Ö100  =  10."]
[]
["4.  Built-In Functions  Computer programs have built-in functions for most common algebraic functions.  In Excel, the square root function is denoted by SQRT(…), so SQRT(100) = 10.  Alternatively, you could enter it as 100^.5 or 100^(1/2); notice that parentheses are needed to have the ½ done first.  The common trig functions are SIN (…), COS (…), and TAN (…), where the arguments are automatically interpreted as being in radians, not degrees.  The logarithm to the base 10 is represented by LOG (…) and the logarithm with the base e, known as the natural logarithm, is LN (…). The corresponding exponential function with base e is EXP (x).  If x is the variable, then each of these would be SQRT (x), SIN (x), COS (x), TAN (x), LOG (x) (for log with base 10 ), LN (x) (for log with base e ), and EXP (x)."]

{"sheet":"Sheet4","index":4,"n_rows":0,"n_cols":0,"rows_kept":0}