{"text_format":"3","workbook":"xlsx","n_sheets":5,"sheets":["Fixed Window","Variable Window","Sheet2","Defining Function","Sheet3"],"not_rendered":{"charts":2,"images":4,"macros":1,"external_links":1,"defined_names":18,"comments":2},"read":"whole","date_system":"1900"}

{"sheet":"Fixed Window","index":0,"n_rows":39,"n_cols":16,"rows_kept":39,"merged":[[26,2,26,3]]}
[null,"           Newton's Method"]
[]
[null,"  This graphing utility lets you investigate "]
[null,"          and apply Newton's Method"]
[null,null,"with any desired function"]
[{"$nulls":3},"y = f(x)"]
[null,"              and any starting value x0"]
[null,"         using a fixed graphing window."]
[]
["   Enter the function in terms of x:   f(x) =",{"$nulls":4},"x^4-5*x^3+7*x+5"]
[]
[]
["Now enter the fixed interval for x:  "]
[null,null,"xMin =",0]
[null,null,"xMax =",4]
[]
[{"$nulls":8},"           The graph of the function y =",{"$nulls":3},{"$f":"F10","v":"x^4-5*x^3+7*x+5"}]
["Click each item below for suggestions and investigations"]
[null,"   Item 1",{"$nulls":9},"   What is the starting point x0 =",{"$nulls":3},{"$f":"xMin+dx*N21","v":{"v":1.68,"d":"1.6800"}}]
[null,"   Item 2"]
[null,"   Item 3",{"$nulls":11},420,-0.3925]
[null,"   Item 4"]
[{"$nulls":10},"    How many iterations (1-15)?",{"$nulls":3},{"$f":"O24","v":4}]
[{"$nulls":9},"x0 =",{"$f":"xx0","v":{"v":1.68,"d":"1.6800"}},"y0 =",{"$f":"Sheet2!I1008","v":{"v":1.0831272885759784,"d":"1.0831"}},0,4]
[{"$nulls":9},"x1 =",{"$f":"Sheet2!L1010","v":{"v":1.4615864565353731,"d":"1.46159"}},"y1 =",{"$f":"Sheet2!M1010","v":{"v":4.203038559999987,"d":"4.2030"}},1,null,{"$f":"Sheet2!R1010","v":""}]
["To access/download all the DIGMath Apps for Calculus",{"$nulls":8},{"$f":"IF(Sheet2!$E1042<=nn,\"x2 =\",\"\")","v":"x2 ="},{"$f":"Sheet2!L1012","v":{"v":-3.2750073703846638E-4,"d":"-0.00033"}},{"$f":"IF(Sheet2!$E1042<=nn,\"y2 =\",\"\")","v":"y2 ="},{"$f":"Sheet2!M1012","v":{"$error":"#N/A"}},{"$f":"IF(Sheet2!E1042<=nn,Sheet2!E1042,\"\")","v":2},null,{"$f":"Sheet2!R1012","v":{"$error":"#N/A"}}]
["      Click this link:",null,"DIGMath for Calculus",{"$nulls":6},{"$f":"IF(Sheet2!$E1043<=nn,\"x3 =\",\"\")","v":"x3 ="},{"$f":"Sheet2!L1014","v":{"$error":"#N/A"}},{"$f":"IF(Sheet2!$E1043<=nn,\"y3 =\",\"\")","v":"y3 ="},{"$f":"Sheet2!M1014","v":{"$error":"#N/A"}},{"$f":"IF(Sheet2!E1043<=nn,Sheet2!E1043,\"\")","v":3},null,{"$f":"Sheet2!R1014","v":"Outside the interval"}]
[{"$nulls":9},{"$f":"IF(Sheet2!$E1044<=nn,\"x4 =\",\"\")","v":"x4 ="},{"$f":"Sheet2!L1016","v":{"$error":"#N/A"}},{"$f":"IF(Sheet2!$E1044<=nn,\"y4 =\",\"\")","v":"y4 ="},{"$f":"Sheet2!M1016","v":{"$error":"#N/A"}},{"$f":"IF(Sheet2!E1044<=nn,Sheet2!E1044,\"\")","v":4},null,{"$f":"Sheet2!R1016","v":"Outside the interval"}]
["Created by:  Sheldon P. Gordon   ",{"$nulls":8},{"$f":"IF(Sheet2!$E1045<=nn,\"x5 =\",\"\")","v":""},{"$f":"Sheet2!L1018","v":""},{"$f":"IF(Sheet2!$E1045<=nn,\"y5 =\",\"\")","v":""},{"$f":"Sheet2!M1018","v":""},{"$f":"IF(Sheet2!E1045<=nn,Sheet2!E1045,\"\")","v":""},null,{"$f":"Sheet2!R1018","v":""}]
["                      Farmingdale State College    ",{"$nulls":8},{"$f":"IF(Sheet2!$E1046<=nn,\"x6 =\",\"\")","v":""},{"$f":"Sheet2!L1020","v":""},{"$f":"IF(Sheet2!$E1046<=nn,\"y6 =\",\"\")","v":""},{"$f":"Sheet2!M1020","v":""},{"$f":"IF(Sheet2!E1046<=nn,Sheet2!E1046,\"\")","v":""},null,{"$f":"Sheet2!R1020","v":""}]
["Development of this module was supported by the ",{"$nulls":8},{"$f":"IF(Sheet2!$E1047<=nn,\"x7 =\",\"\")","v":""},{"$f":"Sheet2!L1022","v":""},{"$f":"IF(Sheet2!$E1047<=nn,\"y7 =\",\"\")","v":""},{"$f":"Sheet2!M1022","v":""},{"$f":"IF(Sheet2!E1047<=nn,Sheet2!E1047,\"\")","v":""},null,{"$f":"Sheet2!R1022","v":""}]
["NSF's Division of Undergraduate Education  ",{"$nulls":8},{"$f":"IF(Sheet2!$E1048<=nn,\"x8 =\",\"\")","v":""},{"$f":"Sheet2!L1024","v":""},{"$f":"IF(Sheet2!$E1048<=nn,\"y8 =\",\"\")","v":""},{"$f":"Sheet2!M1024","v":""},{"$f":"IF(Sheet2!E1048<=nn,Sheet2!E1048,\"\")","v":""},null,{"$f":"Sheet2!R1024","v":""}]
["under grants DUE-0310123 and DUE-0442160.",{"$nulls":8},{"$f":"IF(Sheet2!$E1049<=nn,\"x9 =\",\"\")","v":""},{"$f":"Sheet2!L1026","v":""},{"$f":"IF(Sheet2!$E1049<=nn,\"y9 =\",\"\")","v":""},{"$f":"Sheet2!M1026","v":""},{"$f":"IF(Sheet2!E1049<=nn,Sheet2!E1049,\"\")","v":""},null,{"$f":"Sheet2!R1026","v":""}]
[{"$nulls":9},{"$f":"IF(Sheet2!$E1050<=nn,\"x10 =\",\"\")","v":""},{"$f":"Sheet2!L1028","v":""},{"$f":"IF(Sheet2!$E1050<=nn,\"y10 =\",\"\")","v":""},{"$f":"Sheet2!M1028","v":""},{"$f":"IF(Sheet2!E1050<=nn,Sheet2!E1050,\"\")","v":""},null,{"$f":"Sheet2!R1028","v":""}]
[{"$nulls":9},{"$f":"IF(Sheet2!$E1051<=nn,\"x11 =\",\"\")","v":""},{"$f":"Sheet2!L1030","v":""},{"$f":"IF(Sheet2!$E1051<=nn,\"y11 =\",\"\")","v":""},{"$f":"Sheet2!M1030","v":""},{"$f":"IF(Sheet2!E1051<=nn,Sheet2!E1051,\"\")","v":""},null,{"$f":"Sheet2!R1030","v":""}]
[{"$nulls":9},{"$f":"IF(Sheet2!$E1052<=nn,\"x12 =\",\"\")","v":""},{"$f":"Sheet2!L1032","v":""},{"$f":"IF(Sheet2!$E1052<=nn,\"y12 =\",\"\")","v":""},{"$f":"Sheet2!M1032","v":""},{"$f":"IF(Sheet2!E1052<=nn,Sheet2!E1052,\"\")","v":""},null,{"$f":"Sheet2!R1032","v":""}]
[{"$nulls":9},{"$f":"IF(Sheet2!$E1053<=nn,\"x13 =\",\"\")","v":""},{"$f":"Sheet2!L1034","v":""},{"$f":"IF(Sheet2!$E1053<=nn,\"y13 =\",\"\")","v":""},{"$f":"Sheet2!M1034","v":""},{"$f":"IF(Sheet2!E1053<=nn,Sheet2!E1053,\"\")","v":""},null,{"$f":"Sheet2!R1034","v":""}]
[{"$nulls":9},{"$f":"IF(Sheet2!$E1054<=nn,\"x14 =\",\"\")","v":""},{"$f":"Sheet2!L1036","v":""},{"$f":"IF(Sheet2!$E1054<=nn,\"y14 =\",\"\")","v":""},{"$f":"Sheet2!M1036","v":""},{"$f":"IF(Sheet2!E1054<=nn,Sheet2!E1054,\"\")","v":""},null,{"$f":"Sheet2!R1036","v":""}]
[{"$nulls":9},{"$f":"IF(Sheet2!$E1055<=nn,\"x15 =\",\"\")","v":""},{"$f":"Sheet2!L1038","v":""},{"$f":"IF(Sheet2!$E1055<=nn,\"y15 =\",\"\")","v":""},{"$f":"Sheet2!M1038","v":""},{"$f":"IF(Sheet2!E1055<=nn,Sheet2!E1055,\"\")","v":""},null,{"$f":"Sheet2!R1038","v":""}]

{"sheet":"Variable Window","index":1,"n_rows":41,"n_cols":16,"rows_kept":41}
[null,"         Newton's Method"]
[]
[null,"This graphing utility lets you investigate "]
[null,"          and apply Newton's Method"]
[null,null,"with any desired function"]
[{"$nulls":3},"y = f(x)"]
[null,"              and any starting value x0"]
[null,"      using a variable graphing window."]
[]
["The function from the previous page is f(x) =",{"$nulls":4},{"$f":"'Fixed Window'!F10","v":"x^4-5*x^3+7*x+5"}]
[]
[]
["Now enter the prelimiunary interval for x:  "]
[null,null,"xMin =",0]
[null,null,"xMax =",4]
[]
[{"$nulls":9},"The graph of the function y =",null,null,{"$f":"F10","v":"x^4-5*x^3+7*x+5"}]
["Click each item below for suggestions and investigations"]
[null,"   Item 1",{"$nulls":9}," What is the starting point x0 =",{"$nulls":3},{"$f":"xxMin+dxx*N21","v":3.152}]
[null,"   Item 2"]
[null,"   Item 3",{"$nulls":11},197,-0.3925]
[null,"   Item 4"]
[{"$nulls":10},"How many iterations (1-15)?",{"$nulls":3},{"$f":"O24","v":3}]
[{"$nulls":9},"x0 =",{"$f":"x0","v":{"v":3.152,"d":"3.1520"}},"y0 =",{"$f":"Sheet2!L1295","v":{"v":-30.80694754918401,"d":"-30.8069"}},0,3]
[{"$nulls":9},"x1 =",{"$f":"Sheet2!K1297","v":{"v":1.3130460950817373,"d":"1.31305"}},"y1 =",{"$f":"Sheet2!L1297","v":{"v":5.84476063430049,"d":"5.8448"}},1]
["To access/download all the DIGMath Apps for Calculus",{"$nulls":8},{"$f":"IF(Sheet2!$E1042<=n,\"x2 =\",\"\")","v":"x2 ="},{"$f":"IF($N26<=n,Sheet2!K1299,\"\")","v":{"v":1.9085106957782543,"d":"1.90851"}},{"$f":"IF(Sheet2!$E1042<=n,\"y2 =\",\"\")","v":"y2 ="},{"$f":"IF($N26<=n,Sheet2!L1299,\"\")","v":{"v":-3.131173683053511,"d":"-3.13117"}},{"$f":"IF(Sheet2!E1042<=n,Sheet2!E1042,\"\")","v":2}]
["      Click this link:",null,"DIGMath for Calculus",{"$nulls":6},{"$f":"IF(Sheet2!$E1043<=n,\"x3 =\",\"\")","v":"x3 ="},{"$f":"IF(N27<=n,Sheet2!K1300,\"\")","v":{"v":1.750662625164069,"d":"1.75066"}},{"$f":"IF(Sheet2!$E1043<=n,\"y3 =\",\"\")","v":"y3 ="},{"$f":"IF($N27<=n,Sheet2!L1300,\"\")","v":{"v":0,"d":"0.00000"}},{"$f":"IF(Sheet2!E1043<=n,Sheet2!E1043,\"\")","v":3}]
[{"$nulls":9},{"$f":"IF(Sheet2!$E1044<=n,\"x4 =\",\"\")","v":""},{"$f":"IF(N28<=n,Sheet2!K1301,\"\")","v":""},{"$f":"IF(Sheet2!$E1044<=n,\"y4 =\",\"\")","v":""},{"$f":"IF($N28<=n,Sheet2!L1301,\"\")","v":""},{"$f":"IF(Sheet2!E1044<=n,Sheet2!E1044,\"\")","v":""}]
["Created by:  Sheldon P. Gordon   ",{"$nulls":8},{"$f":"IF(Sheet2!$E1045<=n,\"x5 =\",\"\")","v":""},{"$f":"IF(N29<=n,Sheet2!K1302,\"\")","v":""},{"$f":"IF(Sheet2!$E1045<=n,\"y5 =\",\"\")","v":""},{"$f":"IF($N29<=n,Sheet2!L1302,\"\")","v":""},{"$f":"IF(Sheet2!E1045<=n,Sheet2!E1045,\"\")","v":""}]
["                      Farmingdale State College    ",{"$nulls":8},{"$f":"IF(Sheet2!$E1046<=n,\"x6 =\",\"\")","v":""},{"$f":"IF(N30<=n,Sheet2!K1303,\"\")","v":""},{"$f":"IF(Sheet2!$E1046<=n,\"y6 =\",\"\")","v":""},{"$f":"IF($N30<=n,Sheet2!L1303,\"\")","v":""},{"$f":"IF(Sheet2!E1046<=n,Sheet2!E1046,\"\")","v":""}]
["Development of this module was supported by the ",{"$nulls":8},{"$f":"IF(Sheet2!$E1047<=n,\"x7 =\",\"\")","v":""},{"$f":"IF(N31<=n,Sheet2!K1304,\"\")","v":""},{"$f":"IF(Sheet2!$E1047<=n,\"y7 =\",\"\")","v":""},{"$f":"IF($N31<=n,Sheet2!L1304,\"\")","v":""},{"$f":"IF(Sheet2!E1047<=n,Sheet2!E1047,\"\")","v":""}]
["NSF's Division of Undergraduate Education  ",{"$nulls":8},{"$f":"IF(Sheet2!$E1048<=n,\"x8 =\",\"\")","v":""},{"$f":"IF(N32<=n,Sheet2!K1305,\"\")","v":""},{"$f":"IF(Sheet2!$E1048<=n,\"y8 =\",\"\")","v":""},{"$f":"IF($N32<=n,Sheet2!L1305,\"\")","v":""},{"$f":"IF(Sheet2!E1048<=n,Sheet2!E1048,\"\")","v":""}]
["under grants DUE-0310123 and DUE-0442160.",{"$nulls":8},{"$f":"IF(Sheet2!$E1049<=n,\"x9 =\",\"\")","v":""},{"$f":"IF(N33<=n,Sheet2!K1306,\"\")","v":""},{"$f":"IF(Sheet2!$E1049<=n,\"y9 =\",\"\")","v":""},{"$f":"IF($N33<=n,Sheet2!L1306,\"\")","v":""},{"$f":"IF(Sheet2!E1049<=n,Sheet2!E1049,\"\")","v":""}]
[{"$nulls":9},{"$f":"IF(Sheet2!$E1050<=n,\"x10 =\",\"\")","v":""},{"$f":"IF(N34<=n,Sheet2!K1307,\"\")","v":""},{"$f":"IF(Sheet2!$E1050<=n,\"y10 =\",\"\")","v":""},{"$f":"IF($N34<=n,Sheet2!L1307,\"\")","v":""},{"$f":"IF(Sheet2!E1050<=n,Sheet2!E1050,\"\")","v":""}]
[{"$nulls":9},{"$f":"IF(Sheet2!$E1051<=n,\"x11 =\",\"\")","v":""},{"$f":"IF(N35<=n,Sheet2!K1308,\"\")","v":""},{"$f":"IF(Sheet2!$E1051<=n,\"y11 =\",\"\")","v":""},{"$f":"IF($N35<=n,Sheet2!L1308,\"\")","v":""},{"$f":"IF(Sheet2!E1051<=n,Sheet2!E1051,\"\")","v":""}]
[{"$nulls":9},{"$f":"IF(Sheet2!$E1052<=n,\"x12 =\",\"\")","v":""},{"$f":"IF(N36<=n,Sheet2!K1309,\"\")","v":""},{"$f":"IF(Sheet2!$E1052<=n,\"y12 =\",\"\")","v":""},{"$f":"IF($N36<=n,Sheet2!L1309,\"\")","v":""},{"$f":"IF(Sheet2!E1052<=n,Sheet2!E1052,\"\")","v":""}]
[{"$nulls":9},{"$f":"IF(Sheet2!$E1053<=n,\"x13 =\",\"\")","v":""},{"$f":"IF(N37<=n,Sheet2!K1310,\"\")","v":""},{"$f":"IF(Sheet2!$E1053<=n,\"y13 =\",\"\")","v":""},{"$f":"IF($N37<=n,Sheet2!L1310,\"\")","v":""},{"$f":"IF(Sheet2!E1053<=n,Sheet2!E1053,\"\")","v":""}]
[{"$nulls":9},{"$f":"IF(Sheet2!$E1054<=n,\"x14 =\",\"\")","v":""},{"$f":"IF(N38<=n,Sheet2!K1311,\"\")","v":""},{"$f":"IF(Sheet2!$E1054<=n,\"y14 =\",\"\")","v":""},{"$f":"IF($N38<=n,Sheet2!L1311,\"\")","v":""},{"$f":"IF(Sheet2!E1054<=n,Sheet2!E1054,\"\")","v":""}]
[{"$nulls":9},{"$f":"IF(Sheet2!$E1055<=n,\"x15 =\",\"\")","v":""},{"$f":"IF(N39<=n,Sheet2!K1312,\"\")","v":""},{"$f":"IF(Sheet2!$E1055<=n,\"y15 =\",\"\")","v":""},{"$f":"IF($N39<=n,Sheet2!L1312,\"\")","v":""},{"$f":"IF(Sheet2!E1055<=n,Sheet2!E1055,\"\")","v":""}]
[]
[{"$nulls":13},{"$f":"N39","v":""}]

{"sheet":"Sheet2","index":2,"n_rows":1325,"n_cols":29,"rows_kept":1325}
[null,null,"x","y = f(x)","slope"]
[{"$nulls":3},{"$f":"'Fixed Window'!#REF!","v":{"$error":"#REF!"}}]
[null,null,{"$f":"'Fixed Window'!D14","v":0},{"$f":"x^4-5*x^3+7*x+5","v":5},-183.43429962379858,null,{"$f":"(D4-D3)/dx","v":6.999920064000076}]
[null,null,{"$f":"C3+dx","v":0.004},5.027999680256,-182.30582889651527]
[null,null,0.008,5.055997444096,-181.1817470514317]
[null,null,0.012,5.083991380736,-180.06204588116057]
[null,null,0.016,5.111979585536,-178.94671717836334]
[null,null,0.02,5.13996016,-177.83575273570554]
[null,null,0.024,5.167931211776,-176.72914434580392]
[null,null,0.028,5.195890854656,-175.62688380131587]
[null,null,0.032,5.223837208576,-174.52896289490693]
["delta x = ",{"$f":"(xMax-xMin)/1000","v":0.004},0.036000000000000004,5.251768399616,-173.4353734191857]
[null,null,0.04000000000000001,5.27968256,-172.34610716683807]
[null,null,0.04400000000000001,5.307577828096,-171.26115593047263]
[null,null,0.048000000000000015,5.335452348416,-170.1805115027793]
[null,null,0.05200000000000002,5.363304271616,-169.10416567637077]
[null,null,0.05600000000000002,5.3911317544960005,-168.03211024391663]
[null,null,0.060000000000000026,5.41893296,-166.96433699802552]
[null,null,0.06400000000000003,5.446706057216,-165.90083773139546,null,{"$f":"x","v":0.06400000000000003}]
[null,null,0.06800000000000003,5.474449221376,-164.84160423663914]
[null,null,0.07200000000000004,5.5021606338560005,-163.7866283064099]
[null,null,0.07600000000000004,5.529838482176,-162.73590173335907]
[null,null,0.08000000000000004,5.55748096,-161.6894163101379]
[null,null,0.08400000000000005,5.585086267136,-160.6471638293713]
[null,null,0.08800000000000005,5.612652609536,-159.6091360837329]
[null,null,0.09200000000000005,5.640178199296001,-158.5753248658537]
[null,null,0.09600000000000006,5.667661254656,-157.54572196838706]
[null,null,0.10000000000000006,5.6951,-156.52031918397202]
[null,null,0.10400000000000006,5.7224926658560005,-155.49910830525994]
[null,null,0.10800000000000007,5.749837488896,-154.48208112490616]
[null,null,0.11200000000000007,5.777132711936001,-153.46922943553557]
[null,null,0.11600000000000008,5.804376583936,-152.46054502981573]
[null,null,0.12000000000000008,5.83156736,-151.45601970038777]
[null,null,0.12400000000000008,5.858703301376001,-150.45564523988875]
[null,null,0.12800000000000009,5.885782675456,-149.45941344097815]
[null,null,0.1320000000000001,5.912803755776,-148.46731609629705]
[null,null,0.1360000000000001,5.939764822016,-147.47934499848867]
[null,null,0.1400000000000001,5.9666641600000005,-146.49549194021242]
[null,null,0.1440000000000001,5.993500061696,-145.5157487140993]
[null,null,0.1480000000000001,6.020270825216,-144.54010711280054]
[null,null,0.1520000000000001,6.046974754816,-143.56855892896752]
[null,null,0.1560000000000001,6.073610160896001,-142.6010959552495]
[null,null,0.16000000000000011,6.100175360000001,-141.6377099842774]
[null,null,0.16400000000000012,6.126668674816001,-140.67839280871883]
[null,null,0.16800000000000012,6.153088434176,-139.72313622120882]
[null,null,0.17200000000000013,6.1794329730560005,-138.77193201439056]
[null,null,0.17600000000000013,6.205700632576001,-137.82477198091328]
[null,null,0.18000000000000013,6.231889760000001,-136.88164791343846]
[null,null,0.18400000000000014,6.257998708736001,-135.942551604591]
[null,null,0.18800000000000014,6.284025838336001,-135.00747484702623]
[null,null,0.19200000000000014,6.309969514496001,-134.07640943339956]
[null,null,0.19600000000000015,6.335828109056001,-133.14934715634192]
[null,null,0.20000000000000015,6.361600000000001,-132.2262798085067]
[null,null,0.20400000000000015,6.387283571456001,-131.3071991825492]
[null,null,0.20800000000000016,6.412877213696001,-130.3920970711045]
[null,null,0.21200000000000016,6.438379323136001,-129.4809652668239]
[null,null,0.21600000000000016,6.463788302336001,-128.57379556235463]
[null,null,0.22000000000000017,6.489102560000001,-127.67057975033985]
[null,null,0.22400000000000017,6.514320510976001,-126.7713096234309]
[null,null,0.22800000000000017,6.539440576256001,-125.87597697427091]
[null,null,0.23200000000000018,6.564461182976001,-124.98457359550714]
[null,null,0.23600000000000018,6.589380764416001,-124.09709127979292]
[null,null,0.24000000000000019,6.6141977600000015,-123.21352181976125]
[null,null,0.2440000000000002,6.638910615296001,-122.33385700807361]
[null,null,0.2480000000000002,6.663517782016001,-121.45808863736706]
[null,null,0.25200000000000017,6.688017718016001,-120.5862085002868]
[null,null,0.25600000000000017,{"$f":"x^4-5*x^3+7*x+5","v":6.712408887296001},-119.71820838948821]
[null,null,{"$f":"C67+dx","v":0.2600000000000002},6.736689760000001,-118.85408009761446]
[null,null,0.2640000000000002,6.760858812416001,-117.99381541730871]
[null,null,0.2680000000000002,6.784914526976001,-117.13740614121821]
[null,null,0.2720000000000002,6.808855392256001,-116.28484406200035]
[null,null,0.2760000000000002,6.832679902976001,-115.43612097228407]
[null,null,0.2800000000000002,6.856386560000001,-114.59122866472882]
[null,null,0.2840000000000002,6.879973870336001,-113.75015893197775]
[null,null,0.2880000000000002,6.9034403471360015,-112.91290356667811]
[null,null,0.2920000000000002,6.926784509696001,-112.0794543614751]
[null,null,0.2960000000000002,6.9500048834560015,-111.24980310901392]
[null,null,0.3000000000000002,6.973100000000001,-110.42394160194588]
[null,null,0.3040000000000002,6.996068397056002,-109.60186163291415]
[null,null,0.3080000000000002,7.018908618496001,-108.78355499457003]
[null,null,0.3120000000000002,7.041619214336001,-107.96901347955261]
[null,null,0.3160000000000002,7.064198740736002,-107.15822888051322]
[null,null,0.32000000000000023,7.0866457600000015,-106.35119299010111]
[null,null,0.32400000000000023,7.108958840576001,-105.54789760095336]
[null,null,0.32800000000000024,7.131136557056001,-104.74833450573347]
[null,null,0.33200000000000024,7.1531774901760015,-103.95249549707037]
[null,null,0.33600000000000024,7.175080226816002,-103.16037236761944]
[null,null,0.34000000000000025,7.196843360000001,-102.37195691002894]
[null,null,0.34400000000000025,7.218465488896001,-101.58724091693999]
[null,null,0.34800000000000025,7.239945218816001,-100.80621618099983]
[null,null,0.35200000000000026,7.261281161216001,-100.02887449486485]
[null,null,0.35600000000000026,7.2824719336960015,-99.25520765116907]
[null,null,0.36000000000000026,7.303516160000001,-98.48520744256582]
[null,null,0.36400000000000027,7.324412470016002,-97.71886566169931]
[null,null,0.36800000000000027,7.345159499776001,-96.95617410121777]
[null,null,0.3720000000000003,7.3657558914560015,-96.1971245537664]
[null,null,0.3760000000000003,7.386200293376001,-95.44170881199754]
[null,null,0.3800000000000003,7.406491360000001,-94.6899186685513]
[null,null,0.3840000000000003,7.426627751936001,-93.94174591607187]
[null,null,0.3880000000000003,7.4466081359360015,-93.1971823472146]
[null,null,0.3920000000000003,7.466431184896002,-92.45621975461964]
[null,null,0.3960000000000003,7.486095577856002,-91.71884993093727]
[null,null,0.4000000000000003,7.505600000000001,-90.98506466881572]
[null,null,0.4040000000000003,7.524943142656001,-90.25485576089412]
[null,null,0.4080000000000003,7.544123703296002,-89.52821499982986]
[null,null,0.4120000000000003,7.563140385536002,-88.805134178259]
[null,null,0.4160000000000003,7.581991899136002,-88.08560508883183]
[null,null,0.4200000000000003,7.600676960000001,-87.36961952419963]
[null,null,0.4240000000000003,7.619194290176001,-86.65716927700356]
[null,null,0.4280000000000003,7.637542617856001,-85.94824613989289]
[null,null,0.43200000000000033,7.655720677376001,-85.24284190551688]
[null,null,0.43600000000000033,7.673727209216001,-84.54094836651464]
[null,null,0.44000000000000034,7.691560960000001,-83.84255731553746]
[null,null,0.44400000000000034,7.709220682496001,-83.14766054523666]
[null,null,0.44800000000000034,7.726705135616001,-82.45624984824829]
[null,null,0.45200000000000035,7.744013084416002,-81.76831701722772]
[null,null,0.45600000000000035,7.761143300096002,-81.08385384482116]
[null,null,0.46000000000000035,7.778094560000001,-80.40285212367077]
[null,null,0.46400000000000036,7.794865647616001,-79.72530364642176]
[null,null,0.46800000000000036,7.811455352576001,-79.05120020573254]
[null,null,0.47200000000000036,7.827862470656001,-78.38053359423714]
[null,null,0.47600000000000037,7.844085803776002,-77.71329560458582]
[null,null,0.48000000000000037,7.860124160000002,-77.04947802942688]
[null,null,0.4840000000000004,7.875976353536002,-76.38907266140853]
[null,null,0.4880000000000004,7.891641204736001,-75.73207129317396]
[null,null,0.4920000000000004,7.907117540096001,-75.07846571737346]
[null,null,0.4960000000000004,7.922404192256002,-74.42824772664815]
[null,null,0.5000000000000003,7.937500000000001,-73.78140911365139]
[null,null,0.5040000000000003,7.952403808256001,-73.13794167102226]
[null,null,0.5080000000000003,7.9671144680960015,-72.49783719141716]
[null,null,0.5120000000000003,{"$f":"x^4-5*x^3+7*x+5","v":7.9816308367360005},-71.86108746747317]
[null,null,{"$f":"C131+dx","v":0.5160000000000003},7.995951777536002,-71.2276842918436]
[null,null,0.5200000000000004,8.01007616,-70.59761945717366]
[null,null,0.5240000000000004,8.024002859776001,-69.97088475610553]
[null,null,0.5280000000000004,8.037730758656,-69.34747198129354]
[null,null,0.5320000000000004,8.051258744576002,-68.72737292537678]
[null,null,0.5360000000000004,8.064585711616001,-68.11057938100862]
[null,null,0.5400000000000004,8.077710560000002,-67.4970831408312]
[null,null,0.5440000000000004,8.090632196096001,-66.88687599749073]
[null,null,0.5480000000000004,8.103349532416,-66.27994974363953]
[null,null,0.5520000000000004,8.115861487616002,-65.67629617192028]
[null,null,0.5560000000000004,8.128166986496002,-65.07590707497818]
[null,null,0.5600000000000004,8.140264960000001,-64.47877424546044]
[null,null,0.5640000000000004,8.152154345216001,-63.884889476018905]
[null,null,0.5680000000000004,8.163834085376001,-63.294244559294185]
[null,null,0.5720000000000004,8.175303129856001,-62.70683128793555]
[null,null,0.5760000000000004,8.186560434176002,-62.12264145458923]
[null,null,0.5800000000000004,8.197604960000001,-61.54166685190042]
[null,null,0.5840000000000004,8.208435675136002,-60.963899272521445]
[null,null,0.5880000000000004,8.219051553536001,-60.3893305090914]
[null,null,0.5920000000000004,8.229451575296,-59.817952354261095]
[null,null,0.5960000000000004,8.239634726656002,-59.24975660067826]
[null,null,0.6000000000000004,8.249600000000001,-58.684735040987086]
[null,null,0.6040000000000004,8.259346393856001,-58.122879467835325]
[null,null,0.6080000000000004,8.268872912896,-57.564181673867665]
[null,null,0.6120000000000004,8.278178567936001,-57.00863345173642]
[null,null,0.6160000000000004,8.287262375936,-56.456226594080206]
[null,null,0.6200000000000004,8.296123360000001,-55.906952893553864]
[null,null,0.6240000000000004,8.304760549376,-55.360804142798536]
[null,null,0.6280000000000004,8.313172979456002,-54.817772134461975]
[null,null,0.6320000000000005,8.321359691776001,-54.27784866119192]
[null,null,0.6360000000000005,8.329319734016002,-53.7410255156356]
[null,null,0.6400000000000005,8.33705216,-53.207294490437214]
[null,null,0.6440000000000005,8.344556029696001,-52.67664737824603]
[null,null,0.6480000000000005,8.351830409216,-52.149075971706736]
[null,null,0.6520000000000005,8.358874370816,-51.62457206346861]
[null,null,0.6560000000000005,8.365686992896,-51.10312744617533]
[null,null,0.6600000000000005,8.372267360000002,-50.58473391247565]
[null,null,0.6640000000000005,8.378614562816,-50.06938325501528]
[null,null,0.6680000000000005,8.384727698176,-49.55706726644198]
[null,null,0.6720000000000005,8.390605869056,-49.04777773939942]
[null,null,0.6760000000000005,8.396248184576,-48.541506466539914]
[null,null,0.6800000000000005,8.40165376,-48.038245240504104]
[null,null,0.6840000000000005,8.406821716736001,-47.537985853941755]
[null,null,0.6880000000000005,8.411751182336001,-47.040720099500106]
[null,null,0.6920000000000005,8.416441290496001,-46.54643976982386]
[null,null,0.6960000000000005,8.420891181056,-46.055136657561775]
[null,null,0.7000000000000005,8.4251,-45.56680255535956]
[null,null,0.7040000000000005,8.429066899456,-45.08142925586242]
[null,null,0.7080000000000005,8.432791037696001,-44.59900855171962]
[null,null,0.7120000000000005,8.436271579136001,-44.11953223557586]
[null,null,0.7160000000000005,8.439507694336001,-43.64299210007991]
[null,null,0.7200000000000005,8.44249856,-43.169379937877466]
[null,null,0.7240000000000005,8.445243358976,-42.698687541612216]
[null,null,0.7280000000000005,8.447741280256,-42.23090670393774]
[null,null,0.7320000000000005,8.449991518976,-41.76602921749265]
[null,null,0.7360000000000005,8.451993276416001,-41.30404687493002]
[null,null,0.7400000000000005,8.45374576,-40.84495146889353]
[null,null,0.7440000000000005,8.455248183296,-40.38873479202965]
[null,null,0.7480000000000006,8.456499766016,-39.9353886369874]
[null,null,0.7520000000000006,8.457499734016,-39.4849047964102]
[null,null,0.7560000000000006,8.458247319296,-39.03727506294783]
[null,null,0.7600000000000006,8.45874176,-38.59249122924626]
[null,null,0.7640000000000006,8.458982300416,-38.15054508794941]
[null,null,0.7680000000000006,{"$f":"x^4-5*x^3+7*x+5","v":8.458968190976},-37.71142843170835]
[null,null,{"$f":"C195+dx","v":0.7720000000000006},8.458698688256,-37.27513305316521]
[null,null,0.7760000000000006,8.458173054976001,-36.84165074497056]
[null,null,0.7800000000000006,8.45739056,-36.41097329976932]
[null,null,0.7840000000000006,8.456350478336,-35.98309251020746]
[null,null,0.7880000000000006,8.455052091136,-35.55800016893427]
[null,null,0.7920000000000006,8.453494685696,-35.135688068593666]
[null,null,0.7960000000000006,8.451677555456001,-34.71614800183365]
[null,null,0.8000000000000006,8.4496,-34.299371761300705]
[null,null,0.8040000000000006,8.447261325056,-33.885351139642054]
[null,null,0.8080000000000006,8.444660842495999,-33.474077929502656]
[null,null,0.8120000000000006,8.441797870336,-33.065543923531514]
[null,null,0.8160000000000006,8.438671732736,-32.65974091437359]
[null,null,0.8200000000000006,8.43528176,-32.25666069467613]
[null,null,0.8240000000000006,8.431627288576,-31.856295057087106]
[null,null,0.8280000000000006,8.427707661055999,-31.45863579425047]
[null,null,0.8320000000000006,8.423522226175999,-31.06367469881523]
[null,null,0.8360000000000006,8.419070338815999,-30.671403563426594]
[null,null,0.8400000000000006,8.41435136,-30.281814180732557]
[null,null,0.8440000000000006,8.409364656895999,-29.89489834337909]
[null,null,0.8480000000000006,8.404109602816,-29.51064784401368]
[null,null,0.8520000000000006,8.398585577216,-29.12905447528102]
[null,null,0.8560000000000006,8.392791965695999,-28.75011002982937]
[null,null,0.8600000000000007,8.386728159999999,-28.373806300305706]
[null,null,0.8640000000000007,8.380393558016,-28.000135079355744]
[null,null,0.8680000000000007,8.373787563776,-27.629088159627226]
[null,null,0.8720000000000007,8.366909587456,-27.26065733376485]
[null,null,0.8760000000000007,8.359759045375998,-26.894834394417376]
[null,null,0.8800000000000007,8.352335359999998,-26.53161113423255]
[null,null,0.8840000000000007,8.344637959936,-26.170979345852015]
[null,null,0.8880000000000007,8.336666279935999,-25.8129308219286]
[null,null,0.8920000000000007,8.328419760895999,-25.45745735510446]
[null,null,0.8960000000000007,8.319897849855998,-25.104550738027847]
[null,null,0.9000000000000007,8.311099999999998,-24.754202763347013]
[null,null,0.9040000000000007,8.302025670655999,-24.406405223706148]
[null,null,0.9080000000000007,8.292674327295998,-24.061149911753503]
[null,null,0.9120000000000007,8.283045441535998,-23.718428620134283]
[null,null,0.9160000000000007,8.273138491135999,-23.378233141497248]
[null,null,0.9200000000000007,8.262952959999998,-23.040555268486585]
[null,null,0.9240000000000007,8.252488338175999,-22.70538679375258]
[null,null,0.9280000000000007,8.241744121855998,-22.372719509938406]
[null,null,0.9320000000000007,8.230719813375998,-22.042545209692314]
[null,null,0.9360000000000007,8.219414921215996,-21.714855685660016]
[null,null,0.9400000000000007,8.207828959999999,-21.389642730489765]
[null,null,0.9440000000000007,8.195961450495997,-21.06689813682778]
[null,null,0.9480000000000007,8.183811919615998,-20.74661369731927]
[null,null,0.9520000000000007,8.171379900415996,-20.42878120461299]
[null,null,0.9560000000000007,8.158664932095999,-20.113392451354652]
[null,null,0.9600000000000007,8.145666559999997,-19.80043923019048]
[null,null,0.9640000000000007,8.132384335615997,-19.489913333768218]
[null,null,0.9680000000000007,8.118817816575998,-19.18180655473307]
[null,null,0.9720000000000008,8.104966566655998,-18.8761106857343]
[null,null,0.9760000000000008,8.090830155775997,-18.572817519415594]
[null,null,0.9800000000000008,8.076408159999998,-18.2719188484252]
[null,null,0.9840000000000008,8.061700161535997,-17.97340646541036]
[null,null,0.9880000000000008,8.046705748735997,-17.677272163016273]
[null,null,0.9920000000000008,8.031424516095997,-17.383507733890685]
[null,null,0.9960000000000008,8.015856064255997,-17.092104970680325]
[null,null,1.0000000000000007,7.999999999999997,-16.803055666031412]
[null,null,1.0040000000000007,7.983855936255998,-16.516351612590167]
[null,null,1.0080000000000007,7.967423492095996,-16.231984603004335]
[null,null,1.0120000000000007,7.950702292735997,-15.949946429920136]
[null,null,1.0160000000000007,7.933691969535997,-15.670228885984805]
[null,null,1.0200000000000007,7.9163921599999965,-15.39282376384304]
[null,null,1.0240000000000007,{"$f":"x^4-5*x^3+7*x+5","v":7.898802507775996},-15.117722856144617]
[null,null,{"$f":"C259+dx","v":1.0280000000000007},7.880922662655997,-14.844917955533724]
[null,null,1.0320000000000007,7.862752280575997,-14.574400854658613]
[null,null,1.0360000000000007,7.844291023615997,-14.306163346164489]
[null,null,1.0400000000000007,7.8255385599999965,-14.040197222699604]
[null,null,1.0440000000000007,7.806494564095996,-13.776494276909162]
[null,null,1.0480000000000007,7.7871587164159966,-13.5150463014404]
[null,null,1.0520000000000007,7.767530703615996,-13.25584508894157]
[null,null,1.0560000000000007,7.747610218495996,-12.99888243205686]
[null,null,1.0600000000000007,7.727396959999997,-12.744150123434522]
[null,null,1.0640000000000007,7.7068906332159965,-12.491639955720778]
[null,null,1.0680000000000007,7.686090949375996,-12.241343721561847]
[null,null,1.0720000000000007,7.664997625855996,-11.993253213605982]
[null,null,1.0760000000000007,7.643610386175997,-11.74736022449737]
[null,null,1.0800000000000007,7.621928959999996,-11.503656546885281]
[null,null,1.0840000000000007,7.599953083135996,-11.262133973414919]
[null,null,1.0880000000000007,7.577682497535995,-11.02278429673352]
[null,null,1.0920000000000007,7.555116951295997,-10.785599309487303]
[null,null,1.0960000000000008,7.532256198655995,-10.550570804322998]
[null,null,1.1000000000000008,7.509099999999996,-10.317690573888349]
[null,null,1.1040000000000008,7.485648121855995,-10.08695041082856]
[null,null,1.1080000000000008,7.4619003368959955,-9.858342107791376]
[null,null,1.1120000000000008,7.437856423935996,-9.631857457422509]
[null,null,1.1160000000000008,7.413516167935996,-9.407488252369703]
[null,null,1.1200000000000008,7.388879359999995,-9.185226285279686]
[null,null,1.1240000000000008,7.363945797375996,-8.965063348797663]
[null,null,1.1280000000000008,7.338715283455995,-8.746991235571887]
[null,null,1.1320000000000008,7.313187627775996,-8.531001738248577]
[null,null,1.1360000000000008,7.287362646015995,-8.317086649473445]
[null,null,1.1400000000000008,7.261240159999995,-8.105237761895253]
[null,null,1.1440000000000008,7.234819997695995,-7.895446868158697]
[null,null,1.1480000000000008,7.208101993215994,-7.687705760911012]
[null,null,1.1520000000000008,7.181085986815995,-7.482006232800451]
[null,null,1.1560000000000008,7.153771824895994,-7.278340076471203]
[null,null,1.1600000000000008,7.126159359999995,-7.076699084571519]
[null,null,1.1640000000000008,7.098248450815993,-6.877075049747621]
[null,null,1.1680000000000008,7.070038962175993,-6.679459764646744]
[null,null,1.1720000000000008,7.0415307650559935,-6.4838450219146]
[null,null,1.1760000000000008,7.012723736575994,-6.290222614198427]
[null,null,1.1800000000000008,6.983617759999993,-6.09858433414546]
[null,null,1.1840000000000008,6.954212724735994,-5.908921974400904]
[null,null,1.1880000000000008,6.924508526335994,-5.721227327613011]
[null,null,1.1920000000000008,6.894505066495995,-5.535492186428002]
[null,null,1.1960000000000008,6.8642022530559945,-5.351708343492096]
[null,null,1.2000000000000008,6.8335999999999935,-5.16986759145253]
[null,null,1.2040000000000008,6.802698227455993,-4.989961722955016]
[null,null,1.2080000000000009,6.771496861695994,-4.811982530647807]
[null,null,1.2120000000000009,6.739995835135993,-4.635921807176615]
[null,null,1.2160000000000009,6.7081950863359925,-4.46177134518766]
[null,null,1.2200000000000009,6.676094559999992,-4.289522937329195]
[null,null,1.2240000000000009,6.643694206975993,-4.119168376246424]
[null,null,1.2280000000000009,6.610993984255991,-3.9506994545860756]
[null,null,1.2320000000000009,6.5779938549759915,-3.7841079649964016]
[null,null,1.2360000000000009,6.544693788415993,-3.6193857001226064]
[null,null,1.2400000000000009,6.511093759999993,-3.4565244526119265]
[null,null,1.2440000000000009,6.477193751295992,-3.2955160151105822]
[null,null,1.2480000000000009,6.442993750015992,-3.136352180265302]
[null,null,1.252000000000001,6.4084937500159915,-2.9790247407243378]
[null,null,1.256000000000001,6.373693751295993,-2.823525489131878]
[null,null,1.260000000000001,6.3385937599999895,-2.6698462181361755]
[null,null,1.264000000000001,6.303193788415992,-2.517978720384466]
[null,null,1.268000000000001,6.267493854975991,-2.367914788521446]
[null,null,1.272000000000001,6.231493984255993,-2.219646215195368]
[null,null,1.276000000000001,6.195194206975991,-2.0731647930529604]
[null,null,1.280000000000001,{"$f":"x^4-5*x^3+7*x+5","v":6.158594559999992},-1.9284623147399351]
[null,null,{"$f":"C323+dx","v":1.284000000000001},6.121695086335992,-1.7855305729030206]
[null,null,1.288000000000001,6.084495835135993,-1.6443613601904694]
[null,null,1.292000000000001,6.046996861695991,-1.5049464692474857]
[null,null,1.296000000000001,6.00919822745599,-1.3672776927213057]
[null,null,1.300000000000001,5.971099999999993,-1.2313468232576419]
[null,null,1.304000000000001,5.932702253055993,-1.0971456535047466]
[null,null,1.308000000000001,5.894005066495989,-0.9646659761088401]
[null,null,1.312000000000001,5.85500852633599,-0.8338995837156347]
[null,null,1.316000000000001,5.815712724735992,-0.7048382689728747]
[null,null,1.320000000000001,5.776117759999991,-0.5774738245267805]
[null,null,1.324000000000001,5.73622373657599,-0.4517980430245885]
[null,null,1.328000000000001,5.6960307650559905,-0.32780271711251885]
[null,null,1.332000000000001,5.65553896217599,-0.20547963943679193]
[null,null,1.336000000000001,5.6147484508159895,-0.08482060264515212]
[null,null,1.340000000000001,5.573659359999992,0.03418260061668832]
[null,null,1.344000000000001,5.5322718248959895,0.15153817770149303]
[null,null,1.348000000000001,5.49058598681599,0.26725433596202564]
[null,null,1.352000000000001,5.4486019932159895,0.38133928275308193]
[null,null,1.356000000000001,5.40631999769599,0.4938012254269175]
[null,null,1.360000000000001,5.36374015999999,0.604648371336804]
[null,null,1.364000000000001,5.320862646015989,0.7138889278360132]
[null,null,1.368000000000001,5.27768762777599,0.8215311022788327]
[null,null,1.372000000000001,5.234215283455988,0.9275831020175183]
[null,null,1.376000000000001,5.19044579737599,1.0320531344053414]
[null,null,1.380000000000001,5.1463793599999885,1.134949406797098]
[null,null,1.384000000000001,5.102016167935988,1.2362801265440275]
[null,null,1.388000000000001,5.057356423935989,1.3360535010009258]
[null,null,1.392000000000001,5.01240033689599,1.4342777375200484]
[null,null,1.396000000000001,4.96714812185599,1.530961043456191]
[null,null,1.400000000000001,4.921599999999987,1.6261116261605935]
[null,null,1.404000000000001,4.875756198655987,1.7197376929885593]
[null,null,1.408000000000001,4.8296169512959874,1.8118474512923441]
[null,null,1.412000000000001,4.783182497535989,1.9024491084252197]
[null,null,1.416000000000001,4.73645308313599,1.9915508717409658]
[null,null,1.420000000000001,4.689428959999988,2.079160948592854]
[null,null,1.424000000000001,4.642110386175986,2.16528754633314]
[null,null,1.428000000000001,4.594497625855988,2.249938872316619]
[null,null,1.432000000000001,4.546590949375988,2.3331231338965637]
[null,null,1.436000000000001,4.498390633215987,2.414848538424213]
[null,null,1.440000000000001,4.449896959999988,2.4951232932553786]
[null,null,1.444000000000001,4.401110218495987,2.5739556057423165]
[null,null,1.448000000000001,4.3520307036159895,2.6513536832382982]
[null,null,1.452000000000001,4.302658716415987,2.7273257330965954]
[null,null,1.456000000000001,4.252994564095987,2.80187996267048]
[null,null,1.460000000000001,4.203038559999987,2.875024579313731]
[null,null,1.464000000000001,4.152791023615988,2.9467677903786047]
[null,null,1.468000000000001,4.102252280575986,3.0171178032204047]
[null,null,1.472000000000001,4.051422662655986,3.0860828251898624]
[null,null,1.476000000000001,4.000302507775984,3.15367106364279]
[null,null,1.480000000000001,3.9488921599999873,3.2198907259299183]
[null,null,1.484000000000001,3.897191969535987,3.284750019407568]
[null,null,1.488000000000001,3.845202292735987,3.348257151425962]
[null,null,1.492000000000001,3.7929234920959853,3.410420329340912]
[null,null,1.496000000000001,3.7403559362559857,3.4712477605041663]
[null,null,1.500000000000001,3.687499999999984,3.530747652269504]
[null,null,1.5040000000000011,3.634356064255986,3.588928211990705]
[null,null,1.5080000000000011,3.580924516095987,3.645797647020533]
[null,null,1.5120000000000011,3.5272057487359856,3.7013641647122597]
[null,null,1.5160000000000011,3.4732001615359867,3.7556359724191566]
[null,null,1.5200000000000011,3.4189081599999867,3.8086212774955115]
[null,null,1.5240000000000011,3.3643301557759866,3.860328287293072]
[null,null,1.5280000000000011,3.309466566655985,3.910765209166126]
[null,null,1.5320000000000011,3.2543178165759805,3.9599402504684527]
[null,null,1.5360000000000011,{"$f":"x^4-5*x^3+7*x+5","v":3.1988843356159844},4.0078616185518]
[null,null,{"$f":"C387+dx","v":1.5400000000000011},3.143166559999983,4.054537520770456]
[null,null,1.5440000000000011,3.0871649320959857,4.0999761644782]
[null,null,1.5480000000000012,3.030879900415984,4.144185757027795]
[null,null,1.5520000000000012,2.9743119196159853,4.187174505772006]
[null,null,1.5560000000000012,2.917461450495983,4.22895061806512]
[null,null,1.5600000000000012,2.8603289599999844,4.269522301259901]
[null,null,1.5640000000000012,2.802914921215981,4.308897762710128]
[null,null,1.5680000000000012,2.745219813375984,4.347085209768057]
[null,null,1.5720000000000012,2.687244121855983,4.384092849787976]
[null,null,1.5760000000000012,2.6289883381759847,4.419928890123156]
[null,null,1.5800000000000012,2.5704529599999812,4.4546015381263615]
[null,null,1.5840000000000012,2.5116384911359813,4.48811900115188]
[null,null,1.5880000000000012,2.4525454415359818,4.520489486551458]
[null,null,1.5920000000000012,2.3931743272959842,4.551721201679893]
[null,null,1.5960000000000012,2.333525670655982,4.581822353889439]
[null,null,1.6000000000000012,2.2735999999999787,4.610801150534385]
[null,null,1.6040000000000012,2.21339784985598,4.638665798966986]
[null,null,1.6080000000000012,2.1529197608959816,4.66542450654153]
[null,null,1.6120000000000012,2.092166279935979,4.691085480610781]
[null,null,1.6160000000000012,2.031137959935979,4.715656928528009]
[null,null,1.6200000000000012,1.969835359999978,4.739147057646996]
[null,null,1.6240000000000012,1.9082590453759813,4.7615640753199955]
[null,null,1.6280000000000012,1.8464095874559767,4.782916188902313]
[null,null,1.6320000000000012,1.7842875637759779,4.8032116057446785]
[null,null,1.6360000000000012,1.7218935580159815,4.822458533202397]
[null,null,1.6400000000000012,1.6592281599999854,4.840665178627724]
[null,null,1.6440000000000012,1.5962919656959773,4.857839749374946]
[null,null,1.6480000000000012,1.533085577215978,4.8739904527963205]
[null,null,1.6520000000000012,1.4696096028159769,4.889125496245626]
[null,null,1.6560000000000012,1.4058646568959823,4.903253087076642]
[null,null,1.6600000000000013,1.3418513599999802,4.916381432641117]
[null,null,1.6640000000000013,1.2775703388159805,4.928518740294862]
[null,null,1.6680000000000013,1.2130222261759798,4.939673217388101]
[null,null,1.6720000000000013,1.1482076610559808,4.949853071277154]
[null,null,1.6760000000000013,1.0831272885759784,4.959066509313768]
[null,null,1.6800000000000013,1.0177817599999806,4.967321738850707]
[null,null,1.6840000000000013,0.952171732735982,4.9746269672427665]
[null,null,1.6880000000000013,0.8862978703359783,4.980990401842202]
[null,null,1.6920000000000013,0.8201608424959801,4.986420250003302]
[null,null,1.6960000000000013,0.7537613250559776,4.990924719077306]
[null,null,1.7000000000000013,0.6870999999999761,4.994512016420533]
[null,null,1.7040000000000013,0.6201775554559799,4.997190349383207]
[null,null,1.7080000000000013,0.5529946856959764,4.998967925321647]
[null,null,1.7120000000000013,0.48555209113597897,4.999852951586586]
[null,null,1.7160000000000013,0.4178504783359802,4.999853635532311]
[null,null,1.7200000000000013,0.34989055999997376,4.99897818451311]
[null,null,1.7240000000000013,0.28167305497597894,4.99723480588073]
[null,null,1.7280000000000013,0.21319868825597688,4.994631706989459]
[null,null,1.7320000000000013,0.14446819097597796,4.991177095191553]
[null,null,1.7360000000000013,0.07548230041597925,4.986879177842315]
[null,null,1.7400000000000013,0.006241759999975116,4.9817461622929855]
[null,null,1.7440000000000013,-0.06325268070402146,4.975786255897344]
[null,null,1.7480000000000013,-0.13300026598402503,4.969007666010185]
[null,null,1.7520000000000013,-0.2030002339840209,4.96141859998275]
[null,null,1.7560000000000013,-0.27325181670402543,4.953027265169833]
[null,null,1.7600000000000013,-0.3437542400000222,4.943841868923691]
[null,null,1.7640000000000013,-0.4145067235840223,4.933870618598103]
[null,null,1.7680000000000013,-0.4855084810240218,4.923121721547357]
[null,null,1.7720000000000014,-0.5567587197440265,4.911603385122692]
[null,null,1.7760000000000014,-0.6282566410240236,4.899323816678905]
[null,null,1.7800000000000014,-0.7000014400000207,4.886291223569266]
[null,null,1.7840000000000014,-0.7719923056640248,4.87251381314654]
[null,null,1.7880000000000014,-0.8442284208640274,4.857999792764506]
[null,null,1.7920000000000014,{"$f":"x^4-5*x^3+7*x+5","v":-0.916708962304023},4.842757369775928]
[null,null,{"$f":"C451+dx","v":1.7960000000000014},-0.9894331005440229,4.826794751534077]
[null,null,1.8000000000000014,-1.0624000000000304,4.810120145393242]
[null,null,1.8040000000000014,-1.1356088189440268,4.792741758705677]
[null,null,1.8080000000000014,-1.2090587095040242,4.774667798825671]
[null,null,1.8120000000000014,-1.2827488176640234,4.755906473104972]
[null,null,1.8160000000000014,-1.3566782832640243,4.736465988898882]
[null,null,1.8200000000000014,-1.4308462400000295,4.71635455355915]
[null,null,1.8240000000000014,-1.5052518154240264,4.695580374440063]
[null,null,1.8280000000000014,-1.579894130944023,4.6741516588943846]
[null,null,1.8320000000000014,-1.6547723018240266,4.652076614274879]
[null,null,1.8360000000000014,-1.7298854371840289,4.629363447936342]
[null,null,1.8400000000000014,-1.8052326400000211,4.606020367231029]
[null,null,1.8440000000000014,-1.8808130071040292,4.582055579512719]
[null,null,1.8480000000000014,-1.9566256291840283,4.557477292134177]
[null,null,1.8520000000000014,-2.032669590784028,4.5322937124491816]
[null,null,1.8560000000000014,-2.1089439703040274,4.506513047811005]
[null,null,1.8600000000000014,-2.185447840000027,4.480143505572411]
[null,null,1.8640000000000014,-2.262180265984023,4.453193293087686]
[null,null,1.8680000000000014,-2.33914030822403,4.425670617709088]
[null,null,1.8720000000000014,-2.4163270205440313,4.397583686790902]
[null,null,1.8760000000000014,-2.493739450624025,4.368940707685894]
[null,null,1.8800000000000014,-2.5713766400000253,4.339749887746827]
[null,null,1.8840000000000015,-2.6492376240640354,4.310019434328495]
[null,null,1.8880000000000015,-2.7273214320640324,4.279757554783156]
[null,null,1.8920000000000015,-2.805627087104032,4.248972456464589]
[null,null,1.8960000000000015,-2.8841536061440234,4.217672346724541]
[null,null,1.9000000000000015,-2.962900000000028,4.185865432919332]
[null,null,1.9040000000000015,-3.0418652733440332,4.153559922399186]
[null,null,1.9080000000000015,-3.1210484247040267,4.120764022519406]
[null,null,1.9120000000000015,-3.2004484464640264,4.087485940632757]
[null,null,1.9160000000000015,-3.280064324864032,4.053733884092001]
[null,null,1.9200000000000015,-3.359895040000035,4.019516060251426]
[null,null,1.9240000000000015,-3.4399395658240337,3.984840676463797]
[null,null,1.9280000000000015,-3.5201968701440354,3.9497159400818767]
[null,null,1.9320000000000015,-3.600665914624029,3.9141500584604607]
[null,null,1.9360000000000015,-3.6813456547840318,3.878151238950789]
[null,null,1.9400000000000015,-3.762235040000027,3.841727688908673]
[null,null,1.9440000000000015,-3.8433330135040293,3.8048876156848443]
[null,null,1.9480000000000015,-3.924638512384032,3.767639226634607]
[null,null,1.9520000000000015,-4.0061504675840265,3.7299907291102166]
[null,null,1.9560000000000015,-4.087867803904029,3.6919503304659607]
[null,null,1.9600000000000015,-4.169789440000029,3.653526238053079]
[null,null,1.9640000000000015,-4.251914288384034,3.614726659227383]
[null,null,1.9680000000000015,-4.334241255424033,3.5755598013411287]
[null,null,1.9720000000000015,-4.416769241344033,3.5360338717470796]
[null,null,1.9760000000000015,-4.499497140224033,3.4961570777990154]
[null,null,1.9800000000000015,-4.582423840000036,3.4559376268502078]
[null,null,1.9840000000000015,-4.665548222464031,3.4153837262544364]
[null,null,1.9880000000000015,-4.748869163264025,3.374503583364465]
[null,null,1.9920000000000015,-4.832385531904036,3.333305405534073]
[null,null,1.9960000000000016,-4.916096191744037,3.2917974001155166]
[null,null,2.0000000000000013,-5.000000000000027,3.249987774463083]
[null,null,2.0040000000000013,-5.084095807744024,3.207884735930044]
[null,null,2.0080000000000013,-5.168382459904025,3.1654964918691633]
[null,null,2.0120000000000013,-5.2528587952640216,3.1228312496342205]
[null,null,2.0160000000000013,-5.337523646464035,3.0798972165784875]
[null,null,2.0200000000000014,-5.422375840000035,3.0367026000552357]
[null,null,2.0240000000000014,-5.50741419622403,2.993255607417737]
[null,null,2.0280000000000014,-5.592637529344028,2.949564446018755]
[null,null,2.0320000000000014,-5.6780446474240325,2.905637323212577]
[null,null,2.0360000000000014,-5.763634352384031,2.8614824463519675]
[null,null,2.0400000000000014,-5.849405440000032,2.8171080227901975]
[null,null,2.0440000000000014,-5.935356699904027,2.772522259881047]
[null,null,2.0480000000000014,{"$f":"x^4-5*x^3+7*x+5","v":-6.021486915584035},2.727733364976771]
[null,null,{"$f":"C515+dx","v":2.0520000000000014},-6.107794864384031,2.6827495454321664]
[null,null,2.0560000000000014,-6.19427931750403,2.637579008599488]
[null,null,2.0600000000000014,-6.280939040000025,2.5922299618325155]
[null,null,2.0640000000000014,-6.367772790784029,2.546710612483505]
[null,null,2.0680000000000014,-6.454779322624031,2.5010291679077596]
[null,null,2.0720000000000014,-6.541957382144028,2.4551938354565195]
[null,null,2.0760000000000014,-6.629305709824031,2.40921282248458]
[null,null,2.0800000000000014,-6.716823040000033,2.3630943363452133]
[null,null,2.0840000000000014,-6.804508100864025,2.3168465843896584]
[null,null,2.0880000000000014,-6.892359614464034,2.2704777739742354]
[null,null,2.0920000000000014,-6.98037629670403,2.223996112450184]
[null,null,2.0960000000000014,-7.06855685734403,2.1774098071712835]
[null,null,2.1000000000000014,-7.156900000000025,2.130727065491314]
[null,null,2.1040000000000014,-7.245404422144036,2.083956094763547]
[null,null,2.1080000000000014,-7.3340688151040325,2.037105102340238]
[null,null,2.1120000000000014,-7.4228918640640345,1.990182295576183]
[null,null,2.1160000000000014,-7.511872248064032,1.9431958818236374]
[null,null,2.1200000000000014,-7.601008640000025,1.896154068435873]
[null,null,2.1240000000000014,-7.690299706624032,1.8490650627676857]
[null,null,2.1280000000000014,-7.779744108544028,1.8019370721698067]
[null,null,2.1320000000000014,-7.86934050022403,1.754778303998048]
[null,null,2.1360000000000015,-7.959087529984041,1.7075969656046652]
[null,null,2.1400000000000015,-8.048983840000037,1.660401264342422]
[null,null,2.1440000000000015,-8.139028066304032,1.613199407566114]
[null,null,2.1480000000000015,-8.22921883878403,1.565999602626981]
[null,null,2.1520000000000015,-8.319554781184035,1.5188100568803264]
[null,null,2.1560000000000015,-8.41003451110403,1.4716389776778982]
[null,null,2.1600000000000015,-8.50065664000003,1.424494572374492]
[null,null,2.1640000000000015,-8.591419773184036,1.3773850483223633]
[null,null,2.1680000000000015,-8.682322509824035,1.330318612875292]
[null,null,2.1720000000000015,-8.773363442944031,1.2833034733860416]
[null,null,2.1760000000000015,-8.86454115942404,1.2363478372083918]
[null,null,2.1800000000000015,-8.955854240000034,1.1894599116956144]
[null,null,2.1840000000000015,-9.047301259264032,1.142647904200473]
[null,null,2.1880000000000015,-9.138880785664035,1.0959200220777632]
[null,null,2.1920000000000015,-9.23059138150404,1.0492844726792327]
[null,null,2.1960000000000015,-9.322431602944032,1.0027494633586613]
[null,null,2.2000000000000015,-9.414400000000038,0.9563232014693206]
[null,null,2.2040000000000015,-9.506495116544027,0.9100138943649903]
[null,null,2.2080000000000015,-9.598715490304038,0.8638297493984339]
[null,null,2.2120000000000015,-9.69105965286404,0.8177789739234314]
[null,null,2.2160000000000015,-9.783526129664036,0.7718697752927461]
[null,null,2.2200000000000015,-9.87611344000004,0.726110360860158]
[null,null,2.2240000000000015,-9.968820097024034,0.6805089379784306]
[null,null,2.2280000000000015,-10.061644607744036,0.6350737140018516]
[null,null,2.2320000000000015,-10.154585473024033,0.5898128962821687]
[null,null,2.2360000000000015,-10.247641187584037,0.5447346921746856]
[null,null,2.2400000000000015,-10.340810240000032,0.49984730903114993]
[null,null,2.2440000000000015,-10.434091112704037,0.4551589542048333]
[null,null,2.2480000000000016,-10.527482281984035,0.41067783505053157]
[null,null,2.2520000000000016,-10.62098221798404,0.3664121589205003]
[null,null,2.2560000000000016,-10.714589384704036,0.32237013316750307]
[null,null,2.2600000000000016,-10.808302240000039,0.2785599651458277]
[null,null,2.2640000000000016,-10.902119235584037,0.23498986220874585]
[null,null,2.2680000000000016,-10.996038817024033,0.19166803170902114]
[null,null,2.2720000000000016,-11.090059423744034,0.14860268099992524]
[null,null,2.2760000000000016,-11.184179489024032,0.10580201743574591]
[null,null,2.2800000000000016,-11.278397440000031,0.06327424836873874]
[null,null,2.2840000000000016,-11.372711697664034,0.02102758115268344]
[null,null,2.2880000000000016,-11.467120676864042,-0.02092977685914832]
[null,null,2.2920000000000016,-11.561622786304042,-0.0625896183139929]
[null,null,2.2960000000000016,-11.656216428544042,-0.10394373585756256]
[null,null,2.3000000000000016,-11.750900000000033,-0.14498392213709366]
[null,null,2.3040000000000016,{"$f":"x^4-5*x^3+7*x+5","v":-11.845671890944036},-0.1857019697988065]
[null,null,{"$f":"C579+dx","v":2.3080000000000016},-11.940530485504041,-0.22608967149044545]
[null,null,2.3120000000000016,-12.035474161664041,-0.26613881985823085]
[null,null,2.3160000000000016,-12.130501291264046,-0.3058412075478749]
[null,null,2.3200000000000016,-12.22561024000004,-0.3451886272076301]
[null,null,2.3240000000000016,-12.320799367424033,-0.38417287148270063]
[null,null,2.3280000000000016,-12.416067026944045,-0.4227857330213389]
[null,null,2.3320000000000016,-12.511411565824034,-0.4610190044687492]
[null,null,2.3360000000000016,-12.60683132518404,-0.49886447847216786]
[null,null,2.3400000000000016,-12.702324640000043,-0.5363139476793393]
[null,null,2.3440000000000016,-12.797889839104048,-0.5733592047344516]
[null,null,2.3480000000000016,-12.89352524518404,-0.6099920422872813]
[null,null,2.3520000000000016,-12.989229174784043,-0.6462042529825247]
[null,null,2.3560000000000016,-13.084999938304037,-0.681987629466402]
[null,null,2.3600000000000017,-13.180835840000043,-0.7173339643881818]
[null,null,2.3640000000000017,-13.27673517798404,-0.752235050391544]
[null,null,2.3680000000000017,-13.372696244224034,-0.7866826801247413]
[null,null,2.3720000000000017,-13.46871732454403,-0.8206686462350099]
[null,null,2.3760000000000017,-13.564796698624043,-0.8541847413675541]
[null,null,2.3800000000000017,-13.660932640000034,-0.8872227581701182]
[null,null,2.3840000000000017,-13.757123416064037,-0.9197744892894306]
[null,null,2.3880000000000017,-13.853367288064046,-0.9518317273706955]
[null,null,2.3920000000000017,-13.949662511104034,-0.9833862650626735]
[null,null,2.3960000000000017,-14.046007334144036,-1.0144298950110766]
[null,null,2.4000000000000017,-14.142400000000045,-1.0449544098626333]
[null,null,2.4040000000000017,-14.23883874534404,-1.074951602263564]
[null,null,2.4080000000000017,-14.33532180070404,-1.1044132648611047]
[null,null,2.4120000000000017,-14.431847390464046,-1.133331190302492]
[null,null,2.4160000000000017,-14.528413732864038,-1.1616971712334383]
[null,null,2.4200000000000017,-14.625019040000048,-1.1895030003001636]
[null,null,2.4240000000000017,-14.721661517824046,-1.2167404701514286]
[null,null,2.4280000000000017,-14.818339366144034,-1.2434013734324374]
[null,null,2.4320000000000017,-14.915050778624046,-1.2694775027899183]
[null,null,2.4360000000000017,-15.011793942784053,-1.2949606508705997]
[null,null,2.4400000000000017,-15.108567040000047,-1.31984261032121]
[null,null,2.4440000000000017,-15.205368245504047,-1.3441151737894934]
[null,null,2.4480000000000017,-15.302195728384046,-1.3677701339201462]
[null,null,2.4520000000000017,-15.399047651584038,-1.390799283361421]
[null,null,2.4560000000000017,-15.495922171904052,-1.4131944147590296]
[null,null,2.4600000000000017,-15.59281744000004,-1.4349473207612249]
[null,null,2.4640000000000017,-15.68973160038405,-1.4560497940127028]
[null,null,2.4680000000000017,-15.78666279142405,-1.476493627161208]
[null,null,2.4720000000000018,-15.88360914534405,-1.4962706128529604]
[null,null,2.4760000000000018,-15.980568788224044,-1.5153725437362127]
[null,null,2.4800000000000018,-16.077539840000043,-1.533791212455153]
[null,null,2.4840000000000018,-16.174520414464048,-1.5515184116585417]
[null,null,2.4880000000000018,-16.27150861926404,-1.568545933991583]
[null,null,2.4920000000000018,-16.36850255590404,-1.5848655721025295]
[null,null,2.4960000000000018,-16.46550031974404,-1.6004691186360773]
[null,null,2.5000000000000018,-16.562500000000043,-1.6153483662409869]
[null,null,2.504000000000002,-16.65949967974405,-1.6294951075624624]
[null,null,2.508000000000002,-16.756497435904038,-1.6429011352482483]
[null,null,2.512000000000002,-16.853491339264043,-1.6555582419440569]
[null,null,2.516000000000002,-16.950479454464034,-1.6674582202971244]
[null,null,2.520000000000002,-17.047459840000055,-1.6785928629536713]
[null,null,2.524000000000002,-17.144430548224044,-1.6889539625619499]
[null,null,2.528000000000002,-17.24138962534404,-1.6985333117661483]
[null,null,2.532000000000002,-17.338335111424037,-1.707322703214519]
[null,null,2.536000000000002,-17.43526504038405,-1.7153139295548065]
[null,null,2.540000000000002,-17.53217744000005,-1.7224987834306908]
[null,null,2.544000000000002,-17.629070331904046,-1.7288690574919485]
[null,null,2.548000000000002,-17.725941731584037,-1.7344165443827677]
[null,null,2.552000000000002,-17.822789648384045,-1.7391330367508928]
[null,null,2.556000000000002,-17.919612085504045,-1.7430103272445763]
[null,null,2.560000000000002,{"$f":"x^4-5*x^3+7*x+5","v":-18.016407040000043},-1.7460402085080062]
[null,null,{"$f":"C643+dx","v":2.564000000000002},-18.113172502784046,-1.748214473188927]
[null,null,2.568000000000002,-18.20990645862404,-1.7495249139340672]
[null,null,2.572000000000002,-18.30660688614404,-1.7499633233896468]
[null,null,2.576000000000002,-18.403271757824033,-1.7495214942034103]
[null,null,2.580000000000002,-18.499899040000056,-1.74819121902107]
[null,null,2.584000000000002,-18.596486692864044,-1.7459642904893542]
[null,null,2.588000000000002,-18.693032670464042,-1.7428325012565153]
[null,null,2.592000000000002,-18.789534920704064,-1.7387876439662335]
[null,null,2.596000000000002,-18.88599138534405,-1.7338215112677773]
[null,null,2.600000000000002,-18.982400000000037,-1.7279258958068588]
[null,null,2.604000000000002,-19.078758694144046,-1.7210925902307146]
[null,null,2.608000000000002,-19.17506539110404,-1.7133133871850568]
[null,null,2.612000000000002,-19.27131800806405,-1.7045800793171217]
[null,null,2.616000000000002,-19.367514456064058,-1.6948844592736378]
[null,null,2.620000000000002,-19.46365264000006,-1.6842183197018414]
[null,null,2.624000000000002,-19.55973045862405,-1.6725734532469367]
[null,null,2.628000000000002,-19.655745804544033,-1.6599416525576842]
[null,null,2.632000000000002,-19.751696564224034,-1.64631471027878]
[null,null,2.636000000000002,-19.84758061798405,-1.6316844190579687]
[null,null,2.640000000000002,-19.943395840000047,-1.6160425715409623]
[null,null,2.644000000000002,-20.039140098304042,-1.5993809603770295]
[null,null,2.648000000000002,-20.134811254784044,-1.5816913782093422]
[null,null,2.652000000000002,-20.230407165184047,-1.5629656176871691]
[null,null,2.656000000000002,-20.325925679104046,-1.5431954714557143]
[null,null,2.660000000000002,-20.421364640000043,-1.5223727321627223]
[null,null,2.664000000000002,-20.516721885184044,-1.5004891924549213]
[null,null,2.668000000000002,-20.611995245824044,-1.4775366449770075]
[null,null,2.672000000000002,-20.707182546944054,-1.4535068823792656]
[null,null,2.676000000000002,-20.80228160742405,-1.4283916973043596]
[null,null,2.680000000000002,-20.897290240000032,-1.4021828824015579]
[null,null,2.684000000000002,-20.992206251264047,-1.3748722303175889]
[null,null,2.688000000000002,-21.087027441664045,-1.3464515336976568]
[null,null,2.692000000000002,-21.18175160550404,-1.316912585189506]
[null,null,2.696000000000002,-21.276376530944034,-1.286247177439357]
[null,null,2.700000000000002,-21.37090000000005,-1.2544471030954618]
[null,null,2.704000000000002,-21.465319788544054,-1.2215041548009928]
[null,null,2.708000000000002,-21.559633666304034,-1.1874101252062346]
[null,null,2.712000000000002,-21.653839396864047,-1.1521568069563912]
[null,null,2.716000000000002,-21.747934737664053,-1.1157359926981911]
[null,null,2.720000000000002,-21.841917440000046,-1.0781394750788706]
[null,null,2.724000000000002,-21.935785249024036,-1.039359046742618]
[null,null,2.728000000000002,-22.02953590374405,-0.9993865003397175]
[null,null,2.732000000000002,-22.123167137024037,-0.9582136285153737]
[null,null,2.736000000000002,-22.216676675584047,-0.9158322239158068]
[null,null,2.740000000000002,-22.31006224000005,-0.872234079187745]
[null,null,2.744000000000002,-22.403321544704056,-0.8274109869774087]
[null,null,2.748000000000002,-22.496452297984046,-0.7813547399350824]
[null,null,2.752000000000002,-22.589452201984034,-0.7340571307024142]
[null,null,2.756000000000002,-22.682318952704044,-0.6855099519281644]
[null,null,2.760000000000002,-22.775050240000056,-0.6357049962605856]
[null,null,2.764000000000002,-22.867643747584054,-0.5846340563438659]
[null,null,2.768000000000002,-22.960097153024055,-0.5322889248267657]
[null,null,2.772000000000002,-23.05240812774404,-0.4786613943534732]
[null,null,2.776000000000002,-23.144574337024043,-0.4237432575732569]
[null,null,2.780000000000002,-23.236593440000043,-0.3675263071318291]
[null,null,2.784000000000002,-23.32846308966404,-0.31000233567541]
[null,null,2.788000000000002,-23.42018093286405,-0.25116313585225214]
[null,null,2.792000000000002,-23.511744610304046,-0.1910005003055275]
[null,null,2.796000000000002,-23.603151756544047,-0.12950622168704484]
[null,null,2.800000000000002,-23.69440000000005,-0.06667209263845209]
[null,null,2.804000000000002,-23.78548696294405,-2.4899058100338323E-3]
[null,null,2.808000000000002,-23.87641026150405,0.06304854615351374]
[null,null,2.812000000000002,-23.967167505664055,0.1299514706039382]
[null,null,2.816000000000002,{"$f":"x^4-5*x^3+7*x+5","v":-24.057756299264053},0.19822707489654334]
[null,null,{"$f":"C707+dx","v":2.820000000000002},-24.14817424000004,0.2678835663820607]
[null,null,2.824000000000002,-24.238418919424042,0.33892915241731814]
[null,null,2.828000000000002,-24.328487922944035,0.41137204035101504]
[null,null,2.832000000000002,-24.418378829824047,0.4852204375420115]
[null,null,2.836000000000002,-24.50808921318404,0.5604825513379907]
[null,null,2.840000000000002,-24.597616640000037,0.6371665890967968]
[null,null,2.844000000000002,-24.68695867110405,0.7152807581681451]
[null,null,2.848000000000002,-24.776112861184053,0.7948332659078474]
[null,null,2.852000000000002,-24.865076758784042,0.8758323196686675]
[null,null,2.856000000000002,-24.953847906304052,0.9582861268028608]
[null,null,2.860000000000002,-25.04242384000005,1.0422028946662394]
[null,null,2.864000000000002,-25.130802089984044,1.1275908306085185]
[null,null,2.868000000000002,-25.218980180224044,1.21445814198551]
[null,null,2.872000000000002,-25.306955628544046,1.3028130361499777]
[null,null,2.876000000000002,-25.394725946624053,1.392663720455701]
[null,null,2.880000000000002,-25.482288640000032,1.4840184022544278]
[null,null,2.884000000000002,-25.56964120806404,1.5768852889014617]
[null,null,2.888000000000002,-25.65678114406405,1.6712725877475343]
[null,null,2.892000000000002,-25.743705935104046,1.7671885061494734]
[null,null,2.896000000000002,-25.830413062144036,1.8646412514580106]
[null,null,2.900000000000002,-25.916900000000037,1.9636390310269256]
[null,null,2.904000000000002,-26.00316421734404,2.064190052209998]
[null,null,2.908000000000002,-26.08920317670404,2.1663025223589756]
[null,null,2.912000000000002,-26.175014334464038,2.269984648830686]
[null,null,2.916000000000002,-26.260595140864034,2.375244638974337]
[null,null,2.920000000000002,-26.345943040000048,2.48209070014574]
[null,null,2.924000000000002,-26.43105546982405,2.590531039698167]
[null,null,2.928000000000002,-26.51592986214404,2.7005738649833653]
[null,null,2.932000000000002,-26.60056364262404,2.812227383356131]
[null,null,2.936000000000002,-26.68495423078405,2.9254998021697354]
[null,null,2.940000000000002,-26.769099040000025,3.0403993287764344]
[null,null,2.944000000000002,-26.85299547750404,3.1569341705289915]
[null,null,2.948000000000002,-26.936640944384045,3.2751125347832186]
[null,null,2.952000000000002,-27.02003283558406,3.3949426288913713]
[null,null,2.956000000000002,-27.10316853990407,3.5164326602067213]
[null,null,2.960000000000002,-27.186045440000044,3.63959083608]
[null,null,2.964000000000002,-27.26866091238402,3.7644253638680354]
[null,null,2.968000000000002,-27.35101232742403,3.890944450924607]
[null,null,2.972000000000002,-27.433097049344056,4.019156304598923]
[null,null,2.976000000000002,-27.514912436224044,4.149069132247302]
[null,null,2.980000000000002,-27.596455840000047,4.2806911412235245]
[null,null,2.984000000000002,-27.67772460646404,4.414030538878322]
[null,null,2.988000000000002,-27.75871607526406,4.549095532568014]
[null,null,2.992000000000002,-27.839427579904054,4.685894329641808]
[null,null,2.996000000000002,-27.91985644774403,4.824435137459073]
[null,null,3.000000000000002,-28.000000000000043,4.964726163367999]
[null,null,3.0040000000000022,-28.079855551744032,5.106775614722874]
[null,null,3.0080000000000022,-28.15942041190405,5.250591698878495]
[null,null,3.0120000000000022,-28.23869188326404,5.396182623188132]
[null,null,3.0160000000000022,-28.317667262464035,5.543556595002009]
[null,null,3.0200000000000022,-28.396343840000043,5.692721821677463]
[null,null,3.0240000000000022,-28.474718900224048,5.84368651056624]
[null,null,3.0280000000000022,-28.552789721344055,5.9964588690211045]
[null,null,3.0320000000000022,-28.63055357542403,6.151047104395328]
[null,null,3.0360000000000023,-28.70800772838404,6.3074594240431985]
[null,null,3.0400000000000023,-28.785149440000026,6.465704035317479]
[null,null,3.0440000000000023,-28.861975963904037,6.625789145571442]
[null,null,3.0480000000000023,-28.93848454758404,6.787722962158359]
[null,null,3.0520000000000023,-29.014672432384046,6.951513692430485]
[null,null,3.0560000000000023,-29.09053685350404,7.117169543744648]
[null,null,3.0600000000000023,-29.166075040000067,7.284698723449548]
[null,null,3.0640000000000023,-29.241284214784066,7.454109438902012]
[null,null,3.0680000000000023,-29.31616159462405,7.625409897454297]
[null,null,3.0720000000000023,{"$f":"x^4-5*x^3+7*x+5","v":-29.390704390144023},7.798608306457641]
[null,null,{"$f":"C771+dx","v":3.0760000000000023},-29.464909805824057,7.973712873268873]
[null,null,3.0800000000000023,-29.538775040000047,8.15073180523974]
[null,null,3.0840000000000023,-29.61229728486405,8.32967330972199]
[null,null,3.0880000000000023,-29.68547372646404,8.510545594071942]
[null,null,3.0920000000000023,-29.758301544704054,8.693356865640329]
[null,null,3.0960000000000023,-29.830777913344036,8.878115331781945]
[null,null,3.1000000000000023,-29.902900000000045,9.064829199849555]
[null,null,3.1040000000000023,-29.974664966144026,9.253506677195414]
[null,null,3.1080000000000023,-30.046069967104046,9.444155971176858]
[null,null,3.1120000000000023,-30.11711215206404,9.63678528914157]
[null,null,3.1160000000000023,-30.187788664064044,9.831402838445872]
[null,null,3.1200000000000023,-30.258096640000034,10.028016826443032]
[null,null,3.1240000000000023,-30.328033210624035,10.226635460486833]
[null,null,3.1280000000000023,-30.397595500544043,10.427266947929528]
[null,null,3.1320000000000023,-30.46678062822403,10.629919496125407]
[null,null,3.1360000000000023,-30.535585705984033,10.834601312426216]
[null,null,3.1400000000000023,-30.60400784000005,11.041320604185227]
[null,null,3.1440000000000023,-30.67204413030405,11.25008557875876]
[null,null,3.1480000000000024,-30.73969167078404,11.460904443497547]
[null,null,3.1520000000000024,-30.806947549184017,11.673785405753335]
[null,null,3.1560000000000024,-30.87380884710406,11.888736672884985]
[null,null,3.1600000000000024,-30.940272640000032,12.105766452238147]
[null,null,3.1640000000000024,-31.00633599718403,12.324882951174729]
[null,null,3.1680000000000024,-31.071995981824045,12.546094377041907]
[null,null,3.1720000000000024,-31.13724965094405,12.769408937193969]
[null,null,3.1760000000000024,-31.20209405542404,12.994834838984694]
[null,null,3.1800000000000024,-31.266526240000047,13.222380289769387]
[null,null,3.1840000000000024,-31.330543243264025,13.45205349689827]
[null,null,3.1880000000000024,-31.39414209766403,13.683862667726139]
[null,null,3.1920000000000024,-31.457319829504037,13.917816009607282]
[null,null,3.1960000000000024,-31.52007345894404,14.15392172989294]
[null,null,3.2000000000000024,-31.58240000000005,14.392188035938922]
[null,null,3.2040000000000024,-31.644296460544048,14.632623135093421]
[null,null,3.2080000000000024,-31.705759842304047,14.875235234717838]
[null,null,3.2120000000000024,-31.766787140864032,15.120032542157823]
[null,null,3.2160000000000024,-31.827375345664052,15.367023264770204]
[null,null,3.2200000000000024,-31.88752144000003,15.61621560990876]
[null,null,3.2240000000000024,-31.947222401024064,15.86761778492524]
[null,null,3.2280000000000024,-32.00647519974403,16.121237997175456]
[null,null,3.2320000000000024,-32.06527680102405,16.377084454010646]
[null,null,3.2360000000000024,-32.123624163584026,16.63516536278205]
[null,null,3.2400000000000024,-32.181514240000055,16.895488930846497]
[null,null,3.2440000000000024,-32.23894397670402,17.158063365557258]
[null,null,3.2480000000000024,-32.29591031398404,17.422896874267604]
[null,null,3.2520000000000024,-32.352410185984034,17.689997664324203]
[null,null,3.2560000000000024,-32.40844052070406,17.959373943091503]
[null,null,3.2600000000000025,-32.46399824000004,18.23103391791668]
[null,null,3.2640000000000025,-32.51908025958406,18.504985796152496]
[null,null,3.2680000000000025,-32.573683489024035,18.781237785150193]
[null,null,3.2720000000000025,-32.62780483174402,19.059798092271933]
[null,null,3.2760000000000025,-32.681441185024056,19.34067492486235]
[null,null,3.2800000000000025,-32.73458944000001,19.62387649027903]
[null,null,3.2840000000000025,-32.78724648166404,19.90941099587068]
[null,null,3.2880000000000025,-32.83940918886404,20.197286648997423]
[null,null,3.2920000000000025,-32.89107443430401,20.487511657010252]
[null,null,3.2960000000000025,-32.94223908454404,20.780094227258623]
[null,null,3.3000000000000025,-32.99290000000003,21.07504256709733]
[null,null,3.3040000000000025,-33.04305403494406,21.372364883883463]
[null,null,3.3080000000000025,-33.092698037504036,21.672069384967493]
[null,null,3.3120000000000025,-33.141828849664016,21.97416427770193]
[null,null,3.3160000000000025,-33.19044330726405,22.278657769441573]
[null,null,3.3200000000000025,-33.23853824000002,22.58555806754045]
[null,null,3.3240000000000025,-33.28611047142401,22.89487337935057]
[null,null,3.3280000000000025,{"$f":"x^4-5*x^3+7*x+5","v":-33.33315681894402},23.206611912222407]
[null,null,{"$f":"C835+dx","v":3.3320000000000025},-33.37967409382404,23.520781873517866]
[null,null,3.3360000000000025,-33.425659101184024,23.837391470577778]
[null,null,3.3400000000000025,-33.47110864000002,24.156448910767857]
[null,null,3.3440000000000025,-33.51601950310402,24.477962401434517]
[null,null,3.3480000000000025,-33.560388477184034,24.80194014992849]
[null,null,3.3520000000000025,-33.604212342784024,25.128390363610922]
[null,null,3.3560000000000025,-33.64748787430405,25.457321249833818]
[null,null,3.3600000000000025,-33.690211839999996,25.78874101594257]
[null,null,3.3640000000000025,-33.73238100198405,26.12265786929807]
[null,null,3.3680000000000025,-33.77399211622401,26.459080017252326]
[null,null,3.3720000000000026,-33.815041932544034,26.798015667154793]
[null,null,3.3760000000000026,-33.85552719462403,27.13947302636611]
[null,null,3.3800000000000026,-33.89544464000003,27.483460302230917]
[null,null,3.3840000000000026,-33.934791000063996,27.829985702112385]
[null,null,3.3880000000000026,-33.97356300006403,28.17905743335033]
[null,null,3.3920000000000026,-34.01175735910404,28.53068370331453]
[null,null,3.3960000000000026,-34.049370790144025,28.88487271933946]
[null,null,3.4000000000000026,-34.08640000000002,29.241632688797445]
[null,null,3.4040000000000026,-34.12284168934404,29.600971819029816]
[null,null,3.4080000000000026,-34.158692552704025,29.962898317393147]
[null,null,3.4120000000000026,-34.19394927846406,30.327420391240203]
[null,null,3.4160000000000026,-34.22860854886402,30.694546247924]
[null,null,3.4200000000000026,-34.262667040000004,31.06428409480467]
[null,null,3.4240000000000026,-34.29612142182401,31.43664213922151]
[null,null,3.4280000000000026,-34.32896835814403,31.811628588541513]
[null,null,3.4320000000000026,-34.36120450662402,32.18925165010855]
[null,null,3.4360000000000026,-34.392826518784005,32.569519531280214]
[null,null,3.4400000000000026,-34.42383104000003,32.95244043941104]
[null,null,3.4440000000000026,-34.454214709504,33.33802258185177]
[null,null,3.4480000000000026,-34.483974160384015,33.72627416595744]
[null,null,3.4520000000000026,-34.513106019584,34.117203399078285]
[null,null,3.4560000000000026,-34.54160690790401,34.51081848857087]
[null,null,3.4600000000000026,-34.56947344000003,34.907127641789494]
[null,null,3.4640000000000026,-34.59670222438399,35.30613906608132]
[null,null,3.4680000000000026,-34.62328986342404,35.707860968805214]
[null,null,3.4720000000000026,-34.649232953344,36.11230155731902]
[null,null,3.4760000000000026,-34.67452808422402,36.51946903895722]
[null,null,3.4800000000000026,-34.69917184000002,36.929371621097964]
[null,null,3.4840000000000027,-34.72316079846401,37.34201751107573]
[null,null,3.4880000000000027,-34.74649153126399,37.757414916250916]
[null,null,3.4920000000000027,-34.76916060390403,38.17557204398084]
[null,null,3.4960000000000027,-34.79116457574402,38.59649710161218]
[null,null,3.5000000000000027,-34.812500000000014,39.020198296499224]
[null,null,3.5040000000000027,-34.833163423744,39.44668383599727]
[null,null,3.5080000000000027,-34.853151387904,39.87596192745705]
[null,null,3.5120000000000027,-34.872460427264016,40.308040778240986]
[null,null,3.5160000000000027,-34.89108707046404,40.74292859568812]
[null,null,3.5200000000000027,-34.90902783999999,41.180633587161374]
[null,null,3.5240000000000027,-34.926279252224006,41.621163960013014]
[null,null,3.5280000000000027,-34.94283781734402,42.064527921590205]
[null,null,3.5320000000000027,-34.95870003942403,42.51073367925384]
[null,null,3.5360000000000027,-34.973862416383994,42.95978944035161]
[null,null,3.5400000000000027,-34.988321440000036,43.41170341224643]
[null,null,3.5440000000000027,-35.002073595903994,43.866483802279895]
[null,null,3.5480000000000027,-35.01511536358401,44.32413881781289]
[null,null,3.5520000000000027,-35.027443216383986,44.78467666618955]
[null,null,3.5560000000000027,-35.039053621504,45.24810555477533]
[null,null,3.5600000000000027,-35.04994303999999,45.71443369091893]
[null,null,3.5640000000000027,-35.06010792678403,46.18366928196449]
[null,null,3.5680000000000027,-35.069544730623996,46.655820535279496]
[null,null,3.5720000000000027,-35.07824989414402,47.13089565821061]
[null,null,3.5760000000000027,-35.08621985382404,47.6089028581162]
[null,null,3.5800000000000027,-35.093451040000005,48.089850342337336]
[null,null,3.5840000000000027,{"$f":"x^4-5*x^3+7*x+5","v":-35.099939876864},48.5737463182349]
[null,null,{"$f":"C899+dx","v":3.5880000000000027},-35.10568278246401,49.060598993165236]
[null,null,3.5920000000000027,-35.11067616870399,49.55041657448515]
[null,null,3.5960000000000027,-35.114916441343986,50.04320726953116]
[null,null,3.6000000000000028,-35.11840000000004,50.538979285668724]
[null,null,3.6040000000000028,-35.12112323814402,51.03774083025264]
[null,null,3.6080000000000028,-35.12308254310402,51.53950011063517]
[null,null,3.6120000000000028,-35.124274296064016,52.044265334162965]
[null,null,3.6160000000000028,-35.12469487206399,52.552044708194906]
[null,null,3.6200000000000028,-35.12434064,53.062846440080186]
[null,null,3.6240000000000028,-35.12320796262398,53.57667873718173]
[null,null,3.628000000000003,-35.121293196544,54.093549806841644]
[null,null,3.632000000000003,-35.118592692224,54.613467856421316]
[null,null,3.636000000000003,-35.115102793984,55.13644109326132]
[null,null,3.640000000000003,-35.110819840000005,55.6624777247383]
[null,null,3.644000000000003,-35.105740162303974,56.19158595817911]
[null,null,3.648000000000003,-35.099860086784005,56.7237740009548]
[null,null,3.652000000000003,-35.093175933184,57.259050060415085]
[null,null,3.656000000000003,-35.085684015103986,57.79742234391324]
[null,null,3.660000000000003,-35.07738063999996,58.33889905879288]
[null,null,3.664000000000003,-35.06826210918399,58.88348841241592]
[null,null,3.668000000000003,-35.05832471782401,59.43119861214731]
[null,null,3.672000000000003,-35.04756475494402,59.98203786531035]
[null,null,3.676000000000003,-35.035978503424,60.53601437929134]
[null,null,3.680000000000003,-35.02356223999996,61.09313636141255]
[null,null,3.684000000000003,-35.01031223526399,61.65341201906231]
[null,null,3.688000000000003,-34.99622475366401,62.216849559559854]
[null,null,3.692000000000003,-34.981296053503996,62.7834571902803]
[null,null,3.696000000000003,-34.965522386943995,63.35324311856727]
[null,null,3.700000000000003,-34.94890000000002,63.926215551778604]
[null,null,3.704000000000003,-34.931425132543986,64.502382697263]
[null,null,3.708000000000003,-34.91309401830398,65.08175276238035]
[null,null,3.712000000000003,-34.89390288486398,65.66433395447628]
[null,null,3.716000000000003,-34.87384795366399,66.25013448090965]
[null,null,3.720000000000003,-34.85292543999998,66.83916254903325]
[null,null,3.724000000000003,-34.83113155302399,67.43142636619271]
[null,null,3.728000000000003,-34.80846249574397,68.02693413975706]
[null,null,3.732000000000003,-34.784914465023945,68.6256940770689]
[null,null,3.736000000000003,-34.760483651583996,69.227714385481]
[null,null,3.740000000000003,-34.73516624000003,69.83300327234103]
[null,null,3.744000000000003,-34.708958408704014,70.44156894502412]
[null,null,3.748000000000003,-34.68185632998399,71.05341961086066]
[null,null,3.752000000000003,-34.65385616998394,71.66856347721868]
[null,null,3.756000000000003,-34.62495408870403,72.28700875143569]
[null,null,3.760000000000003,-34.59514623999996,72.9087636408868]
[null,null,3.764000000000003,-34.56442877158397,73.53383635290346]
[null,null,3.768000000000003,-34.53279782502402,74.16223509485569]
[null,null,3.772000000000003,-34.50024953574396,74.79396807408608]
[null,null,3.776000000000003,-34.46678003302401,75.42904349795454]
[null,null,3.780000000000003,-34.432385439999976,76.06746957380669]
[null,null,3.784000000000003,-34.39706187366401,76.70925450900546]
[null,null,3.788000000000003,-34.360805444863956,77.35440651090262]
[null,null,3.792000000000003,-34.323612258303925,78.00293378683973]
[null,null,3.796000000000003,-34.28547841254395,78.65484454419192]
[null,null,3.800000000000003,-34.246399999999966,79.31014699028249]
[null,null,3.804000000000003,-34.20637310694399,79.9688493324896]
[null,null,3.808000000000003,-34.165393813504,80.6309597781599]
[null,null,3.812000000000003,-34.12345819366397,81.29648653465331]
[null,null,3.816000000000003,-34.08056231526396,81.96543780929919]
[null,null,3.820000000000003,-34.03670223999997,82.63782180947672]
[null,null,3.824000000000003,-33.991874023423954,83.31364674252141]
[null,null,3.828000000000003,-33.94607371494391,83.99292081580329]
[null,null,3.832000000000003,-33.89929735782399,84.67565223666494]
[null,null,3.836000000000003,-33.85154098918396,85.36184921246222]
[null,null,3.840000000000003,{"$f":"x^4-5*x^3+7*x+5","v":-33.80280063999999},86.0515199505448]
[null,null,{"$f":"C963+dx","v":3.844000000000003},-33.753072335103944,86.74467265827155]
[null,null,3.848000000000003,-33.70235209318399,87.4413155429851]
[null,null,3.852000000000003,-33.65063592678394,88.14145681206358]
[null,null,3.856000000000003,-33.59791984230401,88.84510467283133]
[null,null,3.860000000000003,-33.54419983999996,89.55226733265532]
[null,null,3.864000000000003,-33.48947191398396,90.26295299888832]
[null,null,3.868000000000003,-33.433732052223974,90.97716987887803]
[null,null,3.872000000000003,-33.376976236543975,91.69492617999954]
[null,null,3.876000000000003,-33.31920044262391,92.41623010957514]
[null,null,3.880000000000003,-33.26040063999994,93.14108987496878]
[null,null,3.884000000000003,-33.20057279206398,93.86951368354643]
[null,null,3.888000000000003,-33.13971285606392,94.60150974265474]
[null,null,3.892000000000003,-33.07781678310398,95.3370862596333]
[null,null,3.896000000000003,-33.01488051814394,96.07625144185211]
[null,null,3.900000000000003,-32.95089999999995,96.81901349665785]
[null,null,3.904000000000003,-32.88587116134393,97.56538063140735]
[null,null,3.908000000000003,-32.819789928703955,98.3153610534422]
[null,null,3.912000000000003,-32.752652222463944,99.06896297013955]
[null,null,3.916000000000003,-32.68445395686395,99.82619458883794]
[null,null,3.920000000000003,-32.61519103999993,100.58706411687996]
[null,null,3.924000000000003,-32.544859373823954,101.35157976163057]
[null,null,3.928000000000003,-32.47345485414395,102.11974973044661]
[null,null,3.932000000000003,-32.40097337062392,102.89158223067678]
[null,null,3.936000000000003,-32.327410806783945,103.66708546967789]
[null,null,3.940000000000003,-32.25276303999993,104.44626765479255]
[null,null,3.944000000000003,-32.17702594150394,105.22913699339588]
[null,null,3.948000000000003,-32.10019537638394,106.01570169280407]
[null,null,3.952000000000003,-32.02226720358396,106.80596996041459]
[null,null,3.956000000000003,-31.94323727590391,107.59995000354361]
[null,null,3.960000000000003,-31.86310143999996,108.39765002957643]
[null,null,3.964000000000003,-31.781855536383944,109.19907824583531]
[null,null,3.968000000000003,-31.699495399423924,110.00424285969945]
[null,null,3.972000000000003,-31.616016857343915,110.81315207850128]
[null,null,3.976000000000003,-31.531415732223877,111.62581410961185]
[null,null,3.980000000000003,-31.44568783999994,112.44223716037988]
[null,null,3.984000000000003,-31.358828990463948,113.26242943813779]
[null,null,3.988000000000003,-31.270834987263896,114.08639915027696]
[null,null,3.992000000000003,-31.181701627903948,114.91415450412171,null,null,"Plotting for Fixed Window",{"$nulls":14},"Plotting for Variable Window"]
[null,null,3.996000000000003,-31.091424703743925,114.91415450412171]
[null,null,4.000000000000003,-30.99999999999993,115.914154504122]
[null,null,{"$f":"xx0","v":{"v":1.68,"d":"1.6800"}},1.0177817600000019,115.74570370702887,{"$nulls":6},"Calculation Points for table",{"$nulls":14},"Second, blank if beyond nn"]
[null,null,{"v":-0.3855069930069931,"d":"-0.3855"},2.609999503541798,116.58105496635729,null,null,"x","y","slope","next x","x","y","#",{"$nulls":8},"x","y","slope","next x",null,null,"#"]
[null,null,{"v":7.177475948905688,"d":"7.1775"},860.3771428395904,{"$nulls":24},0]
[null,null,{"v":7.184468955898694,"d":"7.1845"},865.3749848406367,3.40256899246614,null,"x0",{"$f":"xx0","v":1.68},0,null,null,{"$f":"xx0","v":1.68},0,{"$nulls":8},"x0",{"$f":"x0","v":3.152},0,null,null,{"$f":"xx0","v":1.68},0]
[null,null,{"v":5.654581899955723,"d":"5.6546"},162.93131739696176,null,null,"x0",{"$f":"H1007","v":{"v":1.68,"d":"1.680"}},{"$f":"LOOKUP(H1007,C$3:C$1006,D$3:D$1006)","v":{"v":1.0831272885759784,"d":"1.083"}},{"$f":"LOOKUP(H1008,C$3:C$1006,E$3:E$1006)","v":{"v":4.959066509313768,"d":"4.959"}},{"$f":"H1008-I1008/J1008","v":{"v":1.4615864565353731,"d":"1.462"}},{"$f":"L1007","v":1.68},{"$f":"I1008","v":1.0831272885759784},{"$nulls":8},"x0",{"$f":"W1007","v":3.152},{"$f":"LOOKUP(W1007+0.001,C$1040:C$1293,D$1040:D$1291)","v":-30.806947549184017},{"$f":"LOOKUP(W1008,C$1040:C$1293,F$1040:F$1291)","v":-35.98309251020746},{"$f":"W1008-X1008/Y1008","v":2.2958493636853228},{"$f":"AA1007","v":1.68},{"$f":"X1008","v":-30.806947549184017},1]
[null,null,{"v":5.661574906948729,"d":"5.6616"},164.68893955121615,1022.0896227735393,null,"x1",{"$f":"$H1008-$I1008/$J1008","v":{"v":1.4615864565353731,"d":"1.462"}},{"v":0,"d":"0.000"},null,null,{"$f":"$H1008-$I1008/$J1008","v":{"v":1.4615864565353731,"d":"1.462"}},0,{"$nulls":8},"x1",{"$f":"IF(AND(Z1008>=xMin,Z1008<=xMax),Z1008,W1008)","v":{"v":2.2958493636853228,"d":"2.2958"}},0,null,null,{"$f":"W1009","v":{"v":2.2958493636853228,"d":"2.2958"}},0]
[null,null,{"v":4.55761912234586,"d":"4.5576"},-4.977028609076605,null,null,"x1",{"$f":"H1009","v":{"v":1.4615864565353731,"d":"1.462"}},{"$f":"LOOKUP(H1009,C$3:C$1006,D$3:D$1006)","v":{"v":4.203038559999987,"d":"4.203"}},{"$f":"LOOKUP(H1010,C$3:C$1006,E$3:E$1006)","v":{"v":2.875024579313731,"d":"2.875"}},{"$f":"H1010-I1010/J1010","v":{"v":-3.2750073703846638E-4,"d":"-0.000"}},{"$f":"IF(N1010<=nn,L1009,\"\")","v":{"v":1.4615864565353731,"d":"1.462"}},{"$f":"IF(N1010<=nn,I1010,\"\")","v":4.203038559999987},1,{"$nulls":3},{"$f":"IF(AND(OR('Fixed Window'!K25<xMin,'Fixed Window'!K25>xMax),(N1010<=nn)),\"Outside the interval\",\"\")","v":""},{"$nulls":3},"x1",{"$f":"W1009","v":{"v":2.2958493636853228,"d":"2.2958"}},{"$f":"LOOKUP(W1009+0.001,C$1040:C$1293,D$1040:D$1291)","v":-11.467120676864042},{"$f":"LOOKUP(W1010,C$1040:C$1293,F$1040:F$1291)","v":-62.70683128793555},{"$f":"W1010-X1010/Y1010","v":2.11298060056429},{"$f":"IF(AC1010<=nn,AA1009,\"\")","v":2.2958493636853228},{"$f":"IF(AC1010<=nn,X1010,\"\")","v":-11.467120676864042},2]
[null,null,{"v":4.564612129338867,"d":"4.5646"},-4.456068942800272,441.4230998271237,null,"x2",{"$f":"$H1010-$I1010/$J1010","v":{"v":-3.2750073703846638E-4,"d":"-0.000"}},{"v":0,"d":"0.000"},null,null,{"$f":"H1010-I1010/J1010","v":{"v":-3.2750073703846638E-4,"d":"-0.000"}},{"$f":"IF(AND(N1008<=nn,I1011<>\"\"),0,\"\")","v":0},{"$nulls":4},{"$f":"IF(AND(OR('Fixed Window'!K26<xMin,'Fixed Window'!K26>xMax),(N1011<=nn)),\"Outside the interval\",\"\")","v":"Outside the interval"},{"$nulls":3},"x2",{"$f":"IF(AND(Z1010>=xMin,Z1010<=xMax),Z1010,W1010)","v":{"v":2.11298060056429,"d":"2.1130"}},0,null,null,{"$f":"IF(AC1010<=nn,W1011,\"\")","v":{"v":2.11298060056429,"d":"2.1130"}},{"$f":"IF(AND(AC1008<=nn,X1011<>\"\"),0,\"\")","v":0}]
[null,null,{"v":3.816444665165288,"d":"3.8164"},-34.07573426083435,null,null,"x2",{"$f":"H1011","v":{"v":-3.2750073703846638E-4,"d":"-0.000"}},{"$f":"LOOKUP(H1011,C$3:C$1006,D$3:D$1006)","v":{"$error":"#N/A"}},{"$f":"LOOKUP(H1012,C$3:C$1006,E$3:E$1006)","v":{"$error":"#N/A"}},{"$f":"H1012-I1012/J1012","v":{"$error":"#N/A"}},{"$f":"IF(N1012<=nn,L1011,\"\")","v":{"v":-3.2750073703846638E-4,"d":"-0.000"}},{"$f":"IF(N1012<=nn,I1012,\"\")","v":{"$error":"#N/A"}},2,{"$nulls":3},{"$f":"IF(AND(OR('Fixed Window'!K27<xMin,'Fixed Window'!K27>xMax),(N1012<=nn)),\"Outside the interval\",\"\")","v":{"$error":"#N/A"}},{"$nulls":3},"x2",{"$f":"W1011","v":{"v":2.11298060056429,"d":"2.1130"}},{"$f":"LOOKUP(W1011+0.001,C$1040:C$1293,D$1040:D$1291)","v":-7.4228918640640345},{"$f":"LOOKUP(W1012,C$1040:C$1293,F$1040:F$1291)","v":-69.34747198129354},{"$f":"W1012-X1012/Y1012","v":2.0059414879335318},{"$f":"IF(AC1012<=nn,AA1011,\"\")","v":2.11298060056429},{"$f":"IF(AC1012<=nn,X1012,\"\")","v":-7.4228918640640345},3]
[null,null,{"v":3.823437672158295,"d":"3.8234"},-33.99823469461965,197.319911242407,null,"x3",{"$f":"$H1012-$I1012/$J1012","v":{"$error":"#N/A"}},{"v":0,"d":"0.000"},null,null,{"$f":"H1012-I1012/J1012","v":{"$error":"#N/A"}},{"$f":"IF(AND(N1010<=nn,I1013<>\"\"),0,\"\")","v":0},{"$nulls":4},{"$f":"IF(AND(OR('Fixed Window'!K28<xMin,'Fixed Window'!K28>xMax),(N1013<=nn)),\"Outside the interval\",\"\")","v":{"$error":"#N/A"}},{"$nulls":3},"x3",{"$f":"IF(AND(Z1012>=xMin,Z1012<=xMax),Z1012,W1012)","v":{"v":2.0059414879335318,"d":"2.0059"}},0,null,null,{"$f":"IF(AC1012<=nn,W1013,\"\")","v":{"v":2.0059414879335318,"d":"2.0059"}},{"$f":"IF(AND(AC1010<=nn,X1013<>\"\"),0,\"\")","v":0}]
[null,null,{"v":3.3976868006717,"d":"3.3977"},-34.06505744142709,null,null,"x3",{"$f":"H1013","v":{"$error":"#N/A"}},{"$f":"LOOKUP(H1013,C$3:C$1006,D$3:D$1006)","v":{"$error":"#N/A"}},{"$f":"LOOKUP(H1014,C$3:C$1006,E$3:E$1006)","v":{"$error":"#N/A"}},{"$f":"H1014-I1014/J1014","v":{"$error":"#N/A"}},{"$f":"IF(N1014<=nn,L1013,\"\")","v":{"$error":"#N/A"}},{"$f":"IF(N1014<=nn,I1014,\"\")","v":{"$error":"#N/A"}},3,{"$nulls":3},{"$f":"IF(AND(OR('Fixed Window'!K29<xMin,'Fixed Window'!K29>xMax),(N1014<=nn)),\"Outside the interval\",\"\")","v":"Outside the interval"},{"$nulls":3},"x3",{"$f":"W1013","v":{"v":2.0059414879335318,"d":"2.0059"}},{"$f":"LOOKUP(W1013+0.001,C$1040:C$1293,D$1040:D$1291)","v":-5.000000000000027},{"$f":"LOOKUP(W1014,C$1040:C$1293,F$1040:F$1291)","v":-73.78140911365139},{"$f":"W1014-X1014/Y1014","v":1.9381737391189473},{"$f":"IF(AC1014<=nn,AA1013,\"\")","v":2.0059414879335318},{"$f":"IF(AC1014<=nn,X1014,\"\")","v":-5.000000000000027},4]
[null,null,{"v":3.404679807664707,"d":"3.4047"},-34.128976376681976,96.63416561200198,null,"x4",{"$f":"$H1014-$I1014/$J1014","v":{"$error":"#N/A"}},{"v":0,"d":"0.000"},null,null,{"$f":"H1014-I1014/J1014","v":{"$error":"#N/A"}},{"$f":"IF(AND(N1012<=nn,I1015<>\"\"),0,\"\")","v":0},{"$nulls":4},{"$f":"IF(AND(OR('Fixed Window'!K30<xMin,'Fixed Window'!K30>xMax),(N1015<=nn)),\"Outside the interval\",\"\")","v":"Outside the interval"},{"$nulls":3},"x4",{"$f":"IF(AND(Z1014>=xMin,Z1014<=xMax),Z1014,W1014)","v":{"v":1.9381737391189473,"d":"1.9382"}},0,null,null,{"$f":"IF(AC1014<=nn,W1015,\"\")","v":{"v":1.9381737391189473,"d":"1.9382"}},{"$f":"IF(AND(AC1012<=nn,X1015<>\"\"),0,\"\")","v":0}]
[null,null,{"v":3.250311762144608,"d":"3.2503"},-32.32862096856401,null,null,"x4",{"$f":"H1015","v":{"$error":"#N/A"}},{"$f":"LOOKUP(H1015,C$3:C$1006,D$3:D$1006)","v":{"$error":"#N/A"}},{"$f":"LOOKUP(H1016,C$3:C$1006,E$3:E$1006)","v":{"$error":"#N/A"}},{"$f":"H1016-I1016/J1016","v":{"$error":"#N/A"}},{"$f":"IF(N1016<=nn,L1015,\"\")","v":{"$error":"#N/A"}},{"$f":"IF(N1016<=nn,I1016,\"\")","v":{"$error":"#N/A"}},4,{"$nulls":3},{"$f":"IF(AND(OR('Fixed Window'!K31<xMin,'Fixed Window'!K31>xMax),(N1016<=nn)),\"Outside the interval\",\"\")","v":"Outside the interval"},{"$nulls":3},"x4",{"$f":"W1015","v":{"v":1.9381737391189473,"d":"1.9382"}},{"$f":"LOOKUP(W1015,C$1040:C$1293,D$1040:D$1291)","v":-3.6813456547840318},{"$f":"LOOKUP(W1016,C$1040:C$1293,F$1040:F$1291)","v":-76.38907266140853},{"$f":"W1016-X1016/Y1016","v":1.8899816937579381},{"$f":"IF(AC1016<=nn,AA1015,\"\")","v":""},{"$f":"IF(AC1016<=nn,X1016,\"\")","v":""},5]
[null,null,{"v":3.257304769137615,"d":"3.2573"},-32.426615108069285,58.267903920946246,null,"x5",{"$f":"$H1016-$I1016/$J1016","v":{"$error":"#N/A"}},{"v":0,"d":"0.000"},null,null,{"$f":"IF(N1016<=nn,H1017,\"\")","v":{"$error":"#N/A"}},{"$f":"IF(AND(N1014<=nn,I1017<>\"\"),0,\"\")","v":0},{"$nulls":4},{"$f":"IF(AND(OR('Fixed Window'!K32<xMin,'Fixed Window'!K32>xMax),(N1017<=nn)),\"Outside the interval\",\"\")","v":"Outside the interval"},{"$nulls":3},"x5",{"$f":"IF(AND(Z1016>=xMin,Z1016<=xMax),Z1016,W1016)","v":{"v":1.8899816937579381,"d":"1.8900"}},0,null,null,{"$f":"IF(AC1016<=nn,W1017,\"\")","v":""},{"$f":"IF(AND(AC1014<=nn,X1017<>\"\"),0,\"\")","v":0}]
[null,null,{"v":3.2324890528566286,"d":"3.2325"},-32.07243497151611,null,null,"x5",{"$f":"H1017","v":{"$error":"#N/A"}},{"$f":"LOOKUP(H1017,C$3:C$1006,D$3:D$1006)","v":{"$error":"#N/A"}},{"$f":"LOOKUP(H1018,C$3:C$1006,E$3:E$1006)","v":{"$error":"#N/A"}},{"$f":"H1018-I1018/J1018","v":{"$error":"#N/A"}},{"$f":"IF(N1018<=nn,L1017,\"\")","v":""},{"$f":"IF(N1018<=nn,I1018,\"\")","v":""},5,{"$nulls":3},{"$f":"IF(AND(OR('Fixed Window'!K33<xMin,'Fixed Window'!K33>xMax),(N1018<=nn)),\"Outside the interval\",\"\")","v":""},{"$nulls":3},"x5",{"$f":"W1017","v":{"v":1.8899816937579381,"d":"1.8900"}},{"$f":"LOOKUP(W1017,C$1040:C$1293,D$1040:D$1291)","v":-2.7273214320640324},{"$f":"LOOKUP(W1018,C$1040:C$1293,F$1040:F$1291)","v":-78.38053359423714},{"$f":"W1018-X1018/Y1018","v":1.8551857909106455},{"$f":"IF(AC1018<=nn,AA1017,\"\")","v":""},{"$f":"IF(AC1018<=nn,X1018,\"\")","v":""},6]
[null,null,{"v":3.2394820598496357,"d":"3.2395"},-32.174044220862825,47.51047187914822,null,"x6",{"$f":"$H1018-$I1018/$J1018","v":{"$error":"#N/A"}},{"v":0,"d":"0.000"},null,null,{"$f":"IF(N1018<=nn,H1019,\"\")","v":""},{"$f":"IF(AND(N1016<=nn,I1019<>\"\"),0,\"\")","v":0},{"$nulls":4},{"$f":"IF(AND(OR('Fixed Window'!K34<xMin,'Fixed Window'!K34>xMax),(N1019<=nn)),\"Outside the interval\",\"\")","v":"Outside the interval"},{"$nulls":3},"x6",{"$f":"IF(AND(Z1018>=xMin,Z1018<=xMax),Z1018,W1018)","v":{"v":1.8551857909106455,"d":"1.8552"}},0,null,null,{"$f":"IF(AC1018<=nn,W1019,\"\")","v":""},{"$f":"IF(AND(AC1016<=nn,X1019<>\"\"),0,\"\")","v":""}]
[null,null,{"v":3.2321640115074985,"d":"3.2322"},-32.067678162222904,null,null,"x6",{"$f":"H1019","v":{"$error":"#N/A"}},{"$f":"LOOKUP(H1019,C$3:C$1006,D$3:D$1006)","v":{"$error":"#N/A"}},{"$f":"LOOKUP(H1020,C$3:C$1006,E$3:E$1006)","v":{"$error":"#N/A"}},{"$f":"H1020-I1020/J1020","v":{"$error":"#N/A"}},{"$f":"IF(N1020<=nn,L1019,\"\")","v":""},{"$f":"IF(N1020<=nn,I1020,\"\")","v":""},6,{"$nulls":3},{"$f":"IF(AND(OR('Fixed Window'!K35<xMin,'Fixed Window'!K35>xMax),(N1020<=nn)),\"Outside the interval\",\"\")","v":""},{"$nulls":3},"x6",{"$f":"W1019","v":{"v":1.8551857909106455,"d":"1.8552"}},{"$f":"LOOKUP(W1019,C$1040:C$1293,D$1040:D$1291)","v":-1.8052326400000211},{"$f":"LOOKUP(W1020,C$1040:C$1293,F$1040:F$1291)","v":-80.40285212367077},{"$f":"W1020-X1020/Y1020","v":1.8327334451005326},{"$f":"IF(AC1020<=nn,AA1019,\"\")","v":""},{"$f":"IF(AC1020<=nn,X1020,\"\")","v":""},7]
[null,null,{"v":3.2391570185005056,"d":"3.2392"},-32.169352356119,46.299516920046166,null,"x7",{"$f":"$H1020-$I1020/$J1020","v":{"$error":"#N/A"}},{"v":0,"d":"0.000"},null,null,{"$f":"IF(N1020<=nn,H1021,\"\")","v":""},{"$f":"IF(AND(N1018<=nn,I1021<>\"\"),0,\"\")","v":""},{"$nulls":4},{"$f":"IF(AND(OR('Fixed Window'!K36<xMin,'Fixed Window'!K36>xMax),(N1021<=nn)),\"Outside the interval\",\"\")","v":"Outside the interval"},{"$nulls":3},"x7",{"$f":"IF(AND(Z1020>=xMin,Z1020<=xMax),Z1020,W1020)","v":{"v":1.8327334451005326,"d":"1.8327"}},0,null,null,{"$f":"IF(AC1020<=nn,W1021,\"\")","v":""},{"$f":"IF(AND(AC1018<=nn,X1021<>\"\"),0,\"\")","v":""}]
[null,null,{"v":3.2321622809846455,"d":"3.2322"},-32.067652828899895,null,null,"x7",{"$f":"H1021","v":{"$error":"#N/A"}},{"$f":"LOOKUP(H1021,C$3:C$1006,D$3:D$1006)","v":{"$error":"#N/A"}},{"$f":"LOOKUP(H1022,C$3:C$1006,E$3:E$1006)","v":{"$error":"#N/A"}},{"$f":"H1022-I1022/J1022","v":{"$error":"#N/A"}},{"$f":"IF(N1022<=nn,L1021,\"\")","v":""},{"$f":"IF(N1022<=nn,I1022,\"\")","v":""},7,{"$nulls":3},{"$f":"IF(AND(OR('Fixed Window'!K37<xMin,'Fixed Window'!K37>xMax),(N1022<=nn)),\"Outside the interval\",\"\")","v":""},{"$nulls":3},"x7",{"$f":"W1021","v":{"v":1.8327334451005326,"d":"1.8327"}},{"$f":"LOOKUP(W1021,C$1040:C$1293,D$1040:D$1291)","v":-1.5052518154240264},{"$f":"LOOKUP(W1022,C$1040:C$1293,F$1040:F$1291)","v":-81.08385384482116},{"$f":"W1022-X1022/Y1022","v":1.8141693075559016},{"$f":"IF(AC1022<=nn,AA1021,\"\")","v":""},{"$f":"IF(AC1022<=nn,X1022,\"\")","v":""},8]
[null,null,{"v":3.2391552879776526,"d":"3.2392"},-32.16932736846705,46.27760853407272,null,"x8",{"$f":"$H1022-$I1022/$J1022","v":{"$error":"#N/A"}},{"v":0,"d":"0.000"},null,null,{"$f":"IF(N1022<=nn,H1023,\"\")","v":""},{"$f":"IF(AND(N1020<=nn,I1023<>\"\"),0,\"\")","v":""},{"$nulls":4},{"$f":"IF(AND(OR('Fixed Window'!K38<xMin,'Fixed Window'!K38>xMax),(N1023<=nn)),\"Outside the interval\",\"\")","v":"Outside the interval"},{"$nulls":3},"x8",{"$f":"IF(AND(Z1022>=xMin,Z1022<=xMax),Z1022,W1022)","v":{"v":1.8141693075559016,"d":"1.8142"}},0,null,null,{"$f":"IF(AC1022<=nn,W1023,\"\")","v":""},{"$f":"IF(AND(AC1020<=nn,X1023<>\"\"),0,\"\")","v":""}]
[null,null,{"v":3.2321622721800436,"d":"3.2322"},-32.0676527000081,null,null,"x8",{"$f":"H1023","v":{"$error":"#N/A"}},{"$f":"LOOKUP(H1023,C$3:C$1006,D$3:D$1006)","v":{"$error":"#N/A"}},{"$f":"LOOKUP(H1024,C$3:C$1006,E$3:E$1006)","v":{"$error":"#N/A"}},{"$f":"H1024-I1024/J1024","v":{"$error":"#N/A"}},{"$f":"IF(N1024<=nn,L1023,\"\")","v":""},{"$f":"IF(N1024<=nn,I1024,\"\")","v":""},8,{"$nulls":3},{"$f":"IF(AND(OR('Fixed Window'!K39<xMin,'Fixed Window'!K39>xMax),(N1024<=nn)),\"Outside the interval\",\"\")","v":""},{"$nulls":3},"x8",{"$f":"W1023","v":{"v":1.8141693075559016,"d":"1.8142"}},{"$f":"LOOKUP(W1023,C$1040:C$1293,D$1040:D$1291)","v":-1.2090587095040242},{"$f":"LOOKUP(W1024,C$1040:C$1293,F$1040:F$1291)","v":-81.76831701722772},{"$f":"W1024-X1024/Y1024","v":1.7993829116313127},{"$f":"IF(AC1024<=nn,AA1023,\"\")","v":""},{"$f":"IF(AC1024<=nn,X1024,\"\")","v":""},9]
[null,null,{"v":3.2391552791730507,"d":"3.2392"},-32.16932724133398,46.27749191050871,null,"x9",{"$f":"$H1024-$I1024/$J1024","v":{"$error":"#N/A"}},{"v":0,"d":"0.000"},null,null,{"$f":"IF(N1024<=nn,H1025,\"\")","v":""},0,{"$nulls":4},{"$f":"IF(AND(OR('Fixed Window'!K40<xMin,'Fixed Window'!K40>xMax),(N1025<=nn)),\"Outside the interval\",\"\")","v":""},{"$nulls":3},"x9",{"$f":"IF(AND(Z1024>=xMin,Z1024<=xMax),Z1024,W1024)","v":{"v":1.7993829116313127,"d":"1.7994"}},0,null,null,{"$f":"IF(AC1024<=nn,W1025,\"\")","v":""},0]
[null,null,{"v":3.232162272135258,"d":"3.2322"},-32.067652699352465,null,null,"x9",{"$f":"H1025","v":{"$error":"#N/A"}},{"$f":"LOOKUP(H1025,C$3:C$1006,D$3:D$1006)","v":{"$error":"#N/A"}},{"$f":"LOOKUP(H1026,C$3:C$1006,E$3:E$1006)","v":{"$error":"#N/A"}},{"$f":"H1026-I1026/J1026","v":{"$error":"#N/A"}},{"$f":"IF(N1026<=nn,L1025,\"\")","v":""},{"$f":"IF(N1026<=nn,I1026,\"\")","v":""},9,{"$nulls":3},{"$f":"IF(AND(OR('Fixed Window'!K41<xMin,'Fixed Window'!K41>xMax),(N1026<=nn)),\"Outside the interval\",\"\")","v":""},{"$nulls":3},"x9",{"$f":"W1025","v":{"v":1.7993829116313127,"d":"1.7994"}},{"$f":"LOOKUP(W1025,C$1040:C$1293,D$1040:D$1291)","v":-0.916708962304023},{"$f":"LOOKUP(W1026,C$1040:C$1293,F$1040:F$1291)","v":-82.45624984824829},{"$f":"W1026-X1026/Y1026","v":1.7882653921711005},{"$f":"IF(AC1026<=nn,AA1025,\"\")","v":""},{"$f":"IF(AC1026<=nn,X1026,\"\")","v":""},10]
[null,null,{"v":3.239155279128265,"d":"3.2392"},{"$f":"x^4-5*x^3+7*x+5","v":-32.169327240687295},46.2774913171482,null,"x10",{"$f":"$H1026-$I1026/$J1026","v":{"$error":"#N/A"}},{"v":0,"d":"0.000"},null,null,{"$f":"IF(N1026<=nn,H1027,\"\")","v":""},0,{"$nulls":4},{"$f":"IF(AND(OR('Fixed Window'!K42<xMin,'Fixed Window'!K42>xMax),(N1027<=nn)),\"Outside the interval\",\"\")","v":""},{"$nulls":3},"x10",{"$f":"IF(AND(Z1026>=xMin,Z1026<=xMax),Z1026,W1026)","v":{"v":1.7882653921711005,"d":"1.7883"}},0,null,null,{"$f":"IF(AC1026<=nn,W1027,\"\")","v":""},0]
[null,null,{"v":3.2321622721350307,"d":"3.2322"},-32.06765269934914,null,null,"x10",{"$f":"H1027","v":{"$error":"#N/A"}},{"$f":"LOOKUP(H1027,C$3:C$1006,D$3:D$1006)","v":{"$error":"#N/A"}},{"$f":"LOOKUP(H1028,C$3:C$1006,E$3:E$1006)","v":{"$error":"#N/A"}},{"$f":"H1028-I1028/J1028","v":{"$error":"#N/A"}},{"$f":"IF(N1028<=nn,L1027,\"\")","v":""},{"$f":"IF(N1028<=nn,I1028,\"\")","v":""},10,{"$nulls":3},{"$f":"IF(AND(OR('Fixed Window'!K43<xMin,'Fixed Window'!K43>xMax),(N1028<=nn)),\"Outside the interval\",\"\")","v":""},{"$nulls":3},"x10",{"$f":"W1027","v":{"v":1.7882653921711005,"d":"1.7883"}},{"$f":"LOOKUP(W1027,C$1040:C$1293,D$1040:D$1291)","v":-0.6282566410240236},{"$f":"LOOKUP(W1028,C$1040:C$1293,F$1040:F$1291)","v":-83.14766054523666},{"$f":"W1028-X1028/Y1028","v":1.7807094773455447},{"$f":"IF(AC1028<=nn,AA1027,\"\")","v":""},{"$f":"IF(AC1028<=nn,X1028,\"\")","v":""},11]
[null,null,{"v":3.239155279128038,"d":"3.2392"},-32.169327240684,46.27749131413248,null,"x11",{"$f":"$H1028-$I1028/$J1028","v":{"$error":"#N/A"}},{"v":0,"d":"0.000"},null,null,{"$f":"IF(N1028<=nn,H1029,\"\")","v":""},0,{"$nulls":4},{"$f":"IF(AND(OR('Fixed Window'!K44<xMin,'Fixed Window'!K44>xMax),(N1029<=nn)),\"Outside the interval\",\"\")","v":""},{"$nulls":3},"x11",{"$f":"IF(AND(Z1028>=xMin,Z1028<=xMax),Z1028,W1028)","v":{"v":1.7807094773455447,"d":"1.7807"}},0,null,null,{"$f":"IF(AC1028<=nn,W1029,\"\")","v":""},0]
[null,null,{"v":3.232162272135029,"d":"3.2322"},-32.06765269934912,null,null,"x11",{"$f":"H1029","v":{"$error":"#N/A"}},{"$f":"LOOKUP(H1029,C$3:C$1006,D$3:D$1006)","v":{"$error":"#N/A"}},{"$f":"LOOKUP(H1030,C$3:C$1006,E$3:E$1006)","v":{"$error":"#N/A"}},{"$f":"H1030-I1030/J1030","v":{"$error":"#N/A"}},{"$f":"IF(N1030<=nn,L1029,\"\")","v":""},{"$f":"IF(N1030<=nn,I1030,\"\")","v":""},11,{"$nulls":3},{"$f":"IF(AND(OR('Fixed Window'!K45<xMin,'Fixed Window'!K45>xMax),(N1030<=nn)),\"Outside the interval\",\"\")","v":""},{"$nulls":3},"x11",{"$f":"W1029","v":{"v":1.7807094773455447,"d":"1.7807"}},{"$f":"LOOKUP(W1029,C$1040:C$1293,D$1040:D$1291)","v":-0.6282566410240236},{"$f":"LOOKUP(W1030,C$1040:C$1293,F$1040:F$1291)","v":-83.14766054523666},{"$f":"W1030-X1030/Y1030","v":1.773153562519989},{"$f":"IF(AC1030<=nn,AA1029,\"\")","v":""},{"$f":"IF(AC1030<=nn,X1030,\"\")","v":""},12]
[null,null,{"v":3.239155279128036,"d":"3.2392"},-32.169327240683984,46.277491314114194,null,"x12",{"$f":"$H1030-$I1030/$J1030","v":{"$error":"#N/A"}},{"v":0,"d":"0.000"},null,null,{"$f":"IF(N1030<=nn,H1031,\"\")","v":""},0,{"$nulls":4},{"$f":"IF(AND(OR('Fixed Window'!K46<xMin,'Fixed Window'!K46>xMax),(N1031<=nn)),\"Outside the interval\",\"\")","v":""},{"$nulls":3},"x12",{"$f":"IF(AND(Z1030>=xMin,Z1030<=xMax),Z1030,W1030)","v":{"v":1.773153562519989,"d":"1.7732"}},0,null,null,{"$f":"IF(AC1030<=nn,W1031,\"\")","v":""},0]
[null,null,{"v":3.232162272135029,"d":"3.2322"},-32.06765269934912,null,null,"x12",{"$f":"H1031","v":{"$error":"#N/A"}},{"$f":"LOOKUP(H1031,C$3:C$1006,D$3:D$1006)","v":{"$error":"#N/A"}},{"$f":"LOOKUP(H1032,C$3:C$1006,E$3:E$1006)","v":{"$error":"#N/A"}},{"$f":"H1032-I1032/J1032","v":{"$error":"#N/A"}},{"$f":"IF(N1032<=nn,L1031,\"\")","v":""},{"$f":"IF(N1032<=nn,I1032,\"\")","v":""},12,{"$nulls":3},{"$f":"IF(AND(OR('Fixed Window'!K47<xMin,'Fixed Window'!K47>xMax),(N1032<=nn)),\"Outside the interval\",\"\")","v":""},{"$nulls":3},"x12",{"$f":"W1031","v":{"v":1.773153562519989,"d":"1.7732"}},{"$f":"LOOKUP(W1031,C$1040:C$1293,D$1040:D$1291)","v":-0.3437542400000222},{"$f":"LOOKUP(W1032,C$1040:C$1293,F$1040:F$1291)","v":-83.84255731553746},{"$f":"W1032-X1032/Y1032","v":1.7690535654420574},{"$f":"IF(AC1032<=nn,AA1031,\"\")","v":""},{"$f":"IF(AC1032<=nn,X1032,\"\")","v":""},13]
[null,null,{"v":3.239155279128036,"d":"3.2392"},-32.169327240683984,46.27749131411318,null,"x13",{"$f":"$H1032-$I1032/$J1032","v":{"$error":"#N/A"}},{"v":0,"d":"0.000"},null,null,{"$f":"IF(N1032<=nn,H1033,\"\")","v":""},0,{"$nulls":4},{"$f":"IF(AND(OR('Fixed Window'!K48<xMin,'Fixed Window'!K48>xMax),(N1033<=nn)),\"Outside the interval\",\"\")","v":""},{"$nulls":3},"x13",{"$f":"IF(AND(Z1032>=xMin,Z1032<=xMax),Z1032,W1032)","v":{"v":1.7690535654420574,"d":"1.7691"}},0,null,null,{"$f":"IF(AC1032<=nn,W1033,\"\")","v":""},0]
[null,null,{"v":3.232162272135029,"d":"3.2322"},-32.06765269934912,null,null,"x13",{"$f":"H1033","v":{"$error":"#N/A"}},{"$f":"LOOKUP(H1033,C$3:C$1006,D$3:D$1006)","v":{"$error":"#N/A"}},{"$f":"LOOKUP(H1034,C$3:C$1006,E$3:E$1006)","v":{"$error":"#N/A"}},{"$f":"H1034-I1034/J1034","v":{"$error":"#N/A"}},{"$f":"IF(N1034<=nn,L1033,\"\")","v":""},{"$f":"IF(N1034<=nn,I1034,\"\")","v":""},13,{"$nulls":3},{"$f":"IF(AND(OR('Fixed Window'!K49<xMin,'Fixed Window'!K49>xMax),(N1034<=nn)),\"Outside the interval\",\"\")","v":""},{"$nulls":3},"x13",{"$f":"W1033","v":{"v":1.7690535654420574,"d":"1.7691"}},{"$f":"LOOKUP(W1033,C$1040:C$1293,D$1040:D$1291)","v":-0.3437542400000222},{"$f":"LOOKUP(W1034,C$1040:C$1293,F$1040:F$1291)","v":-83.84255731553746},{"$f":"W1034-X1034/Y1034","v":1.7649535683641258},{"$f":"IF(AC1034<=nn,AA1033,\"\")","v":""},{"$f":"IF(AC1034<=nn,X1034,\"\")","v":""},14]
[null,null,{"v":3.239155279128036,"d":"3.2392"},-32.169327240683984,46.27749131411318,null,"x14",{"$f":"$H1034-$I1034/$J1034","v":{"$error":"#N/A"}},{"v":0,"d":"0.000"},null,null,{"$f":"IF(N1034<=nn,H1035,\"\")","v":""},0,{"$nulls":4},{"$f":"IF(AND(OR('Fixed Window'!K50<xMin,'Fixed Window'!K50>xMax),(N1035<=nn)),\"Outside the interval\",\"\")","v":""},{"$nulls":3},"x14",{"$f":"IF(AND(Z1034>=xMin,Z1034<=xMax),Z1034,W1034)","v":{"v":1.7649535683641258,"d":"1.7650"}},0,null,null,{"$f":"IF(AC1034<=nn,W1035,\"\")","v":""},0]
[{"$nulls":3},5,null,null,"x14",{"$f":"H1035","v":{"$error":"#N/A"}},{"$f":"LOOKUP(H1035,C$3:C$1006,D$3:D$1006)","v":{"$error":"#N/A"}},{"$f":"LOOKUP(H1036,C$3:C$1006,E$3:E$1006)","v":{"$error":"#N/A"}},{"$f":"H1036-I1036/J1036","v":{"$error":"#N/A"}},{"$f":"IF(N1036<=nn,L1035,\"\")","v":""},{"$f":"IF(N1036<=nn,I1036,\"\")","v":""},14,{"$nulls":3},{"$f":"IF(AND(OR('Fixed Window'!K51<xMin,'Fixed Window'!K51>xMax),(N1036<=nn)),\"Outside the interval\",\"\")","v":""},{"$nulls":3},"x14",{"$f":"W1035","v":{"v":1.7649535683641258,"d":"1.7650"}},{"$f":"LOOKUP(W1035,C$1040:C$1293,D$1040:D$1291)","v":-0.3437542400000222},{"$f":"LOOKUP(W1036,C$1040:C$1293,F$1040:F$1291)","v":-83.84255731553746},{"$f":"W1036-X1036/Y1036","v":1.7608535712861941},{"$f":"IF(AC1036<=nn,AA1035,\"\")","v":""},{"$f":"IF(AC1036<=nn,X1036,\"\")","v":""},15]
[{"$nulls":3},5,46.27749131411318,null,"x15",{"$f":"$H1036-$I1036/$J1036","v":{"$error":"#N/A"}},{"v":0,"d":"0.000"},null,null,{"$f":"IF(N1036<=nn,H1037,\"\")","v":""},0,{"$nulls":4},{"$f":"IF(AND(OR('Fixed Window'!K52<xMin,'Fixed Window'!K52>xMax),(N1037<=nn)),\"Outside the interval\",\"\")","v":""},{"$nulls":3},"x15",{"$f":"IF(AND(Z1036>=xMin,Z1036<=xMax),Z1036,W1036)","v":{"v":1.7608535712861941,"d":"1.7609"}},0,null,null,{"$f":"IF(AC1036<=nn,W1037,\"\")","v":""},0]
[{"$nulls":3},5,null,null,"x15",{"$f":"H1037","v":{"$error":"#N/A"}},{"$f":"LOOKUP(H1037,C$3:C$1006,D$3:D$1006)","v":{"$error":"#N/A"}},null,null,{"$f":"IF(N1038<=nn,H1037,\"\")","v":""},{"$f":"IF(N1038<=nn,I1038,\"\")","v":""},15,{"$nulls":3},{"$f":"IF(AND(OR('Fixed Window'!K53<xMin,'Fixed Window'!K53>xMax),(N1038<=nn)),\"Outside the interval\",\"\")","v":""},{"$nulls":3},"x15",{"$f":"W1037","v":{"v":1.7608535712861941,"d":"1.7609"}},{"$f":"LOOKUP(W1037,C$1040:C$1293,D$1040:D$1291)","v":-0.3437542400000222}]
[{"$nulls":3},5]
[null,null,{"$f":"xxMin","v":0},5,0,-183.43429962379858]
[null,null,{"$f":"C1040+dxx","v":0.016},5.111979585536,1,-182.30582889651527]
[null,null,0.032,5.223837208576,2,-181.1817470514317]
[null,null,0.048,5.335452348416,3,-180.06204588116057]
[null,null,0.064,5.446706057216,4,-178.94671717836334]
[null,null,0.08,5.55748096,5,-177.83575273570554]
[null,null,0.096,5.667661254656,6,-176.72914434580392]
[null,null,0.112,5.777132711936,7,-175.62688380131587]
[null,null,0.128,5.885782675456,8,-174.52896289490693]
["delta x = ",{"$f":"(xxMax-xxMin)/250","v":0.016},0.14400000000000002,5.993500061696,9,-173.4353734191857]
[null,null,0.16000000000000003,6.10017536,10,-172.34610716683807]
[null,null,0.17600000000000005,6.205700632576001,11,-171.26115593047263]
[null,null,0.19200000000000006,6.309969514496,12,-170.1805115027793]
[null,null,0.20800000000000007,6.412877213696,13,-169.10416567637077]
[null,null,0.2240000000000001,6.514320510976001,14,-168.03211024391663]
[null,null,0.2400000000000001,6.614197760000001,15,-166.96433699802552]
[null,null,0.2560000000000001,6.712408887296,null,-165.90083773139546]
[null,null,0.27200000000000013,6.8088553922560004,null,-164.84160423663914]
[null,null,0.28800000000000014,6.903440347136001,null,-163.7866283064099]
[null,null,0.30400000000000016,6.996068397056001,null,-162.73590173335907]
[null,null,0.3200000000000002,7.0866457600000015,null,-161.6894163101379]
[null,null,0.3360000000000002,7.175080226816001,null,-160.6471638293713]
[null,null,0.3520000000000002,7.261281161216001,null,-159.6091360837329]
[null,null,0.3680000000000002,7.345159499776001,null,-158.5753248658537]
[null,null,0.38400000000000023,7.426627751936001,null,-157.54572196838706]
[null,null,0.40000000000000024,7.505600000000001,null,-156.52031918397202]
[null,null,0.41600000000000026,7.581991899136002,null,-155.49910830525994]
[null,null,0.4320000000000003,7.655720677376001,null,-154.48208112490616]
[null,null,0.4480000000000003,7.726705135616001,null,-153.46922943553557]
[null,null,0.4640000000000003,7.794865647616001,null,-152.46054502981573]
[null,null,0.4800000000000003,7.860124160000002,null,-151.45601970038777]
[null,null,0.49600000000000033,7.922404192256002,null,-150.45564523988875]
[null,null,0.5120000000000003,7.9816308367360005,null,-149.45941344097815]
[null,null,0.5280000000000004,8.037730758656,null,-148.46731609629705]
[null,null,0.5440000000000004,8.090632196096001,null,-147.47934499848867]
[null,null,0.5600000000000004,8.140264960000001,null,-146.49549194021242]
[null,null,0.5760000000000004,8.186560434176002,null,-145.5157487140993]
[null,null,0.5920000000000004,8.229451575296,null,-144.54010711280054]
[null,null,0.6080000000000004,8.268872912896,null,-143.56855892896752]
[null,null,0.6240000000000004,8.304760549376,null,-142.6010959552495]
[null,null,0.6400000000000005,8.33705216,null,-141.6377099842774]
[null,null,0.6560000000000005,8.365686992896,null,-140.67839280871883]
[null,null,0.6720000000000005,8.390605869056,null,-139.72313622120882]
[null,null,0.6880000000000005,8.411751182336001,null,-138.77193201439056]
[null,null,0.7040000000000005,8.429066899456,null,-137.82477198091328]
[null,null,0.7200000000000005,8.44249856,null,-136.88164791343846]
[null,null,0.7360000000000005,8.451993276416001,null,-135.942551604591]
[null,null,0.7520000000000006,8.457499734016,null,-135.00747484702623]
[null,null,0.7680000000000006,8.458968190976,null,-134.07640943339956]
[null,null,0.7840000000000006,8.456350478336,null,-133.14934715634192]
[null,null,0.8000000000000006,8.4496,null,-132.2262798085067]
[null,null,0.8160000000000006,{"$f":"x^4-5*x^3+7*x+5","v":8.438671732736},null,-131.3071991825492]
[null,null,0.8320000000000006,8.423522226175999,null,-130.3920970711045]
[null,null,0.8480000000000006,8.404109602816,null,-129.4809652668239]
[null,null,0.8640000000000007,8.380393558016,null,-128.57379556235463]
[null,null,0.8800000000000007,8.352335359999998,null,-127.67057975033985]
[null,null,0.8960000000000007,8.319897849855998,null,-126.7713096234309]
[null,null,0.9120000000000007,8.283045441535998,null,-125.87597697427091]
[null,null,0.9280000000000007,8.241744121855998,null,-124.98457359550714]
[null,null,0.9440000000000007,8.195961450495997,null,-124.09709127979292]
[null,null,0.9600000000000007,8.145666559999997,null,-123.21352181976125]
[null,null,0.9760000000000008,8.090830155775997,null,-122.33385700807361]
[null,null,0.9920000000000008,8.031424516095997,null,-121.45808863736706]
[null,null,1.0080000000000007,7.967423492095996,null,-120.5862085002868]
[null,null,1.0240000000000007,7.898802507775996,null,-119.71820838948821]
[null,null,{"$f":"C1104+dxx","v":1.0400000000000007},7.8255385599999965,null,-118.85408009761446]
[null,null,1.0560000000000007,7.747610218495996,null,-117.99381541730871]
[null,null,1.0720000000000007,7.664997625855996,null,-117.13740614121821]
[null,null,1.0880000000000007,7.577682497535995,null,-116.28484406200035]
[null,null,1.1040000000000008,7.485648121855995,null,-115.43612097228407]
[null,null,1.1200000000000008,7.388879359999995,null,-114.59122866472882]
[null,null,1.1360000000000008,7.287362646015995,null,-113.75015893197775]
[null,null,1.1520000000000008,7.181085986815995,null,-112.91290356667811]
[null,null,1.1680000000000008,7.070038962175993,null,-112.0794543614751]
[null,null,1.1840000000000008,6.954212724735994,null,-111.24980310901392]
[null,null,1.2000000000000008,6.8335999999999935,null,-110.42394160194588]
[null,null,1.2160000000000009,6.7081950863359925,null,-109.60186163291415]
[null,null,1.2320000000000009,6.5779938549759915,null,-108.78355499457003]
[null,null,1.2480000000000009,6.442993750015992,null,-107.96901347955261]
[null,null,1.264000000000001,6.303193788415992,null,-107.15822888051322]
[null,null,1.280000000000001,6.158594559999992,null,-106.35119299010111]
[null,null,1.296000000000001,6.00919822745599,null,-105.54789760095336]
[null,null,1.312000000000001,5.85500852633599,null,-104.74833450573347]
[null,null,1.328000000000001,5.6960307650559905,null,-103.95249549707037]
[null,null,1.344000000000001,5.5322718248959895,null,-103.16037236761944]
[null,null,1.360000000000001,5.36374015999999,null,-102.37195691002894]
[null,null,1.376000000000001,5.19044579737599,null,-101.58724091693999]
[null,null,1.392000000000001,5.01240033689599,null,-100.80621618099983]
[null,null,1.408000000000001,4.8296169512959874,null,-100.02887449486485]
[null,null,1.424000000000001,4.642110386175986,null,-99.25520765116907]
[null,null,1.440000000000001,4.449896959999988,null,-98.48520744256582]
[null,null,1.456000000000001,4.252994564095987,null,-97.71886566169931]
[null,null,1.472000000000001,4.051422662655986,null,-96.95617410121777]
[null,null,1.488000000000001,3.845202292735987,null,-96.1971245537664]
[null,null,1.5040000000000011,3.634356064255986,null,-95.44170881199754]
[null,null,1.5200000000000011,3.4189081599999867,null,-94.6899186685513]
[null,null,1.5360000000000011,3.1988843356159844,null,-93.94174591607187]
[null,null,1.5520000000000012,2.9743119196159853,null,-93.1971823472146]
[null,null,1.5680000000000012,2.745219813375984,null,-92.45621975461964]
[null,null,1.5840000000000012,2.5116384911359813,null,-91.71884993093727]
[null,null,1.6000000000000012,2.2735999999999787,null,-90.98506466881572]
[null,null,1.6160000000000012,2.031137959935979,null,-90.25485576089412]
[null,null,1.6320000000000012,1.7842875637759779,null,-89.52821499982986]
[null,null,1.6480000000000012,1.533085577215978,null,-88.805134178259]
[null,null,1.6640000000000013,1.2775703388159805,null,-88.08560508883183]
[null,null,1.6800000000000013,1.0177817599999806,null,-87.36961952419963]
[null,null,1.6960000000000013,0.7537613250559776,null,-86.65716927700356]
[null,null,1.7120000000000013,0.48555209113597897,null,-85.94824613989289]
[null,null,1.7280000000000013,0.21319868825597688,null,-85.24284190551688]
[null,null,1.7440000000000013,-0.06325268070402146,null,-84.54094836651464]
[null,null,1.7600000000000013,-0.3437542400000222,null,-83.84255731553746]
[null,null,1.7760000000000014,-0.6282566410240236,null,-83.14766054523666]
[null,null,1.7920000000000014,-0.916708962304023,null,-82.45624984824829]
[null,null,1.8080000000000014,-1.2090587095040242,null,-81.76831701722772]
[null,null,1.8240000000000014,-1.5052518154240264,null,-81.08385384482116]
[null,null,1.8400000000000014,{"$f":"x^4-5*x^3+7*x+5","v":-1.8052326400000211},null,-80.40285212367077]
[null,null,1.8560000000000014,-2.1089439703040274,null,-79.72530364642176]
[null,null,1.8720000000000014,-2.4163270205440313,null,-79.05120020573254]
[null,null,1.8880000000000015,-2.7273214320640324,null,-78.38053359423714]
[null,null,1.9040000000000015,-3.0418652733440332,null,-77.71329560458582]
[null,null,1.9200000000000015,-3.359895040000035,null,-77.04947802942688]
[null,null,1.9360000000000015,-3.6813456547840318,null,-76.38907266140853]
[null,null,1.9520000000000015,-4.0061504675840265,null,-75.73207129317396]
[null,null,1.9680000000000015,-4.334241255424033,null,-75.07846571737346]
[null,null,1.9840000000000015,-4.665548222464031,null,-74.42824772664815]
[null,null,2.0000000000000013,-5.000000000000027,null,-73.78140911365139]
[null,null,2.0160000000000013,-5.337523646464035,null,-73.13794167102226]
[null,null,2.0320000000000014,-5.6780446474240325,null,-72.49783719141716]
[null,null,2.0480000000000014,-6.021486915584035,null,-71.86108746747317]
[null,null,{"$f":"C1168+dxx","v":2.0640000000000014},-6.367772790784029,null,-71.2276842918436]
[null,null,2.0800000000000014,-6.716823040000033,null,-70.59761945717366]
[null,null,2.0960000000000014,-7.06855685734403,null,-69.97088475610553]
[null,null,2.1120000000000014,-7.4228918640640345,null,-69.34747198129354]
[null,null,2.1280000000000014,-7.779744108544028,null,-68.72737292537678]
[null,null,2.1440000000000015,-8.139028066304032,null,-68.11057938100862]
[null,null,2.1600000000000015,-8.50065664000003,null,-67.4970831408312]
[null,null,2.1760000000000015,-8.86454115942404,null,-66.88687599749073]
[null,null,2.1920000000000015,-9.23059138150404,null,-66.27994974363953]
[null,null,2.2080000000000015,-9.598715490304038,null,-65.67629617192028]
[null,null,2.2240000000000015,-9.968820097024034,null,-65.07590707497818]
[null,null,2.2400000000000015,-10.340810240000032,null,-64.47877424546044]
[null,null,2.2560000000000016,-10.714589384704036,null,-63.884889476018905]
[null,null,2.2720000000000016,-11.090059423744034,null,-63.294244559294185]
[null,null,2.2880000000000016,-11.467120676864042,null,-62.70683128793555]
[null,null,2.3040000000000016,-11.845671890944036,null,-62.12264145458923]
[null,null,2.3200000000000016,-12.22561024000004,null,-61.54166685190042]
[null,null,2.3360000000000016,-12.60683132518404,null,-60.963899272521445]
[null,null,2.3520000000000016,-12.989229174784043,null,-60.3893305090914]
[null,null,2.3680000000000017,-13.372696244224034,null,-59.817952354261095]
[null,null,2.3840000000000017,-13.757123416064037,null,-59.24975660067826]
[null,null,2.4000000000000017,-14.142400000000045,null,-58.684735040987086]
[null,null,2.4160000000000017,-14.528413732864038,null,-58.122879467835325]
[null,null,2.4320000000000017,-14.915050778624046,null,-57.564181673867665]
[null,null,2.4480000000000017,-15.302195728384046,null,-57.00863345173642]
[null,null,2.4640000000000017,-15.68973160038405,null,-56.456226594080206]
[null,null,2.4800000000000018,-16.077539840000043,null,-55.906952893553864]
[null,null,2.4960000000000018,-16.46550031974404,null,-55.360804142798536]
[null,null,2.512000000000002,-16.853491339264043,null,-54.817772134461975]
[null,null,2.528000000000002,-17.24138962534404,null,-54.27784866119192]
[null,null,2.544000000000002,-17.629070331904046,null,-53.7410255156356]
[null,null,2.560000000000002,-18.016407040000043,null,-53.207294490437214]
[null,null,2.576000000000002,-18.403271757824033,null,-52.67664737824603]
[null,null,2.592000000000002,-18.789534920704064,null,-52.149075971706736]
[null,null,2.608000000000002,-19.17506539110404,null,-51.62457206346861]
[null,null,2.624000000000002,-19.55973045862405,null,-51.10312744617533]
[null,null,2.640000000000002,-19.943395840000047,null,-50.58473391247565]
[null,null,2.656000000000002,-20.325925679104046,null,-50.06938325501528]
[null,null,2.672000000000002,-20.707182546944054,null,-49.55706726644198]
[null,null,2.688000000000002,-21.087027441664045,null,-49.04777773939942]
[null,null,2.704000000000002,-21.465319788544054,null,-48.541506466539914]
[null,null,2.720000000000002,-21.841917440000046,null,-48.038245240504104]
[null,null,2.736000000000002,-22.216676675584047,null,-47.537985853941755]
[null,null,2.752000000000002,-22.589452201984034,null,-47.040720099500106]
[null,null,2.768000000000002,-22.960097153024055,null,-46.54643976982386]
[null,null,2.784000000000002,-23.32846308966404,null,-46.055136657561775]
[null,null,2.800000000000002,-23.69440000000005,null,-45.56680255535956]
[null,null,2.816000000000002,-24.057756299264053,null,-45.08142925586242]
[null,null,2.832000000000002,-24.418378829824047,null,-44.59900855171962]
[null,null,2.848000000000002,-24.776112861184053,null,-44.11953223557586]
[null,null,2.864000000000002,{"$f":"x^4-5*x^3+7*x+5","v":-25.130802089984044},null,-43.64299210007991]
[null,null,2.880000000000002,-25.482288640000032,null,-43.169379937877466]
[null,null,2.896000000000002,-25.830413062144036,null,-42.698687541612216]
[null,null,2.912000000000002,-26.175014334464038,null,-42.23090670393774]
[null,null,2.928000000000002,-26.51592986214404,null,-41.76602921749265]
[null,null,2.944000000000002,-26.85299547750404,null,-41.30404687493002]
[null,null,2.960000000000002,-27.186045440000044,null,-40.84495146889353]
[null,null,2.976000000000002,-27.514912436224044,null,-40.38873479202965]
[null,null,2.992000000000002,-27.839427579904054,null,-39.9353886369874]
[null,null,3.0080000000000022,-28.15942041190405,null,-39.4849047964102]
[null,null,3.0240000000000022,-28.474718900224048,null,-39.03727506294783]
[null,null,3.0400000000000023,-28.785149440000026,null,-38.59249122924626]
[null,null,3.0560000000000023,-29.09053685350404,null,-38.15054508794941]
[null,null,3.0720000000000023,-29.390704390144023,null,-37.71142843170835]
[null,null,{"$f":"C1232+dxx","v":3.0880000000000023},-29.68547372646404,null,-37.27513305316521]
[null,null,3.1040000000000023,-29.974664966144026,null,-36.84165074497056]
[null,null,3.1200000000000023,-30.258096640000034,null,-36.41097329976932]
[null,null,3.1360000000000023,-30.535585705984033,null,-35.98309251020746]
[null,null,3.1520000000000024,-30.806947549184017,null,-35.55800016893427]
[null,null,3.1680000000000024,-31.071995981824045,null,-35.135688068593666]
[null,null,3.1840000000000024,-31.330543243264025,null,-34.71614800183365]
[null,null,3.2000000000000024,-31.58240000000005,null,-34.299371761300705]
[null,null,3.2160000000000024,-31.827375345664052,null,-33.885351139642054]
[null,null,3.2320000000000024,-32.06527680102405,null,-33.474077929502656]
[null,null,3.2480000000000024,-32.29591031398404,null,-33.065543923531514]
[null,null,3.2640000000000025,-32.51908025958406,null,-32.65974091437359]
[null,null,3.2800000000000025,-32.73458944000001,null,-32.25666069467613]
[null,null,3.2960000000000025,-32.94223908454404,null,-31.856295057087106]
[null,null,3.3120000000000025,-33.141828849664016,null,-31.45863579425047]
[null,null,3.3280000000000025,-33.33315681894402,null,-31.06367469881523]
[null,null,3.3440000000000025,-33.51601950310402,null,-30.671403563426594]
[null,null,3.3600000000000025,-33.690211839999996,null,-30.281814180732557]
[null,null,3.3760000000000026,-33.85552719462403,null,-29.89489834337909]
[null,null,3.3920000000000026,-34.01175735910404,null,-29.51064784401368]
[null,null,3.4080000000000026,-34.158692552704025,null,-29.12905447528102]
[null,null,3.4240000000000026,-34.29612142182401,null,-28.75011002982937]
[null,null,3.4400000000000026,-34.42383104000003,null,-28.373806300305706]
[null,null,3.4560000000000026,-34.54160690790401,null,-28.000135079355744]
[null,null,3.4720000000000026,-34.649232953344,null,-27.629088159627226]
[null,null,3.4880000000000027,-34.74649153126399,null,-27.26065733376485]
[null,null,3.5040000000000027,-34.833163423744,null,-26.894834394417376]
[null,null,3.5200000000000027,-34.90902783999999,null,-26.53161113423255]
[null,null,3.5360000000000027,-34.973862416383994,null,-26.170979345852015]
[null,null,3.5520000000000027,-35.027443216383986,null,-25.8129308219286]
[null,null,3.5680000000000027,-35.069544730623996,null,-25.45745735510446]
[null,null,3.5840000000000027,-35.099939876864,null,-25.104550738027847]
[null,null,3.6000000000000028,-35.11840000000004,null,-24.754202763347013]
[null,null,3.6160000000000028,-35.12469487206399,null,-24.406405223706148]
[null,null,3.632000000000003,-35.118592692224,null,-24.061149911753503]
[null,null,3.648000000000003,-35.099860086784005,null,-23.718428620134283]
[null,null,3.664000000000003,-35.06826210918399,null,-23.378233141497248]
[null,null,3.680000000000003,-35.02356223999996,null,-23.040555268486585]
[null,null,3.696000000000003,-34.965522386943995,null,-22.70538679375258]
[null,null,3.712000000000003,-34.89390288486398,null,-22.372719509938406]
[null,null,3.728000000000003,-34.80846249574397,null,-22.042545209692314]
[null,null,3.744000000000003,-34.708958408704014,null,-21.714855685660016]
[null,null,3.760000000000003,-34.59514623999996,null,-21.389642730489765]
[null,null,3.776000000000003,-34.46678003302401,null,-21.06689813682778]
[null,null,3.792000000000003,-34.323612258303925,null,-20.74661369731927]
[null,null,3.808000000000003,-34.165393813504,null,-20.42878120461299]
[null,null,3.824000000000003,-33.991874023423954,null,-20.113392451354652]
[null,null,3.840000000000003,-33.80280063999999,null,-19.80043923019048]
[null,null,3.856000000000003,-33.59791984230401,null,-19.489913333768218]
[null,null,3.872000000000003,-33.376976236543975,null,-19.18180655473307]
[null,null,3.888000000000003,{"$f":"x^4-5*x^3+7*x+5","v":-33.13971285606392},null,-18.8761106857343]
[null,null,3.904000000000003,-32.88587116134393,null,-18.572817519415594]
[null,null,3.920000000000003,-32.61519103999993,null,-18.2719188484252]
[null,null,3.936000000000003,-32.327410806783945,null,-17.97340646541036]
[null,null,3.952000000000003,-32.02226720358396,null,-17.677272163016273]
[null,null,3.968000000000003,-31.699495399423924,null,-17.383507733890685,null,null,"Plotting forVariable Window"]
[null,null,3.984000000000003,-31.358828990463948,null,-17.092104970680325]
[null,null,4.000000000000003,-30.99999999999993,null,-16.803055666031412]
[null,null,{"$f":"x0","v":{"v":3.152,"d":"3.1520"}},-30.80694754918401]
[null,null,{"$f":"C1291+0.001","v":{"v":3.153,"d":"3.1530"}},-30.823699979718995,null,{"$f":"(D1292-D1291)/0.001","v":-16.752430534985763},null,null,"x","y",null,null,"#"]
[null,null,{"$f":"C1291-D1291/F1292","v":{"v":1.3130460950817373,"d":"1.3130"}},5.84476063430049]
[null,null,{"$f":"C1293+0.001","v":{"v":1.3140460950817372,"d":"1.3140"}},5.834945171504778,null,{"$f":"(D1294-D1293)/0.001","v":-9.815462795712548},null,"x0",{"$f":"x0","v":3.152},0,{"$f":"x0","v":3.152},0]
[null,null,{"$f":"C1293-D1293/F1294","v":{"v":1.9085106957782543,"d":"1.9085"}},-3.131173683053511,{"$nulls":3},"x0",{"$f":"I1294","v":3.152},{"$f":"D1291","v":-30.80694754918401},{"$f":"K1294","v":3.152},{"$f":"J1295","v":-30.80694754918401}]
[null,null,{"$f":"C1295+0.001","v":{"v":1.9095106957782542,"d":"1.9095"}},-3.151010312483761,null,{"$f":"(D1296-D1295)/0.001","v":-19.836629430249886},null,"x1",{"$f":"C1293","v":{"v":1.3130460950817373,"d":"1.3130"}},0,{"$f":"I1296","v":{"v":1.3130460950817373,"d":"1.3130"}},0]
[null,null,{"$f":"C1295-D1295/F1296","v":{"v":1.750662625164069,"d":"1.7507"}},-0.1795681474819819,{"$nulls":3},"x1",{"$f":"I1296","v":{"v":1.3130460950817373,"d":"1.3130"}},{"$f":"D1293","v":5.84476063430049},{"$f":"IF(M1297<=n,K1296,\"\")","v":{"v":1.3130460950817373,"d":"1.3130"}},{"$f":"IF(M1297<=n,J1297,\"\")","v":5.84476063430049},1]
[null,null,{"$f":"C1297+0.001","v":{"v":1.7516626251640688,"d":"1.7517"}},-0.19708645021068527,null,{"$f":"(D1298-D1297)/0.001","v":-17.51830272870336},null,"x2",{"$f":"C1295","v":{"v":1.9085106957782543,"d":"1.9085"}},0,{"$f":"IF(M1298<=n,I1298,K1297)","v":{"v":1.9085106957782543,"d":"1.9085"}},{"$f":"IF(M1298<=n,J1298,L1297)","v":0},{"$f":"M1299","v":2}]
[null,null,{"$f":"C1297-D1297/F1298","v":{"v":1.7404123086657837,"d":"1.7404"}},-9.0980599856926858E-4,{"$nulls":3},"x2",{"$f":"I1298","v":{"v":1.9085106957782543,"d":"1.9085"}},{"$f":"D1295","v":-3.131173683053511},{"$f":"IF(M1299<=n,K1298,K1297)","v":{"v":1.9085106957782543,"d":"1.9085"}},-3.131173683053511,2]
[null,null,{"$f":"C1299+0.001","v":{"v":1.7414123086657836,"d":"1.7414"}},-0.018266181854407648,null,{"$f":"(D1300-D1299)/0.001","v":-17.35637585583838},null,"x3",{"$f":"C1297","v":{"v":1.750662625164069,"d":"1.7507"}},0,{"$f":"IF(M1300<=n,I1300,K1299)","v":{"v":1.750662625164069,"d":"1.7507"}},0,{"$f":"M1301","v":3}]
[null,null,{"$f":"C1299-D1299/F1300","v":{"v":1.7403598895429133,"d":"1.7404"}},-4.3747975020380636E-7,{"$nulls":3},"x3",{"$f":"I1300","v":{"v":1.750662625164069,"d":"1.7507"}},{"$f":"D1297","v":-0.1795681474819819},{"$f":"IF(M1301<=n,K1300,K1299)","v":{"v":1.750662625164069,"d":"1.7507"}},-0.1795681474819819,3]
[null,null,{"$f":"C1301+0.001","v":{"v":1.7413598895429132,"d":"1.7414"}},-0.017355982053793184,null,{"$f":"(D1302-D1301)/0.001","v":-17.35554457404298},null,"x4",{"$f":"C1299","v":{"v":1.7404123086657837,"d":"1.7404"}},0,{"$f":"IF(M1302<=n,I1302,K1301)","v":{"v":1.750662625164069,"d":"1.7507"}},-0.1795681474819819,{"$f":"M1303","v":4}]
[null,null,{"$f":"C1301-D1301/F1302","v":{"v":1.7403598643359977,"d":"1.7404"}},-1.9990586963558599E-10,{"$nulls":3},"x4",{"$f":"I1302","v":{"v":1.7404123086657837,"d":"1.7404"}},{"$f":"D1299","v":-9.0980599856926858E-4},{"$f":"IF(M1303<=n,K1302,K1301)","v":{"v":1.750662625164069,"d":"1.7507"}},-0.1795681474819819,4]
[null,null,{"$f":"C1303+0.001","v":{"v":1.7413598643359975,"d":"1.7414"}},-0.017355544374197507,null,{"$f":"(D1304-D1303)/0.001","v":-17.355544174291637},null,"x5",{"$f":"C1301","v":{"v":1.7403598895429133,"d":"1.7404"}},0,{"$f":"IF(M1304<=n,I1304,K1303)","v":{"v":1.750662625164069,"d":"1.7507"}},-0.1795681474819819,{"$f":"M1305","v":5}]
[null,null,{"$f":"C1303-D1303/F1304","v":{"v":1.7403598643244793,"d":"1.7404"}},-8.881784197001252e-14,{"$nulls":3},"x5",{"$f":"I1304","v":{"v":1.7403598895429133,"d":"1.7404"}},{"$f":"D1301","v":-4.3747975020380636E-7},{"$f":"IF(M1305<=n,K1304,K1303)","v":{"v":1.750662625164069,"d":"1.7507"}},-0.1795681474819819,5]
[null,null,{"$f":"C1305+0.001","v":{"v":1.7413598643244792,"d":"1.7414"}},-0.017355544174201043,null,{"$f":"(D1306-D1305)/0.001","v":-17.355544174112225},null,"x6",{"$f":"C1303","v":{"v":1.7403598643359977,"d":"1.7404"}},0,{"$f":"IF(M1306<=n,I1306,K1305)","v":{"v":1.750662625164069,"d":"1.7507"}},-0.1795681474819819,{"$f":"M1307","v":6}]
[null,null,{"$f":"C1305-D1305/F1306","v":{"v":1.7403598643244742,"d":"1.7404"}},0,{"$nulls":3},"x6",{"$f":"I1306","v":{"v":1.7403598643359977,"d":"1.7404"}},{"$f":"D1303","v":-1.9990586963558599E-10},{"$f":"IF(M1307<=n,K1306,K1305)","v":{"v":1.750662625164069,"d":"1.7507"}},-0.1795681474819819,6]
[null,null,{"$f":"C1307+0.001","v":{"v":1.741359864324474,"d":"1.7414"}},-0.017355544174112225,null,{"$f":"(D1308-D1307)/0.001","v":-17.355544174112225},null,"x7",{"$f":"C1305","v":{"v":1.7403598643244793,"d":"1.7404"}},0,{"$f":"IF(M1308<=n,I1308,K1307)","v":{"v":1.750662625164069,"d":"1.7507"}},-0.1795681474819819,{"$f":"M1309","v":7}]
[null,null,{"$f":"C1307-D1307/F1308","v":{"v":1.7403598643244742,"d":"1.7404"}},0,{"$nulls":3},"x7",{"$f":"I1308","v":{"v":1.7403598643244793,"d":"1.7404"}},{"$f":"D1305","v":-8.881784197001252e-14},{"$f":"IF(M1309<=n,K1308,K1307)","v":{"v":1.750662625164069,"d":"1.7507"}},-0.1795681474819819,7]
[null,null,{"$f":"C1309+0.001","v":{"v":1.741359864324474,"d":"1.7414"}},-0.017355544174112225,null,{"$f":"(D1310-D1309)/0.001","v":-17.355544174112225},null,"x8",{"$f":"C1307","v":{"v":1.7403598643244742,"d":"1.7404"}},0,{"$f":"IF(M1310<=n,I1310,K1309)","v":{"v":1.750662625164069,"d":"1.7507"}},-0.1795681474819819,{"$f":"M1311","v":8}]
[null,null,{"$f":"C1309-D1309/F1310","v":{"v":1.7403598643244742,"d":"1.7404"}},0,{"$nulls":3},"x8",{"$f":"I1310","v":{"v":1.7403598643244742,"d":"1.7404"}},{"$f":"D1307","v":0},{"$f":"IF(M1311<=n,K1310,K1309)","v":{"v":1.750662625164069,"d":"1.7507"}},-0.1795681474819819,8]
[null,null,{"$f":"C1311+0.001","v":{"v":1.741359864324474,"d":"1.7414"}},-0.017355544174112225,null,{"$f":"(D1312-D1311)/0.001","v":-17.355544174112225},null,"x9",{"$f":"C1309","v":{"v":1.7403598643244742,"d":"1.7404"}},0,{"$f":"IF(M1312<=n,I1312,K1311)","v":{"v":1.750662625164069,"d":"1.7507"}},-0.1795681474819819,{"$f":"M1313","v":9}]
[null,null,{"$f":"C1311-D1311/F1312","v":{"v":1.7403598643244742,"d":"1.7404"}},0,{"$nulls":3},"x9",{"$f":"I1312","v":{"v":1.7403598643244742,"d":"1.7404"}},{"$f":"D1309","v":0},{"$f":"IF(M1313<=n,K1312,K1311)","v":{"v":1.750662625164069,"d":"1.7507"}},-0.1795681474819819,9]
[null,null,{"$f":"C1313+0.001","v":{"v":1.741359864324474,"d":"1.7414"}},-0.017355544174112225,null,{"$f":"(D1314-D1313)/0.001","v":-17.355544174112225},null,"x10",{"$f":"C1311","v":{"v":1.7403598643244742,"d":"1.7404"}},0,{"$f":"IF(M1314<=n,I1314,K1313)","v":{"v":1.750662625164069,"d":"1.7507"}},-0.1795681474819819,{"$f":"M1315","v":10}]
[null,null,{"$f":"C1313-D1313/F1314","v":{"v":1.7403598643244742,"d":"1.7404"}},0,{"$nulls":3},"x10",{"$f":"I1314","v":{"v":1.7403598643244742,"d":"1.7404"}},{"$f":"D1311","v":0},{"$f":"IF(M1315<=n,K1314,K1313)","v":{"v":1.750662625164069,"d":"1.7507"}},-0.1795681474819819,10]
[null,null,{"$f":"C1315+0.001","v":{"v":1.741359864324474,"d":"1.7414"}},-0.017355544174112225,null,{"$f":"(D1316-D1315)/0.001","v":-17.355544174112225},null,"x11",{"$f":"C1313","v":{"v":1.7403598643244742,"d":"1.7404"}},0,{"$f":"IF(M1316<=n,I1316,K1315)","v":{"v":1.750662625164069,"d":"1.7507"}},-0.1795681474819819,{"$f":"M1317","v":11}]
[null,null,{"$f":"C1315-D1315/F1316","v":{"v":1.7403598643244742,"d":"1.7404"}},0,{"$nulls":3},"x11",{"$f":"I1316","v":{"v":1.7403598643244742,"d":"1.7404"}},{"$f":"D1313","v":0},{"$f":"IF(M1317<=n,K1316,K1315)","v":{"v":1.750662625164069,"d":"1.7507"}},-0.1795681474819819,11]
[null,null,{"$f":"C1317+0.001","v":{"v":1.741359864324474,"d":"1.7414"}},-0.017355544174112225,null,{"$f":"(D1318-D1317)/0.001","v":-17.355544174112225},null,"x12",{"$f":"C1315","v":{"v":1.7403598643244742,"d":"1.7404"}},0,{"$f":"IF(M1318<=n,I1318,K1317)","v":{"v":1.750662625164069,"d":"1.7507"}},-0.1795681474819819,{"$f":"M1319","v":12}]
[null,null,{"$f":"C1317-D1317/F1318","v":{"v":1.7403598643244742,"d":"1.7404"}},0,{"$nulls":3},"x12",{"$f":"I1318","v":{"v":1.7403598643244742,"d":"1.7404"}},{"$f":"D1315","v":0},{"$f":"IF(M1319<=n,K1318,K1317)","v":{"v":1.750662625164069,"d":"1.7507"}},-0.1795681474819819,12]
[null,null,{"$f":"C1319+0.001","v":{"v":1.741359864324474,"d":"1.7414"}},-0.017355544174112225,null,{"$f":"(D1320-D1319)/0.001","v":-17.355544174112225},null,"x13",{"$f":"C1317","v":{"v":1.7403598643244742,"d":"1.7404"}},0,{"$f":"IF(M1320<=n,I1320,K1319)","v":{"v":1.750662625164069,"d":"1.7507"}},-0.1795681474819819,{"$f":"M1321","v":13}]
[null,null,{"$f":"C1319-D1319/F1320","v":{"v":1.7403598643244742,"d":"1.7404"}},0,{"$nulls":3},"x13",{"$f":"I1320","v":{"v":1.7403598643244742,"d":"1.7404"}},{"$f":"D1317","v":0},{"$f":"IF(M1321<=n,K1320,K1319)","v":{"v":1.750662625164069,"d":"1.7507"}},-0.1795681474819819,13]
[null,null,{"$f":"C1321+0.001","v":{"v":1.741359864324474,"d":"1.7414"}},-0.017355544174112225,null,{"$f":"(D1322-D1321)/0.001","v":-17.355544174112225},null,"x14",{"$f":"C1319","v":{"v":1.7403598643244742,"d":"1.7404"}},0,{"$f":"IF(M1322<=n,I1322,K1321)","v":{"v":1.750662625164069,"d":"1.7507"}},-0.1795681474819819,{"$f":"M1323","v":14}]
[null,null,{"$f":"C1321-D1321/F1322","v":{"v":1.7403598643244742,"d":"1.7404"}},0,{"$nulls":3},"x14",{"$f":"I1322","v":{"v":1.7403598643244742,"d":"1.7404"}},{"$f":"D1319","v":0},{"$f":"IF(M1323<=n,K1322,K1321)","v":{"v":1.750662625164069,"d":"1.7507"}},-0.1795681474819819,14]
[null,null,{"$f":"C1323+0.001","v":{"v":1.741359864324474,"d":"1.7414"}},{"$nulls":4},"x15",{"$f":"C1321","v":{"v":1.7403598643244742,"d":"1.7404"}},0,{"$f":"IF(M1324<=n,I1324,K1323)","v":{"v":1.750662625164069,"d":"1.7507"}},-0.1795681474819819,{"$f":"M1325","v":15}]
[{"$nulls":7},"x15",{"$f":"I1324","v":{"v":1.7403598643244742,"d":"1.7404"}},{"$f":"D1321","v":0},{"$f":"IF(M1325<=n,K1324,K1323)","v":{"v":1.750662625164069,"d":"1.7507"}},-0.1795681474819819,15]

{"sheet":"Defining Function","index":3,"n_rows":12,"n_cols":1,"rows_kept":12}
["                                                     Defining a Function in Excel"]
[]
["Computers have very specific rules you must follow when defining a function.  If you don't, the program will either not work at all or will work incorrectly."]
[]
["1. The Variable used should be the one named in the instruction, usually x, though sometimes y, t, Q (for an angle theta), "]
[" or even x and y (for a function of two variables). "]
[]
["2.  Order of Operations:  There five arithmetic operations, addition (+), subtraction (-), multiplication (*), division (/), and  exponentiation or power (^).  When computers see any of these operation symbols, they perform the indicated steps in a very particular order.  First, the power is done.  Second, products and quotients of adjacent terms is done.  Third, and last, sums and differences of adjacent terms are done.  So, in 10*x^3 + 5*x – 7, say with x = 2, the first pass only calculates 2^3 and ignores the multiplications and the sums and differences to calculate 2^3 = 8.  The second pass looks at 10*8 + 5*2 – 7 and only does the multiplications, so it produces 80 + 10 -  7.  The third pass looks at the +’s and –‘s to produce 80 + 10 – 7 = 83.  "]
[]
["3.    Parentheses  If you need an operation involving more than two adjacent terms, as in Ö4^3 + 6^2, the computer would take the square root of  4 to produce 2^3 + 6^2;  it would then cube the 2 and square the 6 to produce 8 + 36; and finally it would add the 8 and the 36 to get 44.  If you actually wanted the square root of the entire expression, you would need to use parentheses, as in Ö(4^3 + 6^2) to tell the computer to do all the operations inside the parentheses before taking the square root.  Therefore, it would calculate (4^3 + 6^2) = 64 + 36 = 100 and then take the square root of Ö100  =  10."]
[]
["4.  Built-In Functions  Computer programs have built-in functions for most common algebraic functions.  In Excel, the square root function is denoted by SQRT(…), so SQRT(100) = 10.  Alternatively, you could enter it as 100^.5 or 100^(1/2); notice that parentheses are needed to have the ½ done first.  The common trig functions are SIN (…), COS (…), and TAN (…), where the arguments are automatically interpreted as being in radians, not degrees.  The logarithm to the base 10 is represented by LOG (…) and the logarithm with the base e, known as the natural logarithm, is LN (…). The corresponding exponential function with base e is EXP (x).  If x is the variable, then each of these would be SQRT (x), SIN (x), COS (x), TAN (x), LOG (x) (for log with base 10 ), LN (x) (for log with base e ), and EXP (x)."]

{"sheet":"Sheet3","index":4,"n_rows":0,"n_cols":0,"rows_kept":0}