{"text_format":"3","workbook":"xlsx","n_sheets":4,"sheets":["Sheet1","Sheet2","Defining Function","Sheet3"],"not_rendered":{"charts":2,"images":2,"macros":1,"external_links":4,"defined_names":25,"comments":1},"read":"whole","date_system":"1900"}

{"sheet":"Sheet1","index":0,"n_rows":42,"n_cols":11,"rows_kept":42,"merged":[[35,2,35,3]]}
["        Approximating Parametric Curves"]
["               With Newton Interpolation"]
[]
[null,"       This graphing utility produces the graph "]
[null,"  of any curve based on the parametric functions"]
[null,null,"      x = f(t)    and    y = g(t)"]
[null,"       and its Newton Interpolating Polynomials"]
[null,"            on any interval from t = a  to t = b."]
[]
[]
["Enter the first function in terms of t:   x = f(t) =  ",{"$nulls":4},"sin(2*t)"]
[]
[]
["Enter the second function in terms of t:  y = g(t) = ",{"$nulls":4},"cos(3*t)"]
[]
[]
["Now enter the interval for t :  "]
[null,"   Starting value a =",null,-1]
[null,"   Ending value b =",null,2]
[{"$nulls":8},"The graph of the parametric function:"]
[{"$nulls":9},"x =",{"$f":"F11","v":"sin(2*t)"}]
["Select the degree n (1 to 6) for the interpolating polynomial:  ",{"$nulls":8},"y =",{"$f":"F14","v":"cos(3*t)"}]
[null,4,null,null,"n =",{"$f":"B23","v":4}]
[{"$nulls":8},"Now trace along the parametric curve:"]
[{"$nulls":8},"t  = ",{"$f":"D18+2*K25*Sheet2!B12","v":{"v":0.600997506234414,"d":"0.601"}},107]
[{"$nulls":8},"x =",{"$f":"LOOKUP(J25,Sheet2!C3:C404,Sheet2!D3:D404)","v":{"v":0.9327601389340424,"d":"0.933"}}]
["Click each item below for suggestions and investigations",{"$nulls":7},"y =",{"$f":"LOOKUP(J25,Sheet2!C3:C404,Sheet2!E3:E404)","v":{"v":-0.23011533027725442,"d":"-0.230"}}]
[null,null,"   Item 1"]
[null,null,"   Item 2",{"$nulls":5},"On the Newton Interpolating Polynomial Curve:"]
[null,null,"   Item 3",{"$nulls":5},"x =",{"$f":"LOOKUP(J25,Sheet2!X3:X405)","v":{"v":0.5904057632575467,"d":"0.590"}}]
{"$rows_left_out":13}
{"sheet":"Sheet2","index":1,"n_rows":411,"n_cols":31,"rows_kept":411}
[null,null,"t","x = f(t)","y = g(t)",null,"Tracing point",null,null,"x","Dx","D^2 x","D^3 x","D^4 x","D^5 x","D^6 x",null,"linear","quad","cubic","quartic","quintic","6th","x-interpol","linear","quad","cubic","quartic","quintic","6th","y-interpol"]
[{"$nulls":9},{"$f":"D405","v":-0.9092974268256817},{"$f":"J3-J2","v":0.19194133592615892},{"$f":"K3-K2","v":0.9148330972820143},{"$f":"L3-L2","v":-1.4114522697573326},{"$f":"M3-M2","v":0.633330728614196},{"$f":"N3-N2","v":0.9923263335691623},-2.073175239162901]
[null,null,{"$f":"a","v":-1},{"$f":"SIN(2*t)","v":-0.9092974268256817},{"$f":"COS(3*t)","v":-0.9899924966004454},null,0,0,null,{"$f":"D406","v":-0.7173560908995228},{"$f":"J4-J3","v":1.1067744332081733},-0.4966191724753184,-0.7781215411431366,1.6256570621833584,-1.0808489055937387,null,null,{"$f":"$J$2+$K$2*(t-B$16)/dtt","v":-1.0052680947887611},{"$f":"R3+$L$2*(t-$B$16)*(t-$B$17)/dtt^2/2","v":-0.6622056833080057},{"$f":"S3+$M$2*(t-$B$16)*(t-$B$17)*(t-$B$18)/dtt^3/6","v":-0.2211268490088391},{"$f":"T3+$N$2*(t-$B$16)*(t-$B$17)*(t-$B$18)*(t-$B$19)/dtt^4/24","v":-0.04795047790339482},{"$f":"U3+$O$2*(t-$B$16)*(t-$B$17)*(t-$B$18)*(t-$B$19)*(t-$B$20)/dtt^5/120","v":-0.29215578655518093},{"$f":"V3+$P$2*(t-$B$16)*(t-$B$17)*(t-$B$18)*(t-$B$19)*(t-$B$20)*(t-$B$20)/dtt^6/720","v":-0.67480238831474},{"$f":"IF(n=1,R3,IF(n=2,S3,IF(n=3,T3,IF(n=4,U3,IF(n=5,V3,W3)))))","v":-0.04795047790339482},{"$f":"$J$13+$K$13*(t-$B$16)/dtt","v":-1.666167622139005},{"$f":"Y3+$L$13*(t-$B$16)*(t-$B$17)/dtt^2/2","v":-1.9996822686305478},{"$f":"Z3+$M$13*(t-$B$16)*(t-$B$17)*(t-$B$18)/dtt^3/6","v":-1.6445776435556054},{"$f":"AA3+$N$13*(t-$B$16)*(t-$B$17)*(t-$B$18)*(t-$B$19)/dtt^4/24","v":-0.2850725845545701},{"$f":"AB3+$O$13*(t-$B$16)*(t-$B$17)*(t-$B$18)*(t-$B$19)*(t-$B$20)/dtt^5/120","v":2.0316632414485873},{"$f":"AC3+$P$13*(t-$B$16)*(t-$B$17)*(t-$B$18)*(t-$B$19)*(t-$B$20)*(t-$B$21)/dtt^6/720","v":4.49117954608751},{"$f":"IF(n=1,Y3,IF(n=2,Z3,IF(n=3,AA3,IF(n=4,AB3,IF(n=5,AC3,AD3)))))","v":-0.2850725845545701}]
[null,null,{"$f":"C3+B$12","v":-0.9925187032418953},-0.9154220459574589,-0.9865761474177305,null,{"$f":"Sheet1!J26","v":0.9327601389340424},{"$f":"Sheet1!J27","v":-0.23011533027725442},null,0.3894183423086504,0.6101552607328549,-1.274740713618455,{"$f":"L5-L4","v":0.8475355210402218},{"$f":"M5-M4","v":0.5448081565896197},{"$nulls":3},{"v":-1.00287481129841,"d":"-1.00287"},{"v":-0.6711481809778116,"d":"-0.67115"},{"v":-0.24677107941403864,"d":"-0.24677"},{"v":-0.08074572625657897,"d":"-0.08075"},{"v":-0.3142182850680463,"d":"-0.31422"},{"v":-0.6790340251808186,"d":"-0.67903"},{"v":-0.08074572625657897,"d":"-0.08075"},{"$f":"$J$13+$K$13*(t-B$16)/dtt","v":-1.649305399556996},-1.9717997508491407,-1.630141389978935,-0.32677473493702136,1.8881412485579157,4.234231739317065,{"$f":"IF(n=1,Y4,IF(n=2,Z4,IF(n=3,AA4,IF(n=4,AB4,IF(n=5,AC4,AD4)))))","v":-0.32677473493702136}]
[null,null,{"$f":"C4+B$12","v":-0.9850374064837906},-0.9213417249531227,-0.9826628528585872,{"$nulls":4},0.9995736030415052,-0.6645854528856001,-0.4272051925782332,{"$f":"L6-L5","v":1.3923436776298415},{"$nulls":4},{"v":-1.000481527808059,"d":"-1.00048"},{"v":-0.6799484480182555,"d":"-0.67995"},{"v":-0.2719466540978133,"d":"-0.27195"},{"v":-0.11289834901103865,"d":"-0.11290"},{"v":-0.3359380054512615,"d":"-0.33594"},{"v":-0.6834833087611462,"d":"-0.68348"},{"v":-0.11289834901103865,"d":"-0.11290"},-1.632443176974987,-1.9440555052785167,-1.61558060965078,-0.3669866241621178,1.7489541207268484,3.9851151374718476,-0.3669866241621178]
[null,null,-0.9775561097256859,-0.9270551385443725,-0.9782545840771357,{"$nulls":4},0.3349881501559051,-1.0917906454638333,0.9651384850516084,{"$nulls":5},{"v":-0.9980882443177079,"d":"-0.99809"},{"v":-0.6886064844293374,"d":"-0.68861"},{"v":-0.2966563092302556,"d":"-0.29666"},{"v":-0.14441351486002799,"d":"-0.14441"},{"v":-0.3573146754096317,"d":"-0.35731"},{"v":-0.6881376066075617,"d":"-0.68814"},{"v":-0.14441351486002799,"d":"-0.14441"},-1.6155809543929782,-1.9164495319186758,-1.6008975054124,-0.40572955136885924,1.6140289410487842,3.7436818583761164,-0.40572955136885924]
[null,null,-0.9700748129675811,-0.932561007640581,-0.973353561549509,{"$nulls":4},-0.7568024953079282,-0.12665216041222493,{"$nulls":6},{"v":-0.9956949608273568,"d":"-0.99569"},{"v":-0.697122290211057,"d":"-0.69712"},{"v":-0.320902780981458,"d":"-0.32090"},{"v":-0.17529637718828533,"d":"-0.17530"},{"v":-0.3783480667061838,"d":"-0.37835"},{"v":-0.692984516812886,"d":"-0.69298"},{"v":-0.17529637718828533,"d":"-0.17530"},-1.5987187318109692,-1.8889818307696176,-1.586094280105054,-0.44302469551816115,1.4832934759977412,3.5097857926555953,-0.44302469551816115]
[null,null,-0.9625935162094764,-0.9378580996151504,-0.9679622539553844,null,"Vertical line",null,null,-0.8834546557201531,{"$nulls":7},{"v":-0.9933016773370057,"d":"-0.99330"},{"v":-0.7054958653634147,"d":"-0.70550"},{"v":-0.3446888055215139,"d":"-0.34469"},{"v":-0.2055520740720342,"d":"-0.20555"},{"v":-0.39903799486309127,"d":"-0.39904"},{"v":-0.6980118659609624,"d":"-0.69801"},{"v":-0.2055520740720342,"d":"-0.20555"},-1.5818565092289605,-1.8616524018313425,-1.5711731365700021,-0.47889311539285595,1.356676172591059,3.283282591144647,-0.47889311539285595]
[null,null,-0.9551122194513717,-0.9429452285814669,-0.962083376934491,{"$nulls":12},{"v":-0.9909083938466545,"d":"-0.99091"},{"v":-0.7137272098864101,"d":"-0.71373"},{"v":-0.3680171190205154,"d":"-0.36802"},{"v":-0.23518572827898113,"d":"-0.23519"},{"v":-0.419384318862595,"d":"-0.41938"},{"v":-0.7032077070844854,"d":"-0.70321"},{"v":-0.23518572827898113,"d":"-0.23519"},-1.5649942866469515,-1.8344612451038502,-1.5561362776485035,-0.5133557495976881,1.2341061555521158,3.0640296523344355,-0.5133557495976881]
[null,null,-0.947630922693267,-0.9478212556583911,-0.9557198917187231,null,{"$f":"t0","v":0.600997506234414},{"$f":"MIN(0,LOOKUP(t0,C3:C404,D3:D404),LOOKUP(t0,C3:C404,E3:E404))","v":-0.23011533027725442},{"$nulls":9},{"v":-0.9885151103563035,"d":"-0.98852"},{"v":-0.7218163237800437,"d":"-0.72182"},{"v":-0.39089045764855573,"d":"-0.39089"},{"v":-0.26420244726831754,"d":"-0.26420"},{"v":-0.4393869408479282,"d":"-0.43939"},{"v":-0.7085603176306239,"d":"-0.70856"},{"v":-0.26420244726831754,"d":"-0.26420"},-1.5481320640649425,-1.8074083605871407,-1.540985906181818,-0.546433416559319,1.115513224473031,2.851886109862039,-0.546433416559319]
[null,null,-0.9401496259351623,-0.9524850892252249,-0.9488750036405472,null,{"$f":"t0","v":0.600997506234414},{"$f":"MAX(0,LOOKUP(t0,C3:C404,D3:D404),LOOKUP(t0,C3:C404,E3:E404))","v":0.9327601389340424},{"$nulls":9},{"v":-0.9861218268659524,"d":"-0.98612"},{"v":-0.7297632070443152,"d":"-0.72976"},{"v":-0.41331155757572746,"d":"-0.41331"},{"v":-0.2926073231907189,"d":"-0.29261"},{"v":-0.45904580582423943,"d":"-0.45905"},{"v":-0.7140581974344327,"d":"-0.71406"},{"v":-0.2926073231907189,"d":"-0.29261"},-1.5312698414829335,-1.7804937482812142,-1.5257242250112053,-0.5781468145263228,1.0008278509773754,2.6467128200405527,-0.5781468145263228]
["delta t = ",{"$f":"(Sheet1!D19-Sheet1!D18)/401","v":7.481296758104738E-3},-0.9326683291770576,-0.9569356851660983,-0.9415521605184533,{"$nulls":4},"y","Dx","D^2 x","D^3 x","D^4 x","D^5 x","D^6 x",null,{"v":-0.9837285433756012,"d":"-0.98373"},{"v":-0.7375678596792244,"d":"-0.73757"},{"v":-0.43528315497212305,"d":"-0.43528"},{"v":-0.3204054328883443,"d":"-0.32041"},{"v":-0.4783609013595145,"d":"-0.47836"},{"v":-0.7196900667000548,"d":"-0.71969"},{"v":-0.3204054328883443,"d":"-0.32041"},-1.5144076189009248,-1.7537174081860707,-1.5103534369779248,-0.6085165215691903,0.8899811758828748,2.4483723494301453,-0.6085165215691903]
[null,null,-0.9251870324189528,-0.9611720471037205,-0.9337550509202638,{"$nulls":4},{"$f":"E405","v":-0.9899924966004454},{"$f":"J14-J13","v":1.3523502510771188},{"$f":"K14-K13","v":-0.8893723906441139},{"$f":"L14-L13","v":-1.136334800239815},{"$f":"M14-M13","v":4.971904215775213},{"$f":"N14-N13","v":-9.414037642171559},{"$f":"O14-O13","v":10.90279089155955},null,{"v":-0.9813352598852502,"d":"-0.98134"},{"v":-0.7452302816847718,"d":"-0.74523"},{"v":-0.4568079860078356,"d":"-0.45681"},{"v":-0.3476018378948381,"d":"-0.34760"},{"v":-0.4973322572855022,"d":"-0.49733"},{"v":-0.7254448639897185,"d":"-0.72544"},{"v":-0.3476018378948381,"d":"-0.34760"},-1.4975453963189158,-1.72707934030171,-1.4948757449232362,-0.6375629955803265,0.7829050063641197,2.2567289624501057,-0.6375629955803265]
["dtt =",{"$f":"(b-a)/(n+1)","v":0.6},-0.9177057356608481,-0.9651932266224446,-0.9254876023051763,{"$nulls":4},{"$f":"E406","v":0.3623577544766734},{"$f":"J15-J14","v":0.46297786043300493},{"$f":"K15-K14","v":-2.025707190883929},{"$f":"L15-L14","v":3.8355694155353977},{"$f":"M15-M14","v":-4.442133426396346},1.4887532493879903,null,null,{"v":-0.9789419763948991,"d":"-0.97894"},{"v":-0.752750473060957,"d":"-0.75275"},{"v":-0.4778887868529577,"d":"-0.47789"},{"v":-0.37420158443532797,"d":"-0.37420"},{"v":-0.515959945398635,"d":"-0.51596"},{"v":-0.7313117442205197,"d":"-0.73131"},{"v":-0.37420158443532797,"d":"-0.37420"},-1.4806831737369068,-1.700579544628132,-1.4792933516883986,-0.6653065742740495,0.6795318131152771,2.0716486090318607,-0.6653065742740495]
[null,null,-0.9102244389027434,-0.9689983234805933,-0.9167539790454746,{"$nulls":4},0.8253356149096783,-1.5627293304509238,1.809862224651469,{"$f":"L16-L15","v":-0.6065640108609482},{"$f":"M16-M15","v":-2.9533801770083556},{"$nulls":3},{"v":-0.9765486929045479,"d":"-0.97655"},{"v":-0.7601284338077801,"d":"-0.76013"},{"v":-0.49852829367758195,"d":"-0.49853"},{"v":-0.40020970342642603,"d":"-0.40021"},{"v":-0.5342440791609537,"d":"-0.53424"},{"v":-0.7372800766689991,"d":"-0.73728"},{"v":-0.40020970342642603,"d":"-0.40021"},-1.463820951154898,-1.6742180211653372,-1.4636084601146724,-0.691767475186595,0.5797947275127917,1.8929989123129467,-0.691767475186595]
["T00 =",{"$f":"a+dtt/2","v":-0.7},-0.9027431421446387,-0.9725864858120014,-0.9075585803289048,{"$nulls":4},-0.7373937155412454,0.24713289420054524,1.2032982137905208,{"$f":"L17-L16","v":-3.559944187869304},{"$nulls":4},{"v":-0.9741554094141969,"d":"-0.97416"},{"v":-0.7673641639252412,"d":"-0.76736"},{"v":-0.5187292426518013,"d":"-0.51873"},{"v":-0.4256312104762288,"d":"-0.42563"},{"v":-0.5521848134010308,"d":"-0.55218"},{"v":-0.7433394429835101,"d":"-0.74334"},{"v":-0.4256312104762288,"d":"-0.42563"},-1.446958728572889,-1.6479947699133253,-1.4478232730433167,-0.7169657956761116,0.4836275387780956,1.720649156371974,-0.7169657956761116]
["T01 =",{"$f":"B16+dtt","v":-0.09999999999999998},-0.895261845386534,-0.9759569103167265,-0.8979060379427737,{"$nulls":4},-0.4902608213407002,1.4504311079910661,-2.3566459740787833,{"$nulls":5},{"v":-0.9717621259238458,"d":"-0.97176"},{"v":-0.7744576634133402,"d":"-0.77446"},{"v":-0.5384943699457084,"d":"-0.53849"},{"v":-0.4504711058843169,"d":"-0.45047"},{"v":-0.5697823440148926,"d":"-0.56978"},{"v":-0.7494796352043749,"d":"-0.74948"},{"v":-0.4504711058843169,"d":"-0.45047"},-1.4300965059908801,-1.6219097908720963,-1.4319399933155912,-0.7409215129226635,0.39096469114031673,1.554470274004553,-0.7409215129226635]
["T02 =",{"$f":"B17+dtt","v":0.5},-0.8877805486284293,-0.9791088424408886,-0.8878012139408841,{"$nulls":4},0.960170286650366,-0.9062148660877171,{"$nulls":6},{"v":-0.9693688424334946,"d":"-0.96937"},{"v":-0.7814089322720771,"d":"-0.78141"},{"v":-0.5578264117293961,"d":"-0.55783"},{"v":-0.47473437464175494,"d":"-0.47473"},{"v":-0.5870369076669435,"d":"-0.58704"},{"v":-0.7556906537918353,"d":"-0.75569"},{"v":-0.47473437464175494,"d":"-0.47473"},-1.4132342834088711,-1.59596308404165,-1.4159608237727552,-0.7636544839282288,0.3017412809989891,1.3943348345402042,-0.7636544839282288]
["T03 =",{"$f":"B18+dtt","v":1.1},-0.8802992518703245,-0.9820415765455952,-0.8772491981944847,{"$nulls":4},0.05395542056264886,{"$nulls":7},{"v":-0.9669755589431436,"d":"-0.96698"},{"v":-0.788217970501452,"d":"-0.78822"},{"v":-0.5767281041729568,"d":"-0.57673"},{"v":-0.4984259864310918,"d":"-0.49843"},{"v":-0.6039487814908886,"d":"-0.60395"},{"v":-0.7619627056617914,"d":"-0.76196"},{"v":-0.4984259864310918,"d":"-0.49843"},-1.3963720608268624,-1.570154649421987,-1.3998879672560687,-0.7851844455167011,0.21589305408675463,1.2401170317002217,-0.7851844455167011]
["T04 =",{"$f":"B19+dtt","v":1.7000000000000002},-0.8728179551122198,-0.9847544560649167,-0.8662553058284657,{"$nulls":12},{"v":-0.9645822754527924,"d":"-0.96458"},{"v":-0.7948847781014647,"d":"-0.79488"},{"v":-0.5952021834464835,"d":"-0.59520"},{"v":-0.5215508956263606,"d":"-0.52155"},{"v":-0.6205182827906573,"d":"-0.62052"},{"v":-0.768286202229333,"d":"-0.76829"},{"v":-0.5215508956263606,"d":"-0.52155"},-1.3795098382448534,-1.5444844870131065,-1.3837236266067907,-0.8055310143338886,0.13335640263207482,1.0916926714965232,-0.8055310143338886]
["T05 =",{"$f":"B20+dtt","v":2.3000000000000003},-0.8653366583541151,-0.987246873652875,-0.8548250745440927,{"$nulls":12},{"v":-0.9621889919624413,"d":"-0.96219"},{"v":-0.8014093550721155,"d":"-0.80141"},{"v":-0.613251385720069,"d":"-0.61325"},{"v":-0.5441140412930789,"d":"-0.54411"},{"v":-0.6367457687413268,"d":"-0.63675"},{"v":-0.7746517574600611,"d":"-0.77465"},{"v":-0.5441140412930789,"d":"-0.54411"},-1.3626476156628446,-1.5189525968150093,-1.3674700046661816,-0.8247136868475147,0.0540683625219367,0.9489391601714707,-0.8247136868475147]
["T06 =",{"$f":"B21+dtt","v":2.9000000000000004},-0.8578553615960104,-0.989518271319413,-0.8429642618296281,{"$nulls":12},{"v":-0.9597957084720903,"d":"-0.95980"},{"v":-0.8077917014134042,"d":"-0.80779"},{"v":-0.6308784471638058,"d":"-0.63088"},{"v":-0.5661203471882482,"d":"-0.56612"},{"v":-0.6526316360900445,"d":"-0.65263"},{"v":-0.7810501859292008,"d":"-0.78105"},{"v":-0.5661203471882482,"d":"-0.56612"},-1.3457853930808357,-1.4935589788276946,-1.3511293042755002,-0.8427518393472165,-0.022033389535438097,0.8117354921786616,-0.8427518393472165]
[null,null,-0.8503740648379057,-0.9915681405553145,-0.8306788420602421,{"$nulls":12},{"v":-0.9574024249817391,"d":"-0.95740"},{"v":-0.8140318171253307,"d":"-0.81403"},{"v":-0.6480861039477867,"d":"-0.64809"},{"v":-0.5875747217603537,"d":"-0.58757"},{"v":-0.6681763208569513,"d":"-0.66818"},{"v":-0.7874725008885044,"d":"-0.78747"},{"v":-0.5875747217603537,"d":"-0.58757"},-1.3289231704988267,-1.4683036330511632,-1.3347037282760068,-0.8596647279445473,-0.0950105388478859,0.679962238204693,-0.8596647279445473]
[null,null,-0.842892768079801,-0.9933960224460472,-0.8179750034886792,{"$nulls":12},{"v":-0.955009141491388,"d":"-0.95501"},{"v":-0.8201297022078953,"d":"-0.82013"},{"v":-0.6648770922421046,"d":"-0.66488"},{"v":-0.6084820581493661,"d":"-0.60848"},{"v":-0.6833802980361064,"d":"-0.68338"},{"v":-0.7939099123409469,"d":"-0.79391"},{"v":-0.6084820581493661,"d":"-0.60848"},-1.3120609479168177,-1.4431865594854143,-1.3181954795089599,-0.8754714885729731,-0.16492413557659458,0.5535015332318942,-0.8754714885729731]
[null,null,-0.8354114713216962,-0.9950015077745016,-0.8048591451281916,{"$nulls":12},{"v":-0.952615858001037,"d":"-0.95262"},{"v":-0.8260853566610977,"d":"-0.82609"},{"v":-0.6812541482168519,"d":"-0.68125"},{"v":-0.6288472341867389,"d":"-0.62885"},{"v":-0.6982440812964084,"d":"-0.69824"},{"v":-0.8003538251232102,"d":"-0.80035"},{"v":-0.6288472341867389,"d":"-0.62885"},-1.2951987253348087,-1.4182077581304486,-1.3016067608156203,-0.8901911369878779,-0.2318345975733973,0.4322370646420366,-0.8901911369878779]
[null,null,-0.8279301745635915,-0.996384237112605,-0.7913378735293088,{"$nulls":12},{"v":-0.9502225745106858,"d":"-0.95022"},{"v":-0.831898780484938,"d":"-0.83190"},{"v":-0.6972200080421217,"d":"-0.69722"},{"v":-0.6486751123954106,"d":"-0.64868"},{"v":-0.7127682226825197,"d":"-0.71277"},{"v":-0.8067958369959611,"d":"-0.80680"},{"v":-0.6486751123954106,"d":"-0.64868"},-1.2783365027528,-1.3933672289862657,-1.2849397750372469,-0.903842568766557,-0.29580171321805904,0.3160540603610196,-0.903842568766557]
[null,null,-0.8204488778054868,-0.9975439009017882,-0.7774179994520748,{"$nulls":12},{"v":-0.9478292910203348,"d":"-0.94783"},{"v":-0.8375699736794164,"d":"-0.83757"},{"v":-0.7127774078880066,"d":"-0.71278"},{"v":-0.6679705399898037,"d":"-0.66797"},{"v":-0.7269533123157895,"d":"-0.72695"},{"v":-0.8132277367419173,"d":"-0.81323"},{"v":-0.6679705399898037,"d":"-0.66797"},-1.261474280170791,-1.3686649720528659,-1.2681967250150996,-0.9164445593082229,-0.3568846442555752,0.20483927704451776,-0.9164445593082229]
[null,null,-0.8129675810473821,-0.9984802395222881,-0.7631065344354174,{"$nulls":12},{"v":-0.9454360075299837,"d":"-0.94544"},{"v":-0.8430989362445327,"d":"-0.84310"},{"v":-0.7279290839245993,"d":"-0.72793"},{"v":-0.686738348875825,"d":"-0.68674"},{"v":-0.7407999780951776,"d":"-0.74080"},{"v":-0.819641502271707,"d":"-0.81964"},{"v":-0.686738348875825,"d":"-0.68674"},-1.244612057588782,-1.3441009873302487,-1.2513798135904375,-0.9280157638340012,-0.41514192863346067,0.0984809883046096,-0.9280157638340012]
[null,null,-0.8054862842892774,-0.9991930433512698,-0.7484106872653881,{"$nulls":12},{"v":-0.9430427240396325,"d":"-0.94304"},{"v":-0.8484856681802867,"d":"-0.84849"},{"v":-0.7426777723219923,"d":"-0.74268"},{"v":-0.7049833556508649,"d":"-0.70498"},{"v":-0.7543088853981759,"d":"-0.75431"},{"v":-0.826029298737516,"d":"-0.82603"},{"v":-0.7049833556508649,"d":"-0.70498"},-1.2277498350067733,-1.3196752748184148,-1.2344912436045208,-0.9385747173869343,-0.4706314833390447,-3.1310270226271864E-3,-0.9385747173869343]
[null,null,-0.7980049875311727,-0.999682152809756,-0.7333378603440447,{"$nulls":12},{"v":-0.9406494405492815,"d":"-0.94065"},{"v":-0.8537301694866789,"d":"-0.85373"},{"v":-0.7570262092502789,"d":"-0.75703"},{"v":-0.7227103616037991,"d":"-0.72271"},{"v":-0.7674807367817343,"d":"-0.76748"},{"v":-0.8323834766545315,"d":"-0.83238"},{"v":-0.7227103616037991,"d":"-0.72271"},-1.2108876124247643,-1.2953878345173635,-1.2175332178986085,-0.9481398348319772,-0.5234106072367588,-0.10010549656853934,-0.9481398348319772]
{"$rows_left_out":382}
{"sheet":"Defining Function","index":2,"n_rows":12,"n_cols":1,"rows_kept":12}
["                                                     Defining a Function in Excel"]
[]
["Computers have very specific rules you must follow when defining a function.  If you don't, the program will either not work at all or will work incorrectly."]
[]
["1. The Variable used should be the one named in the instruction, usually x, though sometimes y, t, Q (for an angle theta), "]
[" or even x and y (for a function of two variables). "]
[]
["2.  Order of Operations:  There five arithmetic operations, addition (+), subtraction (-), multiplication (*), division (/), and  exponentiation or power (^).  When computers see any of these operation symbols, they perform the indicated steps in a very particular order.  First, the power is done.  Second, products and quotients of adjacent terms is done.  Third, and last, sums and differences of adjacent terms are done.  So, in 10*x^3 + 5*x – 7, say with x = 2, the first pass only calculates 2^3 and ignores the multiplications and the sums and differences to calculate 2^3 = 8.  The second pass looks at 10*8 + 5*2 – 7 and only does the multiplications, so it produces 80 + 10 -  7.  The third pass looks at the +’s and –‘s to produce 80 + 10 – 7 = 83.  "]
[]
["3.    Parentheses  If you need an operation involving more than two adjacent terms, as in Ö4^3 + 6^2, the computer would take the square root of  4 to produce 2^3 + 6^2;  it would then cube the 2 and square the 6 to produce 8 + 36; and finally it would add the 8 and the 36 to get 44.  If you actually wanted the square root of the entire expression, you would need to use parentheses, as in Ö(4^3 + 6^2) to tell the computer to do all the operations inside the parentheses before taking the square root.  Therefore, it would calculate (4^3 + 6^2) = 64 + 36 = 100 and then take the square root of Ö100  =  10."]
[]
["4.  Built-In Functions  Computer programs have built-in functions for most common algebraic functions.  In Excel, the square root function is denoted by SQRT(…), so SQRT(100) = 10.  Alternatively, you could enter it as 100^.5 or 100^(1/2); notice that parentheses are needed to have the ½ done first.  The common trig functions are SIN (…), COS (…), and TAN (…), where the arguments are automatically interpreted as being in radians, not degrees.  The logarithm to the base 10 is represented by LOG (…) and the logarithm with the base e, known as the natural logarithm, is LN (…). The corresponding exponential function with base e is EXP (x).  If x is the variable, then each of these would be SQRT (x), SIN (x), COS (x), TAN (x), LOG (x) (for log with base 10 ), LN (x) (for log with base e ), and EXP (x)."]

{"sheet":"Sheet3","index":3,"n_rows":0,"n_cols":0,"rows_kept":0}