{"text_format":"3","workbook":"xlsx","n_sheets":3,"sheets":["Sheet1","Sheet2","Sheet3"],"not_rendered":{"charts":2,"images":3,"macros":1,"defined_names":22,"comments":1},"read":"whole","date_system":"1900"}

{"sheet":"Sheet1","index":0,"n_rows":38,"n_cols":13,"rows_kept":38,"merged":[[31,2,31,3]]}
[null,"            The Pendulum and"]
[null,"       Simple Harmonic Motion"]
[]
[null,"        This DIGMath program lets you "]
[null," investigate the motion of a simple pendulum"]
[null," based on the 2nd order differential equation"]
[null,null,"        q'' =g/L sin(q)"]
[null,"         with initial condition q(0) = q0"]
[null,"      extending from t = 0  to  t = tMax."]
[]
["What is the length L (in feet, 0.5 - 10) of the pendulum?"]
[null,null,{"$f":"E12/10","v":5.4},null,54]
[]
["What is the initial angle q0 ( -6° to +6°)?"]
[null,null,{"$f":"E15/2-6","v":5},null,22]
[]
[{"$nulls":7},"Trace a point along the path of the pendulum"]
["To what value of t should the solution extend?",{"$nulls":6},"     t =",{"$f":"K18*dt","v":10.96},null,274]
[null,null,"   tMax =",20,{"$nulls":4},"     q =",{"$f":"LOOKUP(t0+0.001,Sheet2!C3:C503,Sheet2!D3:D503)","v":{"v":0.06562804057482095,"d":"0.07"}},"radians =",{"$f":"180/PI()*J19","v":{"v":3.7602097426505616,"d":"3.76"}},"°"]
[null,null,{"$f":"IF(b<=0,\"That must be larger than 0\",\"\")","v":""},{"$nulls":5},"    x =",{"$f":"LOOKUP(t0+0.001,Sheet2!C3:C503,Sheet2!E3:E503)","v":{"v":0.3541370775640254,"d":"0.35"}}]
[{"$nulls":8},"   y =",{"$f":"LOOKUP(t0+0.001,Sheet2!C3:C503,Sheet2!F3:F503)","v":{"v":-5.388375166067635,"d":"-5.39"}}]
[]
["Click each item below for suggestions and investigations"]
[null,"   Item 1"]
[null,"   Item 2"]
[null,"   Item 3"]
[null,"   Item 4"]
[]
[]
[]
["To access/download all the DIGMath Apps for Calculus"]
["     Click this link:",null,"DIGMath for Calculus"]
[]
["Created by:  Sheldon P. Gordon   "]
["                      Farmingdale State College    "]
["Development of this module was supported by the "]
["NSF's Division of Undergraduate Education  "]
["under grants DUE-0310123 and DUE-0442160."]

{"sheet":"Sheet2","index":1,"n_rows":503,"n_cols":9,"rows_kept":503}
[{"$nulls":4},"Taylor - linear"]
[null,null,"t","q(t)","x","y","Plotting q","Plotting x","Plotting y"]
[null,null,{"$f":"0","v":0},{"$f":"qq0","v":0.08726646259971647},{"$f":"L*SIN(D3)","v":0.4706410108373541},{"$f":"-L*COS(D3)","v":-5.379451369695427},{"$f":"IF(ABS(qq0)<=0.10473,D3,#REF!)","v":0.08726646259971647},{"$f":"IF(ABS(qq0)<0.1,E3,#REF!)","v":0.4706410108373541},{"$f":"IF(ABS(qq0)<0.1,F3,#REF!)","v":-5.379451369695427}]
["delta q = ",{"$f":"b/2/PI()/SQRT(L/g)*qq0/500","v":1.3524013765559657E-3},{"$f":"C3+dt","v":0.04},{"$f":"IF(qq0>0,qq0-dq,qq0+dq)","v":0.0859140612231605},0.46336540521890174,-5.380082945573082,{"$f":"IF(ABS(qq0)<=0.10473,D4,#REF!)","v":0.0859140612231605},{"$f":"IF(ABS(qq0)<=0.10473,E4,#REF!)","v":0.46336540521890174},{"$f":"IF(ABS(qq0)<=0.10473,F4,#REF!)","v":-5.380082945573082}]
[null,null,0.08,{"$f":"IF(qq0>0,    IF(AND(D4>D3,D4+dq>qq0), D4-dq,    IF( AND(D4>D3, D4+dq<=qq0), D4+dq,\n         IF(AND(D4<D3,D4-dq<-qq0),D4+dq,   D4 - dq)) ),  IF(AND(D4>D3,  D4+dq > -qq0), D4-dq,\n                   IF(  AND(D4>D3, D4+dq< -qq0), D4+dq,   IF(AND(D4<D3,D4-dq<=qq0),  D4+dq,    D4-dq ) ) ) )","v":0.08456165984660453},0.4560889521101255,-5.38070468133711,{"$f":"IF(ABS(qq0)<=0.10473,D5,#REF!)","v":0.08456165984660453},{"$f":"IF(ABS(qq0)<=0.10473,E5,#REF!)","v":0.4560889521101255},{"$f":"IF(ABS(qq0)<=0.10473,F5,#REF!)","v":-5.38070468133711}]
["delta t =",{"$f":"(b)/500","v":0.04},0.12,0.08320925847004856,0.44881166481957946,-5.381316575850363,{"$f":"IF(ABS(qq0)<=0.10473,D6,#REF!)","v":0.08320925847004856},{"$f":"IF(ABS(qq0)<=0.10473,E6,#REF!)","v":0.44881166481957946},{"$f":"IF(ABS(qq0)<=0.10473,F6,#REF!)","v":-5.381316575850363}]
[null,null,0.16,0.0818568570934926,0.4415335566573436,-5.381918627993693,{"$f":"IF(ABS(qq0)<=0.10473,D7,#REF!)","v":0.0818568570934926},{"$f":"IF(ABS(qq0)<=0.10473,E7,#REF!)","v":0.4415335566573436},{"$f":"IF(ABS(qq0)<=0.10473,F7,#REF!)","v":-5.381918627993693}]
["initial angle in radians =",null,0.2,0.08050445571693662,0.43425464093499927,-5.382510836665953,{"$f":"IF(ABS(qq0)<=0.10473,D8,#REF!)","v":0.08050445571693662},{"$f":"IF(ABS(qq0)<=0.10473,E8,#REF!)","v":0.43425464093499927},{"$f":"IF(ABS(qq0)<=0.10473,F8,#REF!)","v":-5.382510836665953}]
[null,{"$f":"q0*PI()/180","v":{"v":0.08726646259971647,"d":"0.087266"}},0.24000000000000002,0.07915205434038065,0.4269749309656045,-5.383093200783999,{"$f":"IF(ABS(qq0)<=0.10473,D9,#REF!)","v":0.07915205434038065},{"$f":"IF(ABS(qq0)<=0.10473,E9,#REF!)","v":0.4269749309656045},{"$f":"IF(ABS(qq0)<=0.10473,F9,#REF!)","v":-5.383093200783999}]
[null,null,0.28,0.07779965296382468,0.4196944400636705,-5.3836657192826936,{"$f":"IF(ABS(qq0)<=0.10473,D10,#REF!)","v":0.07779965296382468},{"$f":"IF(ABS(qq0)<=0.10473,E10,#REF!)","v":0.4196944400636705},{"$f":"IF(ABS(qq0)<=0.10473,F10,#REF!)","v":-5.3836657192826936}]
[null,null,0.32,0.07644725158726871,0.41241318154513634,-5.384228391114907,{"$f":"IF(ABS(qq0)<=0.10473,D11,#REF!)","v":0.07644725158726871},{"$f":"IF(ABS(qq0)<=0.10473,E11,#REF!)","v":0.41241318154513634},{"$f":"IF(ABS(qq0)<=0.10473,F11,#REF!)","v":-5.384228391114907}]
["xMin =",{"$f":"x0","v":1},0.36,0.07509485021071274,0.4051311687273454,-5.384781215251518,{"$f":"IF(ABS(qq0)<=0.10473,D12,#REF!)","v":0.07509485021071274},{"$f":"IF(ABS(qq0)<=0.10473,E12,#REF!)","v":0.4051311687273454},{"$f":"IF(ABS(qq0)<=0.10473,F12,#REF!)","v":-5.384781215251518}]
["xMin =",1,0.39999999999999997,0.07374244883415677,0.3978484149290204,-5.385324190681418,{"$f":"IF(ABS(qq0)<=0.10473,D13,#REF!)","v":0.07374244883415677},{"$f":"IF(ABS(qq0)<=0.10473,E13,#REF!)","v":0.3978484149290204},{"$f":"IF(ABS(qq0)<=0.10473,F13,#REF!)","v":-5.385324190681418}]
[null,null,0.43999999999999995,0.0723900474576008,0.3905649334702394,-5.38585731641151,{"$f":"IF(ABS(qq0)<=0.10473,D14,#REF!)","v":0.0723900474576008},{"$f":"IF(ABS(qq0)<=0.10473,E14,#REF!)","v":0.3905649334702394},{"$f":"IF(ABS(qq0)<=0.10473,F14,#REF!)","v":-5.38585731641151}]
["g =",32,0.4799999999999999,0.07103764608104483,0.3832807376724115,-5.386380591466713,{"$f":"IF(ABS(qq0)<=0.10473,D15,#REF!)","v":0.07103764608104483},{"$f":"IF(ABS(qq0)<=0.10473,E15,#REF!)","v":0.3832807376724115},{"$f":"IF(ABS(qq0)<=0.10473,F15,#REF!)","v":-5.386380591466713}]
[null,null,0.5199999999999999,0.06968524470448886,0.375995840858252,-5.386894014889963,{"$f":"IF(ABS(qq0)<=0.10473,D16,#REF!)","v":0.06968524470448886},{"$f":"IF(ABS(qq0)<=0.10473,E16,#REF!)","v":0.375995840858252},{"$f":"IF(ABS(qq0)<=0.10473,F16,#REF!)","v":-5.386894014889963}]
[null,null,0.5599999999999999,0.0683328433279329,0.3687102563517587,-5.387397585742213,{"$f":"IF(ABS(qq0)<=0.10473,D17,#REF!)","v":0.0683328433279329},{"$f":"IF(ABS(qq0)<=0.10473,E17,#REF!)","v":0.3687102563517587},{"$f":"IF(ABS(qq0)<=0.10473,F17,#REF!)","v":-5.387397585742213}]
["Pendulum",null,0.6,0.06698044195137692,0.3614239974781869,-5.387891303102438,{"$f":"IF(ABS(qq0)<=0.10473,D18,#REF!)","v":0.06698044195137692},{"$f":"IF(ABS(qq0)<=0.10473,E18,#REF!)","v":0.3614239974781869},{"$f":"IF(ABS(qq0)<=0.10473,F18,#REF!)","v":-5.387891303102438}]
[0,0,0.64,0.06562804057482095,0.3541370775640254,-5.388375166067635,{"$f":"IF(ABS(qq0)<=0.10473,D19,#REF!)","v":0.06562804057482095},{"$f":"IF(ABS(qq0)<=0.10473,E19,#REF!)","v":0.3541370775640254},{"$f":"IF(ABS(qq0)<=0.10473,F19,#REF!)","v":-5.388375166067635}]
[{"$f":"xx","v":0.3541370775640254},{"$f":"yy","v":-5.388375166067635},0.68,0.06427563919826498,0.34684950993697217,-5.388849173752823,{"$f":"IF(ABS(qq0)<=0.10473,D20,#REF!)","v":0.06427563919826498},{"$f":"IF(ABS(qq0)<=0.10473,E20,#REF!)","v":0.34684950993697217},{"$f":"IF(ABS(qq0)<=0.10473,F20,#REF!)","v":-5.388849173752823}]
[null,null,0.7200000000000001,0.06292323782170901,0.3395613079259096,-5.389313325291048,{"$f":"IF(ABS(qq0)<=0.10473,D21,#REF!)","v":0.06292323782170901},{"$f":"IF(ABS(qq0)<=0.10473,E21,#REF!)","v":0.3395613079259096},{"$f":"IF(ABS(qq0)<=0.10473,F21,#REF!)","v":-5.389313325291048}]
[null,null,0.7600000000000001,0.06157083644515305,0.3322724848608806,-5.38976761983338,{"$f":"IF(ABS(qq0)<=0.10473,D22,#REF!)","v":0.06157083644515305},{"$f":"IF(ABS(qq0)<=0.10473,E22,#REF!)","v":0.3322724848608806},{"$f":"IF(ABS(qq0)<=0.10473,F22,#REF!)","v":-5.38976761983338}]
[null,null,0.8000000000000002,0.06021843506859709,0.3249830540730639,-5.390212056548921,{"$f":"IF(ABS(qq0)<=0.10473,D23,#REF!)","v":0.06021843506859709},{"$f":"IF(ABS(qq0)<=0.10473,E23,#REF!)","v":0.3249830540730639},{"$f":"IF(ABS(qq0)<=0.10473,F23,#REF!)","v":-5.390212056548921}]
[null,null,0.8400000000000002,0.058866033692041124,0.31769302889474954,-5.3906466346248,{"$f":"IF(ABS(qq0)<=0.10473,D24,#REF!)","v":0.058866033692041124},{"$f":"IF(ABS(qq0)<=0.10473,E24,#REF!)","v":0.31769302889474954},{"$f":"IF(ABS(qq0)<=0.10473,F24,#REF!)","v":-5.3906466346248}]
[null,null,0.8800000000000002,0.05751363231548516,0.31040242265931506,-5.391071353266179,{"$f":"IF(ABS(qq0)<=0.10473,D25,#REF!)","v":0.05751363231548516},{"$f":"IF(ABS(qq0)<=0.10473,E25,#REF!)","v":0.31040242265931506},{"$f":"IF(ABS(qq0)<=0.10473,F25,#REF!)","v":-5.391071353266179}]
[{"$f":"MIN(#REF!)","v":{"$error":"#REF!"}},{"$f":"MIN(I3:I503)","v":-5.399998895369177},0.9200000000000003,0.0561612309389292,0.30311124870120043,-5.391486211696252,{"$f":"IF(ABS(qq0)<=0.10473,D26,#REF!)","v":0.0561612309389292},{"$f":"IF(ABS(qq0)<=0.10473,E26,#REF!)","v":0.30311124870120043},{"$f":"IF(ABS(qq0)<=0.10473,F26,#REF!)","v":-5.391486211696252}]
[{"$f":"MAX(#REF!)","v":{"$error":"#REF!"}},{"$f":"B26","v":-5.399998895369177},0.9600000000000003,0.054808829562373235,0.29581952035588416,-5.391891209156247,{"$f":"IF(ABS(qq0)<=0.10473,D27,#REF!)","v":0.054808829562373235},{"$f":"IF(ABS(qq0)<=0.10473,E27,#REF!)","v":0.29581952035588416},{"$f":"IF(ABS(qq0)<=0.10473,F27,#REF!)","v":-5.391891209156247}]
[null,null,1.0000000000000002,0.05345642818581727,0.28852725095985865,-5.392286344905429,{"$f":"IF(ABS(qq0)<=0.10473,D28,#REF!)","v":0.05345642818581727},{"$f":"IF(ABS(qq0)<=0.10473,E28,#REF!)","v":0.28852725095985865},{"$f":"IF(ABS(qq0)<=0.10473,F28,#REF!)","v":-5.392286344905429}]
[null,null,1.0400000000000003,0.05210402680926131,0.2812344538506059,-5.392671618221098,{"$f":"IF(ABS(qq0)<=0.10473,D29,#REF!)","v":0.05210402680926131},{"$f":"IF(ABS(qq0)<=0.10473,E29,#REF!)","v":0.2812344538506059},{"$f":"IF(ABS(qq0)<=0.10473,F29,#REF!)","v":-5.392671618221098}]
[null,null,1.0800000000000003,0.050751625432705345,0.27394114236657313,-5.393047028398594,{"$f":"IF(ABS(qq0)<=0.10473,D30,#REF!)","v":0.050751625432705345},{"$f":"IF(ABS(qq0)<=0.10473,E30,#REF!)","v":0.27394114236657313},{"$f":"IF(ABS(qq0)<=0.10473,F30,#REF!)","v":-5.393047028398594}]
[null,null,1.1200000000000003,0.04939922405614938,0.26664732984714834,-5.393412574751295,{"$f":"IF(ABS(qq0)<=0.10473,D31,#REF!)","v":0.04939922405614938},{"$f":"IF(ABS(qq0)<=0.10473,E31,#REF!)","v":0.26664732984714834},{"$f":"IF(ABS(qq0)<=0.10473,F31,#REF!)","v":-5.393412574751295}]
[null,null,1.1600000000000004,0.04804682267959342,0.2593530296326358,-5.393768256610621,{"$f":"IF(ABS(qq0)<=0.10473,D32,#REF!)","v":0.04804682267959342},{"$f":"IF(ABS(qq0)<=0.10473,E32,#REF!)","v":0.2593530296326358},{"$f":"IF(ABS(qq0)<=0.10473,F32,#REF!)","v":-5.393768256610621}]
[null,null,1.2000000000000004,0.046694421303037456,0.25205825506423185,-5.394114073326034,{"$f":"IF(ABS(qq0)<=0.10473,D33,#REF!)","v":0.046694421303037456},{"$f":"IF(ABS(qq0)<=0.10473,E33,#REF!)","v":0.25205825506423185},{"$f":"IF(ABS(qq0)<=0.10473,F33,#REF!)","v":-5.394114073326034}]
[null,null,1.2400000000000004,0.04534201992648149,0.24476301948400053,-5.394450024265039,{"$f":"IF(ABS(qq0)<=0.10473,D34,#REF!)","v":0.04534201992648149},{"$f":"IF(ABS(qq0)<=0.10473,E34,#REF!)","v":0.24476301948400053},{"$f":"IF(ABS(qq0)<=0.10473,F34,#REF!)","v":-5.394450024265039}]
[null,null,1.2800000000000005,0.04398961854992553,0.2374673362348489,-5.394776108813185,{"$f":"IF(ABS(qq0)<=0.10473,D35,#REF!)","v":0.04398961854992553},{"$f":"IF(ABS(qq0)<=0.10473,E35,#REF!)","v":0.2374673362348489},{"$f":"IF(ABS(qq0)<=0.10473,F35,#REF!)","v":-5.394776108813185}]
[null,null,1.3200000000000005,0.04263721717336957,0.23017121866050286,-5.395092326374067,{"$f":"IF(ABS(qq0)<=0.10473,D36,#REF!)","v":0.04263721717336957},{"$f":"IF(ABS(qq0)<=0.10473,E36,#REF!)","v":0.23017121866050286},{"$f":"IF(ABS(qq0)<=0.10473,F36,#REF!)","v":-5.395092326374067}]
[null,null,1.3600000000000005,0.041284815796813604,0.2228746801054827,-5.395398676369327,{"$f":"IF(ABS(qq0)<=0.10473,D37,#REF!)","v":0.041284815796813604},{"$f":"IF(ABS(qq0)<=0.10473,E37,#REF!)","v":0.2228746801054827},{"$f":"IF(ABS(qq0)<=0.10473,F37,#REF!)","v":-5.395398676369327}]
[null,null,1.4000000000000006,0.03993241442025764,0.21557773391507862,-5.395695158238653,{"$f":"IF(ABS(qq0)<=0.10473,D38,#REF!)","v":0.03993241442025764},{"$f":"IF(ABS(qq0)<=0.10473,E38,#REF!)","v":0.21557773391507862},{"$f":"IF(ABS(qq0)<=0.10473,F38,#REF!)","v":-5.395695158238653}]
[null,null,1.4400000000000006,0.03858001304370168,0.2082803934353265,-5.395981771439784,{"$f":"IF(ABS(qq0)<=0.10473,D39,#REF!)","v":0.03858001304370168},{"$f":"IF(ABS(qq0)<=0.10473,E39,#REF!)","v":0.2082803934353265},{"$f":"IF(ABS(qq0)<=0.10473,F39,#REF!)","v":-5.395981771439784}]
[null,null,1.4800000000000006,0.037227611667145714,0.20098267201298328,-5.396258515448507,{"$f":"IF(ABS(qq0)<=0.10473,D40,#REF!)","v":0.037227611667145714},{"$f":"IF(ABS(qq0)<=0.10473,E40,#REF!)","v":0.20098267201298328},{"$f":"IF(ABS(qq0)<=0.10473,F40,#REF!)","v":-5.396258515448507}]
[null,null,1.5200000000000007,0.03587521029058975,0.19368458299550262,-5.3965253897586605,{"$f":"IF(ABS(qq0)<=0.10473,D41,#REF!)","v":0.03587521029058975},{"$f":"IF(ABS(qq0)<=0.10473,E41,#REF!)","v":0.19368458299550262},{"$f":"IF(ABS(qq0)<=0.10473,F41,#REF!)","v":-5.3965253897586605}]
[null,null,1.5600000000000007,0.03452280891403379,0.1863861397310106,-5.396782393882134,{"$f":"IF(ABS(qq0)<=0.10473,D42,#REF!)","v":0.03452280891403379},{"$f":"IF(ABS(qq0)<=0.10473,E42,#REF!)","v":0.1863861397310106},{"$f":"IF(ABS(qq0)<=0.10473,F42,#REF!)","v":-5.396782393882134}]
[null,null,1.6000000000000008,0.033170407537477825,0.17908735556828112,-5.39702952734887,{"$f":"IF(ABS(qq0)<=0.10473,D43,#REF!)","v":0.033170407537477825},{"$f":"IF(ABS(qq0)<=0.10473,E43,#REF!)","v":0.17908735556828112},{"$f":"IF(ABS(qq0)<=0.10473,F43,#REF!)","v":-5.39702952734887}]
[null,null,1.6400000000000008,0.03181800616092186,0.17178824385671163,-5.397266789706864,{"$f":"IF(ABS(qq0)<=0.10473,D44,#REF!)","v":0.03181800616092186},{"$f":"IF(ABS(qq0)<=0.10473,E44,#REF!)","v":0.17178824385671163},{"$f":"IF(ABS(qq0)<=0.10473,F44,#REF!)","v":-5.397266789706864}]
[null,null,1.6800000000000008,0.030465604784365895,0.16448881794629866,-5.397494180522164,{"$f":"IF(ABS(qq0)<=0.10473,D45,#REF!)","v":0.030465604784365895},{"$f":"IF(ABS(qq0)<=0.10473,E45,#REF!)","v":0.16448881794629866},{"$f":"IF(ABS(qq0)<=0.10473,F45,#REF!)","v":-5.397494180522164}]
[null,null,1.7200000000000009,0.02911320340780993,0.15718909118761337,-5.3977116993788785,{"$f":"IF(ABS(qq0)<=0.10473,D46,#REF!)","v":0.02911320340780993},{"$f":"IF(ABS(qq0)<=0.10473,E46,#REF!)","v":0.15718909118761337},{"$f":"IF(ABS(qq0)<=0.10473,F46,#REF!)","v":-5.3977116993788785}]
[null,null,1.760000000000001,0.027760802031253962,0.14988907693177725,-5.397919345879164,{"$f":"IF(ABS(qq0)<=0.10473,D47,#REF!)","v":0.027760802031253962},{"$f":"IF(ABS(qq0)<=0.10473,E47,#REF!)","v":0.14988907693177725},{"$f":"IF(ABS(qq0)<=0.10473,F47,#REF!)","v":-5.397919345879164}]
[null,null,1.800000000000001,0.026408400654697996,0.14258878853043752,-5.398117119643239,{"$f":"IF(ABS(qq0)<=0.10473,D48,#REF!)","v":0.026408400654697996},{"$f":"IF(ABS(qq0)<=0.10473,E48,#REF!)","v":0.14258878853043752},{"$f":"IF(ABS(qq0)<=0.10473,F48,#REF!)","v":-5.398117119643239}]
[null,null,1.840000000000001,0.02505599927814203,0.1352882393357429,-5.398305020309378,{"$f":"IF(ABS(qq0)<=0.10473,D49,#REF!)","v":0.02505599927814203},{"$f":"IF(ABS(qq0)<=0.10473,E49,#REF!)","v":0.1352882393357429},{"$f":"IF(ABS(qq0)<=0.10473,F49,#REF!)","v":-5.398305020309378}]
[null,null,1.880000000000001,0.023703597901586063,0.12798744270031903,-5.3984830475339125,{"$f":"IF(ABS(qq0)<=0.10473,D50,#REF!)","v":0.023703597901586063},{"$f":"IF(ABS(qq0)<=0.10473,E50,#REF!)","v":0.12798744270031903},{"$f":"IF(ABS(qq0)<=0.10473,F50,#REF!)","v":-5.3984830475339125}]
[null,null,1.920000000000001,0.022351196525030096,0.12068641197724414,-5.398651200991231,{"$f":"IF(ABS(qq0)<=0.10473,D51,#REF!)","v":0.022351196525030096},{"$f":"IF(ABS(qq0)<=0.10473,E51,#REF!)","v":0.12068641197724414},{"$f":"IF(ABS(qq0)<=0.10473,F51,#REF!)","v":-5.398651200991231}]
[null,null,1.960000000000001,0.02099879514847413,0.1133851605200246,-5.398809480373784,{"$f":"IF(ABS(qq0)<=0.10473,D52,#REF!)","v":0.02099879514847413},{"$f":"IF(ABS(qq0)<=0.10473,E52,#REF!)","v":0.1133851605200246},{"$f":"IF(ABS(qq0)<=0.10473,F52,#REF!)","v":-5.398809480373784}]
[null,null,2.000000000000001,0.019646393771918163,0.10608370168257054,-5.398957885392081,{"$f":"IF(ABS(qq0)<=0.10473,D53,#REF!)","v":0.019646393771918163},{"$f":"IF(ABS(qq0)<=0.10473,E53,#REF!)","v":0.10608370168257054},{"$f":"IF(ABS(qq0)<=0.10473,F53,#REF!)","v":-5.398957885392081}]
[null,null,2.040000000000001,0.018293992395362196,0.09878204881917131,-5.399096415774689,{"$f":"IF(ABS(qq0)<=0.10473,D54,#REF!)","v":0.018293992395362196},{"$f":"IF(ABS(qq0)<=0.10473,E54,#REF!)","v":0.09878204881917131},{"$f":"IF(ABS(qq0)<=0.10473,F54,#REF!)","v":-5.399096415774689}]
[null,null,2.080000000000001,0.01694159101880623,0.09148021528447117,-5.399225071268238,{"$f":"IF(ABS(qq0)<=0.10473,D55,#REF!)","v":0.01694159101880623},{"$f":"IF(ABS(qq0)<=0.10473,E55,#REF!)","v":0.09148021528447117},{"$f":"IF(ABS(qq0)<=0.10473,F55,#REF!)","v":-5.399225071268238}]
[null,null,2.120000000000001,0.015589189642250263,0.08417821443344486,-5.399343851637419,{"$f":"IF(ABS(qq0)<=0.10473,D56,#REF!)","v":0.015589189642250263},{"$f":"IF(ABS(qq0)<=0.10473,E56,#REF!)","v":0.08417821443344486},{"$f":"IF(ABS(qq0)<=0.10473,F56,#REF!)","v":-5.399343851637419}]
[null,null,2.160000000000001,0.014236788265694297,0.0768760596213731,-5.399452756664984,{"$f":"IF(ABS(qq0)<=0.10473,D57,#REF!)","v":0.014236788265694297},{"$f":"IF(ABS(qq0)<=0.10473,E57,#REF!)","v":0.0768760596213731},{"$f":"IF(ABS(qq0)<=0.10473,F57,#REF!)","v":-5.399452756664984}]
[null,null,2.200000000000001,0.01288438688913833,0.0695737642038182,-5.399551786151746,{"$f":"IF(ABS(qq0)<=0.10473,D58,#REF!)","v":0.01288438688913833},{"$f":"IF(ABS(qq0)<=0.10473,E58,#REF!)","v":0.0695737642038182},{"$f":"IF(ABS(qq0)<=0.10473,F58,#REF!)","v":-5.399551786151746}]
[null,null,2.240000000000001,0.011531985512582364,0.06227134153659965,-5.399640939916583,{"$f":"IF(ABS(qq0)<=0.10473,D59,#REF!)","v":0.011531985512582364},{"$f":"IF(ABS(qq0)<=0.10473,E59,#REF!)","v":0.06227134153659965},{"$f":"IF(ABS(qq0)<=0.10473,F59,#REF!)","v":-5.399640939916583}]
[null,null,2.280000000000001,0.010179584136026397,0.05496880497576967,-5.399720217796432,{"$f":"IF(ABS(qq0)<=0.10473,D60,#REF!)","v":0.010179584136026397},{"$f":"IF(ABS(qq0)<=0.10473,E60,#REF!)","v":0.05496880497576967},{"$f":"IF(ABS(qq0)<=0.10473,F60,#REF!)","v":-5.399720217796432}]
[null,null,2.320000000000001,0.00882718275947043,0.04766616787758881,-5.3997896196462944,{"$f":"IF(ABS(qq0)<=0.10473,D61,#REF!)","v":0.00882718275947043},{"$f":"IF(ABS(qq0)<=0.10473,E61,#REF!)","v":0.04766616787758881},{"$f":"IF(ABS(qq0)<=0.10473,F61,#REF!)","v":-5.3997896196462944}]
[null,null,2.360000000000001,0.007474781382914465,0.04036344359850148,-5.399849145339235,{"$f":"IF(ABS(qq0)<=0.10473,D62,#REF!)","v":0.007474781382914465},{"$f":"IF(ABS(qq0)<=0.10473,E62,#REF!)","v":0.04036344359850148},{"$f":"IF(ABS(qq0)<=0.10473,F62,#REF!)","v":-5.399849145339235}]
[null,null,2.4000000000000012,6.122380006358499E-3,0.03306064549511156,-5.399898794766385,{"$f":"IF(ABS(qq0)<=0.10473,D63,#REF!)","v":6.122380006358499E-3},{"$f":"IF(ABS(qq0)<=0.10473,E63,#REF!)","v":0.03306064549511156},{"$f":"IF(ABS(qq0)<=0.10473,F63,#REF!)","v":-5.399898794766385}]
[null,null,2.4400000000000013,0.004769978629802533,0.02575778692415793,-5.399938567836932,{"$f":"IF(ABS(qq0)<=0.10473,D64,#REF!)","v":0.004769978629802533},{"$f":"IF(ABS(qq0)<=0.10473,E64,#REF!)","v":0.02575778692415793},{"$f":"IF(ABS(qq0)<=0.10473,F64,#REF!)","v":-5.399938567836932}]
[null,null,2.4800000000000013,3.4175772532465676E-3,0.01845488124249008,-5.399968464478134,{"$f":"IF(ABS(qq0)<=0.10473,D65,#REF!)","v":3.4175772532465676E-3},{"$f":"IF(ABS(qq0)<=0.10473,E65,#REF!)","v":0.01845488124249008},{"$f":"IF(ABS(qq0)<=0.10473,F65,#REF!)","v":-5.399968464478134}]
[null,null,2.5200000000000014,0.002065175876690602,0.011151941807043667,-5.399988484635308,{"$f":"IF(ABS(qq0)<=0.10473,D66,#REF!)","v":0.002065175876690602},{"$f":"IF(ABS(qq0)<=0.10473,E66,#REF!)","v":0.011151941807043667},{"$f":"IF(ABS(qq0)<=0.10473,F66,#REF!)","v":-5.399988484635308}]
[null,null,2.5600000000000014,7.1277450013463618E-4,{"$f":"L*SIN(D67)","v":3.848981974816079E-3},{"$f":"-L*COS(D67)","v":-5.399998628271841},{"$f":"IF(ABS(qq0)<=0.10473,D67,#REF!)","v":7.1277450013463618E-4},{"$f":"IF(ABS(qq0)<=0.10473,E67,#REF!)","v":3.848981974816079E-3},{"$f":"IF(ABS(qq0)<=0.10473,F67,#REF!)","v":-5.399998628271841}]
[null,null,{"$f":"C67+dt","v":2.6000000000000014},-6.3962687642132952E-4,-3.4539848971579887E-3,-5.399998895369177,{"$f":"IF(ABS(qq0)<=0.10473,D68,#REF!)","v":-6.3962687642132952E-4},{"$f":"IF(ABS(qq0)<=0.10473,E68,#REF!)","v":-3.4539848971579887E-3},{"$f":"IF(ABS(qq0)<=0.10473,F68,#REF!)","v":-5.399998895369177}]
[null,null,2.6400000000000015,{"$f":"IF(qq0>0,    IF(AND(D68>D67,D68+dq>qq0), D68-dq,    IF( AND(D68>D67, D68+dq<=qq0), D68+dq,\n         IF(AND(D68<D67,D68-dq<-qq0),D68+dq,   D68 - dq)) ),  IF(AND(D68>D67,  D68+dq > -qq0), D68-dq,\n                   IF(  AND(D68>D67, D68+dq< -qq0), D68+dq,   IF(AND(D68<D67,D68-dq<=qq0),  D68+dq,    D68-dq ) ) ) )","v":-0.001992028252977295},-0.010756945451830967,-5.3999892859268295,{"$f":"IF(ABS(qq0)<=0.10473,D69,#REF!)","v":-0.001992028252977295},{"$f":"IF(ABS(qq0)<=0.10473,E69,#REF!)","v":-0.010756945451830967},{"$f":"IF(ABS(qq0)<=0.10473,F69,#REF!)","v":-5.3999892859268295}]
[null,null,2.6800000000000015,-0.003344429629533261,-0.01805988633216684,-5.399969799962373,{"$f":"IF(ABS(qq0)<=0.10473,D70,#REF!)","v":-0.003344429629533261},{"$f":"IF(ABS(qq0)<=0.10473,E70,#REF!)","v":-0.01805988633216684},{"$f":"IF(ABS(qq0)<=0.10473,F70,#REF!)","v":-5.399969799962373}]
[null,null,2.7200000000000015,-0.004696831006089227,-0.025362794181165577,-5.399940437511448,{"$f":"IF(ABS(qq0)<=0.10473,D71,#REF!)","v":-0.004696831006089227},{"$f":"IF(ABS(qq0)<=0.10473,E71,#REF!)","v":-0.025362794181165577},{"$f":"IF(ABS(qq0)<=0.10473,F71,#REF!)","v":-5.399940437511448}]
[null,null,2.7600000000000016,-0.006049232382645192,-0.03266565564188756,-5.399901198627757,{"$f":"IF(ABS(qq0)<=0.10473,D72,#REF!)","v":-0.006049232382645192},{"$f":"IF(ABS(qq0)<=0.10473,E72,#REF!)","v":-0.03266565564188756},{"$f":"IF(ABS(qq0)<=0.10473,F72,#REF!)","v":-5.399901198627757}]
[null,null,2.8000000000000016,-7.401633759201158E-3,-0.03996845735747801,-5.3998520833830685,{"$f":"IF(ABS(qq0)<=0.10473,D73,#REF!)","v":-7.401633759201158E-3},{"$f":"IF(ABS(qq0)<=0.10473,E73,#REF!)","v":-0.03996845735747801},{"$f":"IF(ABS(qq0)<=0.10473,F73,#REF!)","v":-5.3998520833830685}]
[null,null,2.8400000000000016,-0.008754035135757125,-0.04727118597119143,-5.399793091867213,{"$f":"IF(ABS(qq0)<=0.10473,D74,#REF!)","v":-0.008754035135757125},{"$f":"IF(ABS(qq0)<=0.10473,E74,#REF!)","v":-0.04727118597119143},{"$f":"IF(ABS(qq0)<=0.10473,F74,#REF!)","v":-5.399793091867213}]
[null,null,2.8800000000000017,-0.010106436512313091,-0.054573828126416035,-5.399724224188087,{"$f":"IF(ABS(qq0)<=0.10473,D75,#REF!)","v":-0.010106436512313091},{"$f":"IF(ABS(qq0)<=0.10473,E75,#REF!)","v":-0.054573828126416035},{"$f":"IF(ABS(qq0)<=0.10473,F75,#REF!)","v":-5.399724224188087}]
[null,null,2.9200000000000017,-0.011458837888869058,-0.06187637046669815,-5.399645480471646,{"$f":"IF(ABS(qq0)<=0.10473,D76,#REF!)","v":-0.011458837888869058},{"$f":"IF(ABS(qq0)<=0.10473,E76,#REF!)","v":-0.06187637046669815},{"$f":"IF(ABS(qq0)<=0.10473,F76,#REF!)","v":-5.399645480471646}]
[null,null,2.9600000000000017,-0.012811239265425024,-0.06917879963576666,-5.399556860861914,{"$f":"IF(ABS(qq0)<=0.10473,D77,#REF!)","v":-0.012811239265425024},{"$f":"IF(ABS(qq0)<=0.10473,E77,#REF!)","v":-0.06917879963576666},{"$f":"IF(ABS(qq0)<=0.10473,F77,#REF!)","v":-5.399556860861914}]
[null,null,3.0000000000000018,-0.01416364064198099,-0.07648110227755744,-5.399458365520973,{"$f":"IF(ABS(qq0)<=0.10473,D78,#REF!)","v":-0.01416364064198099},{"$f":"IF(ABS(qq0)<=0.10473,E78,#REF!)","v":-0.07648110227755744},{"$f":"IF(ABS(qq0)<=0.10473,F78,#REF!)","v":-5.399458365520973}]
[null,null,3.040000000000002,-0.015516042018536957,-0.08378326503623781,-5.399349994628971,{"$f":"IF(ABS(qq0)<=0.10473,D79,#REF!)","v":-0.015516042018536957},{"$f":"IF(ABS(qq0)<=0.10473,E79,#REF!)","v":-0.08378326503623781},{"$f":"IF(ABS(qq0)<=0.10473,F79,#REF!)","v":-5.399349994628971}]
[null,null,3.080000000000002,-0.016868443395092924,-0.09108527455623093,-5.399231748384118,{"$f":"IF(ABS(qq0)<=0.10473,D80,#REF!)","v":-0.016868443395092924},{"$f":"IF(ABS(qq0)<=0.10473,E80,#REF!)","v":-0.09108527455623093},{"$f":"IF(ABS(qq0)<=0.10473,F80,#REF!)","v":-5.399231748384118}]
{"$rows_left_out":424}
{"sheet":"Sheet3","index":2,"n_rows":0,"n_cols":0,"rows_kept":0}