{"text_format":"3","workbook":"xlsx","n_sheets":3,"sheets":["Sheet1","Sheet2","Sheet3"],"not_rendered":{"charts":1,"images":2,"macros":1,"external_links":1,"defined_names":27,"comments":1},"read":"whole","date_system":"1900"}

{"sheet":"Sheet1","index":0,"n_rows":47,"n_cols":29,"rows_kept":47,"merged":[[40,2,40,3]]}
["         Approximating Polar Coordinate",{"$nulls":24},{"$f":"n+1","v":4},null,null,{"$f":"n+1","v":4}]
["     Curves With Lagrange Interpolation"]
[]
[null,"    This graphing utility produces the graph "]
[null,"         of any polar coordinate function"]
[null,null,"               r = f(Q)"]
[null,"  and its Lagrange Interpolating Polynomials"]
[null,"    on any interval from Q = a  to  Q = b."]
[]
["Enter the function  in terms of Q:  r = f(Q) =",{"$nulls":4},"(sin(Q))^2+(cos(Q))^4"]
[]
[]
["Now enter the interval for Q (in radians):  "]
[null,"  Starting angle a =",null,-3]
[null,"    Ending angle b =",null,3]
[]
[]
["Select the degree n (1 to 6) for the interpolating polynomial:  ",{"$nulls":7},"The graph of the polar function r =",{"$nulls":4},{"$f":"F10","v":"(sin(Q))^2+(cos(Q))^4"}]
[null,3,null,"n =",{"$f":"B19","v":3}]
[]
[{"$nulls":8},"Now trace along the two curves:"]
[{"$f":"\"Enter the \" & TEXT(n+1,\"0\")& \" different interpolating points between  \"&TEXT(QMin,\"##.#\") & \" and \"& TEXT(QMax, \"#.#\")","v":"Enter the 4 different interpolating points between  -3. and 3."},{"$nulls":7},"Q =",{"$f":"Sheet1!D14+K22*Sheet2!B12","v":0.5223880597014925},118]
[1,-3,{"$f":"IF(Z23=0,\"That's outside the interval\",\"\")","v":""},{"$nulls":5},"r =",{"$f":"LOOKUP(J22,Sheet2!C3:C204,Sheet2!D3:D204)","v":0.8263972166167834},{"$nulls":15},{"$f":"IF(OR(B23<QMin,B23>QMax),0,1)","v":1}]
[2,1,{"$f":"IF(Z24=0,\"That's outside the interval\",\"\")","v":""},{"$nulls":5},"r =",{"$f":"LOOKUP(J22,Sheet2!C3:C204,Sheet2!T3:T204)","v":{"v":0.8684075629210863,"d":"0.868"}},{"$nulls":15},1]
[3,2,{"$f":"IF(AND(A25<=n+1,Z25=0),\"That's outside the interval\",IF(A25>n+1,\"\",\"\"))","v":""},{"$nulls":22},1]
[4,-1,{"$f":"IF(AND(A26<=n+1,Z26=0),\"That's outside the interval\",IF(A26>n+1,\"\",\"\"))","v":""},{"$nulls":22},1]
[5,0,{"$f":"IF(AND(A27<=n+1,Z27=0),\"That's outside the interval\",IF(A27>n+1,\"\",\"\"))","v":""},{"$nulls":22},1]
[6,5,{"$f":"IF(AND(A28<=n+1,Z28=0),\"That's outside the interval\",IF(A28>n+1,\"\",\"\"))","v":""},{"$nulls":22},0]
[7,-0.5,{"$f":"IF(AND(A29<=n+1,Z29=0),\"That's outside the interval\",IF(A29>n+1,\"\",\"\"))","v":""},{"$nulls":22},1]
[{"$nulls":25},1]
["Click each item below for suggestions and investigations"]
[null,null,"   Item 1"]
[null,null,"   Item 2"]
[null,null,"   Item 3"]
[null,null,"   Item 4"]
[null,null,"   Item 5"]
[]
[]
[]
["To access/download all the DIGMath Apps for Calculus"]
["     Click this link:",null,"DIGMath for Calculus"]
[]
["Created by:  Sheldon P. Gordon   "]
["                      Farmingdale State College    "]
["Development of this module was supported by the "]
["NSF's Division of Undergraduate Education  "]
["under grants DUE-0310123 and DUE-0442160."]

{"sheet":"Sheet2","index":1,"n_rows":211,"n_cols":22,"rows_kept":211}
[null,null,"Q","r = f(Q)","x","y",null,"Tracing point",null,null,{"$f":"QMin","v":-3},{"$f":"r0","v":0.9804817448415614},null,"linear","quad","cubic","quartic","quintic","6th","interpol","x","y"]
[{"$nulls":10},{"$f":"K1+dQQ","v":-1.5},{"$f":"r00","v":0.7932945473920485}]
[null,null,{"$f":"Sheet1!D14","v":-3},{"$f":"(SIN(Q))^2+(COS(Q))^4","v":0.9804817448415614},{"$f":"D3*COS($C3)","v":-0.9706695704468582},{"$f":"D3*SIN($C3)","v":-0.1383655917345938},null,0,0,null,{"$f":"K2+dQQ","v":0},{"$f":"r000","v":0.8568124957739234},null,{"$f":"$L$1*(Q-$K$2)/($K$1-$K$2)+$L$2*(Q-$K$1)/($K$2-$K$1)","v":0.9804817448415614},{"$f":"$L$1*(Q-$K$2)*(Q-$K$3)/($K$1-$K$2)/($K$1-$K$3)+$L$2*(Q-$K$1)*(Q-$K$3)/($K$2-$K$1)/($K$2-$K$3)+$L$3*(Q-$K$1)*(Q-$K$2)/($K$3-$K$1)/($K$3-$K$2)","v":0.9804817448415614},{"$f":"$L$1*(Q-$K$2)*(Q-$K$3)*(Q-$K$4)/($K$1-$K$2)/($K$1-$K$3)/($K$1-$K$4)+$L$2*(Q-$K$1)*(Q-$K$3)*(Q-$K$4)/($K$2-$K$1)/($K$2-$K$3) /($K$2-$K$4)+$L$3*(Q-$K$1)*(Q-$K$2)*(Q-$K$4)/($K$3-$K$1)/($K$3-$K$2) /($K$3-$K$4)+$L$4*(Q-$K$1)*(Q-$K$2)*(Q-$K$3)/($K$4-$K$1)/($K$4-$K$2) /($K$4-$K$3)","v":0.9804817448415614},{"$f":"$L$1*(Q-$K$2)*(Q-$K$3)*(Q-$K$4)*(Q-$K$5)/($K$1-$K$2)/($K$1-$K$3)/($K$1-$K$4)/($K$1-$K$5) +$L$2*(Q-$K$1)*(Q-$K$3)*(Q-$K$4)*(Q-$K$5)/($K$2-$K$1)/($K$2-$K$3)/($K$2-$K$4)/($K$2-$K$5) +$L$3*(Q-$K$1)*(Q-$K$2)*(Q-$K$4)*(Q-$K$5)/($K$3-$K$1)/($K$3-$K$2)/($K$3-$K$4)/($K$3-$K$5) +$L$4*(Q-$K$1)*(Q-$K$2)*(Q-$K$3)*(Q-$K$5)/($K$4-$K$1)/($K$4-$K$2)/($K$4-$K$3)/($K$4-$K$5)+$L$5*(Q-$K$1)*(Q-$K$2)*(Q-$K$3)*(Q-$K$4)/($K$5-$K$1)/($K$5-$K$2)/($K$5-$K$3)/($K$5-$K$4)","v":0.9804817448415614},{"$f":"$L$1*(Q-$K$2)*(Q-$K$3)*(Q-$K$4)*(Q-$K$5)*(Q-$K$6)/($K$1-$K$2)/($K$1-$K$3)/($K$1-$K$4)/($K$1-$K$5)/($K$1-$K$6)+$L$2*(Q-$K$1)*(Q-$K$3)*(Q-$K$4)*(Q-$K$5)*(Q-$K$6)/($K$2-$K$1)/($K$2-$K$3)/($K$2-$K$4)/($K$2-$K$5)/($K$2-$K$6)+$L$3*(Q-$K$1)*(Q-$K$2)*(Q-$K$4)*(Q-$K$5)*(Q-$K$6)/($K$3-$K$1)/($K$3-$K$2)/($K$3-$K$4)/($K$3-$K$5)/($K$3-$K$6)+$L$4*(Q-$K$1)*(Q-$K$2)*(Q-$K$3)*(Q-$K$5)*(Q-$K$6)/($K$4-$K$1)/($K$4-$K$2)/($K$4-$K$3)/($K$4-$K$5)/($K$4-$K$6)+$L$5*(Q-$K$1)*(Q-$K$2)*(Q-$K$3)*(Q-$K$4)*(Q-$K$6)/($K$5-$K$1)/($K$5-$K$2)/($K$5-$K$3)/($K$5-$K$4)/($K$5-$K$6)+$L$6*(Q-$K$1)*(Q-$K$2)*(Q-$K$3)*(Q-$K$4)*(Q-$K$5)/($K$6-$K$1)/($K$6-$K$2)/($K$6-$K$3)/($K$6-$K$4)/($K$6-$K$5)","v":0.9804817448415614},{"$f":"$L$1*(Q-$K$2)*(Q-$K$3)*(Q-$K$4)*(Q-$K$5)*(Q-$K$6)*(Q-$K$7)/($K$1-$K$2)/($K$1-$K$3)/($K$1-$K$4)/($K$1-$K$5)/($K$1-$K$6) /($K$1-$K$7)+$L$2*(Q-$K$1)*(Q-$K$3)*(Q-$K$4)*(Q-$K$5)*(Q-$K$6)*(Q-$K$7)/($K$2-$K$1)/($K$2-$K$3)/($K$2-$K$4)/($K$2-$K$5)/($K$2-$K$6) /($K$2-$K$7)+$L$3*(Q-$K$1)*(Q-$K$2)*(Q-$K$4)*(Q-$K$5)*(Q-$K$6)*(Q-$K$7)/($K$3-$K$1)/($K$3-$K$2)/($K$3-$K$4)/($K$3-$K$5)/($K$3-$K$6) /($K$3-$K$7)+$L$4*(Q-$K$1)*(Q-$K$2)*(Q-$K$3)*(Q-$K$5)*(Q-$K$6)*(Q-$K$7)/($K$4-$K$1)/($K$4-$K$2)/($K$4-$K$3)/($K$4-$K$5)/($K$4-$K$6) /($K$4-$K$7)+$L$5*(Q-$K$1)*(Q-$K$2)*(Q-$K$3)*(Q-$K$4)*(Q-$K$6)*(Q-$K$7)/($K$5-$K$1)/($K$5-$K$2)/($K$5-$K$3)/($K$5-$K$4)/($K$5-$K$6) /($K$5-$K$7)+$L$6*(Q-$K$1)*(Q-$K$2)*(Q-$K$3)*(Q-$K$4)*(Q-$K$5)*(Q-$K$7)/($K$6-$K$1)/($K$6-$K$2)/($K$6-$K$3)/($K$6-$K$4)/($K$6-$K$5) /($K$6-$K$7)+$L$7*(Q-$K$1)*(Q-$K$2)*(Q-$K$3)*(Q-$K$4)*(Q-$K$5)*(Q-$K$6)/($K$7-$K$1)/($K$7-$K$2)/($K$7-$K$3)/($K$7-$K$4)/($K$7-$K$5) /($K$7-$K$6)","v":0.9804817448415614},{"$f":"IF(n=1,N3,IF(n=2,O3,IF(n=3,P3,IF(n=4,Q3,IF(n=5,R3,S3)))))","v":0.9804817448415614},{"$f":"T3*COS($C3)","v":-0.9706695704468582},{"$f":"T3*SIN($C3)","v":-0.1383655917345938}]
[null,null,{"$f":"C3+Sheet2!B$12","v":-2.970149253731343},0.9717411724911731,{"$f":"D4*COS(C4)","v":-0.9574950023606329},{"$f":"D4*SIN(C4)","v":-0.1657836746152388},null,{"$f":"LOOKUP(Sheet1!$J$22,Sheet2!C3:C204,E3:E204)","v":0.7281682505052463},{"$f":"LOOKUP(Sheet1!J22,Sheet2!C3:C204,F3:F204)","v":0.39077277104232305},null,{"$f":"K3+dQQ","v":1.5},{"$f":"r0000","v":0.7932945473920485},null,0.976756626484357,0.9743116912734078,0.971880248560755,0.9681636767052377,0.9615856631200945,0.9505785728125722,0.971880248560755,{"$f":"T4*COS($C4)","v":-0.9576320395114116},{"$f":"T4*SIN($C4)","v":-0.1658074016554415}]
[null,null,{"$f":"C4+Sheet2!B$12","v":-2.9402985074626864},0.961622992086428,-0.9422065257365054,-0.1922645099044499,{"$nulls":4},{"$f":"K4+dQQ","v":3},{"$f":"r00000","v":1},null,0.9730315081271529,0.9682409244143283,0.9635246586500875,0.9563637702510245,0.9437529824371701,0.9227354821108202,0.9635246586500875,-0.9440697950850964,-0.1926447243885799]
[null,null,{"$f":"C5+Sheet2!B$12","v":-2.9104477611940296},0.9502712879552516,-0.9249985828223874,-0.2176996612048528,{"$nulls":4},{"$f":"K5+dQQ","v":4.5},{"$f":"r000000","v":0.9260102577266739},null,0.9693063897699487,0.9622694442643227,0.9554119980606026,0.9450700688686006,0.9269487840306988,0.8968685007817755,0.9554119980606026,-0.9300025744429091,-0.21887735736643563]
[null,null,{"$f":"C6+Sheet2!B$12","v":-2.880597014925373},0.9378477099788577,-0.9060861278821631,-0.24200466105448462,null,"Start line:",null,null,{"$f":"K6+dQQ","v":6},{"$f":"r0000000","v":0.8229816454316072},null,0.9655812714127444,0.9563972508233911,0.9475392897433451,0.9342707374983894,0.9111388004577999,0.8728957981852826,0.9475392897433451,-0.9154494881467667,-0.2445055014905509]
[null,null,{"$f":"C7+Sheet2!B$12","v":-2.850746268656716},0.9245291716744545,-0.8857003394146412,-0.26512091210963024,null,0,0,{"$nulls":4},0.9618561530555401,0.950624344091534,0.9399035566493593,0.9239540626315627,0.8962894102164403,0.8507376530496775,0.9399035566493593,-0.9004290233845608,-0.26952971941669335]
[null,null,{"$f":"C8+Sheet2!B$12","v":-2.820895522388059},0.9105053309215977,-0.8640840299565892,-0.2870169800040207,null,{"$f":"1.2*D3*COS(C3)","v":-1.1648034845362298},{"$f":"1.2*D3*SIN(C3)","v":-0.16603871008151255},{"$nulls":4},0.9581310346983358,0.9449507240687507,0.9325018217296897,0.9141084523100363,0.8823676323670759,0.8303164217416851,0.9325018217296897,-0.8849590493297551,-0.2939508947742225]
[null,null,{"$f":"C9+Sheet2!B$12","v":-2.7910447761194024},0.8959758892070129,-0.8414868519874542,-0.3076892457862992,{"$nulls":7},0.9544059163411316,0.9393763907550415,0.9253311079353806,0.9047224361264735,0.8693411211542892,0.8115565067520889,0.9253311079353806,-0.8690568244551286,-0.31777019240464777]
[null,null,{"$f":"C10+Sheet2!B$12","v":-2.7611940298507456},0.8811477478470267,-0.8181604026500706,-0.32716190039697696,{"$nulls":7},0.9506807979839275,0.9339013441504065,0.9183884382174762,0.8957846652242819,0.8571781606284301,0.7943843253971782,0.9183884382174762,-0.8527390057309959,-0.3409890197007045]
["delta Q = ",{"$f":"(Sheet1!D15-Sheet1!D14)/201","v":0.029850746268656716},{"$f":"C11+Sheet2!B$12","v":-2.7313432835820888},0.8662320616833947,-0.7943533319447202,-0.3454862786227345,null,"End line",{"$nulls":5},0.9469556796267231,0.9285255842548458,0.9116708355270207,0.8872839122976174,0.8458476592672576,0.7787282787359795,0.9116708355270207,-0.8360216596351345,-0.3636089891235519]
[null,null,{"$f":"C12+Sheet2!B$12","v":-2.701492537313432},0.851441232208327,-0.7703065587025577,-0.3627395450240535,null,0,0,{"$nulls":4},0.9432305612695189,0.9232491110683587,0.9051753228150595,0.8792090715913808,0.8353191445975781,0.7645187207032557,0.9051753228150595,-0.8189202748987168,-0.3856318819718586]
["dQQ =",{"$f":"(Sheet1!D15-Sheet1!D14)/(n+1)","v":1.5},{"$f":"C13+Sheet2!B$12","v":-2.671641791044775},0.836985882937031,-0.7462486960084861,-0.3790227591339542,null,{"$f":"1.2*D204*COS(C204)","v":-1.164803484536235},{"$f":"1.2*D204*SIN(C204)+1","v":1.166038710081501},{"$nulls":4},0.9395054429123146,0.9180719245909461,0.8988989230326356,0.8715491589012183,0.8255627578168853,0.7516879274582836,0.8988989230326356,-0.8014497769098016,-0.4070596134725986]
[null,null,{"$f":"C14+Sheet2!B$12","v":-2.6417910447761184},0.823071860098904,-0.7223917828835706,-0.3944583614387783,{"$nulls":7},0.9357803245551103,0.9129940248226073,0.8928386591307942,0.864293311573523,0.8165492484150008,0.7401700669494123,0.8928386591307942,-0.7836245436933872,-0.42789419925935573]
["Q00 =",{"$f":"Sheet1!B23","v":-3},{"$f":"C15+Sheet2!B$12","v":-2.6119402985074616},0.8098973013579482,-0.6989274120625705,-0.4091871349571063,{"$nulls":7},0.932055206197906,0.9080154117633427,0.8869915540605795,0.8574307885054346,0.8082499687957144,0.7299011686943994,0.8869915540605795,-0.765458423384626,-0.44813772329979606]
["Q01 =",{"$f":"Sheet1!B24","v":1},{"$f":"C16+Sheet2!B$12","v":-2.5820895522388048},0.7976498143042596,-0.6760233347695083,-0.42336470933077686,null,"Approx Point",{"$nulls":5},0.9283300878407019,0.9031360854131523,0.881354630773036,0.8509509701448384,0.8006368688984232,0.7208190937765145,0.881354630773036,-0.7469647531096463,-0.4677923073297805]
["Q02 =",{"$f":"Sheet1!B25","v":2},{"$f":"C17+Sheet2!B$12","v":-2.552238805970148},0.7865038048952644,-0.6538206127028698,-0.4371576849599835,null,0,0,{"$nulls":4},0.9246049694834977,0.8983560457720358,0.8759249122192082,0.8448433584903648,0.7936824908197725,0.7128635050564295,0.8759249122192082,-0.7281563791864097,-0.4868600818473057]
["Q03 =",{"$f":"Sheet1!B26","v":-1},{"$f":"C18+Sheet2!B$12","v":-2.522388059701491},0.7766179938900795,-0.6324313752303955,-0.450739463612897,null,{"$f":"Sheet1!J24*COS(Sheet1!J22)","v":0.7525881564211155},{"$f":"Sheet1!J24*SIN(Sheet1!J22)","v":0.4332929288059142},{"$nulls":4},0.9208798511262934,0.8936752928399934,0.8706994213501396,0.8390975770913914,0.7873599634352932,0.7059758375998825,0.8706994213501396,-0.7090456785562415,-0.5053431587151318]
["Q04 =",{"$f":"Sheet1!B27","v":0},{"$f":"C19+Sheet2!B$12","v":-2.4925373134328344},0.7681331566433338,-0.6119372263333044,-0.4642858789176714,{"$nulls":7},0.9171547327690892,0.8890938266170251,0.8656751811168756,0.8337033710480416,0.7816429970210468,0.7000992693211169,0.8656751811168756,-0.6896445813550719,-0.5232436054165622]
["Q05 =",{"$f":"Sheet1!B28","v":5},{"$f":"C20+Sheet2!B$12","v":-2.4626865671641776},0.7611701184440948,-0.5923883314303403,-0.4779707250422085,{"$nulls":7},0.913429614411885,0.884611647103131,0.86084921447046,0.8286506070111854,0.7765058778752613,0.6951786918420993,0.86084921447046,-0.6699645945320035,-0.5405634210043964]
["Q06 =",{"$f":"Sheet1!B29","v":-0.5},{"$f":"C21+Sheet2!B$12","v":-2.4328358208955208},0.7558280339465708,-0.5738031991733802,-0.4919612845722038,{"$nulls":7},0.9097044960546807,0.8802287542983109,0.8562185443619378,0.8239292731824378,0.7719234629399718,0.6911606815675138,0.8562185443619378,-0.650016826421636,-0.5573045137786166]
[null,null,{"$f":"C22+Sheet2!B$12","v":-2.402985074626864},0.7521829751937334,-0.5561691579720507,-0.5064139570469566,{"$nulls":7},0.9059793776974765,0.8759451482025651,0.8517801937423526,0.8195294793141596,0.7678711744226606,0.6879934709755285,0.8517801937423526,-0.6298120121755465,-0.5734686807238466]
[null,null,{"$f":"C23+Sheet2!B$12","v":-2.373134328358207},0.7502868483406062,-0.5394435117149069,-0.521470087791782,{"$nulls":7},0.9022542593402723,0.8717608288158932,0.8475311855627491,0.81544145670946,0.7643249944178988,0.6856269201243519,0.8475311855627491,-0.6093605399575334,-0.5890575887331071]
[null,null,{"$f":"C24+Sheet2!B$12","v":-2.3432835820895503},0.7501666545032359,-0.5235553442477944,-0.5372520926326401,{"$nulls":7},0.898529140983068,0.8676757961382953,0.8434685427741718,0.8116555582221917,0.7612614595289846,0.6840124883745495,0.8434685427741718,-0.5886724778066127,-0.6040727576398459]
[null,null,{"$f":"C25+Sheet2!B$12","v":-2.3134328358208935},0.7518241052589606,-0.5084079279759128,-0.553859967879676,{"$nulls":7},0.8948040226258636,0.8636900501697714,0.8395892883276646,0.8081622582569546,0.7586576554895839,0.6831032063271495,0.8395892883276646,-0.5677576010713469,-0.6185155450756784]
[null,null,{"$f":"C26+Sheet2!B$12","v":-2.2835820895522367},0.7552355982733033,-0.4938816787884897,-0.5713682667564742,{"$nulls":7},0.8910789042686595,0.8598035909103219,0.8358904451742728,0.8049521527690947,0.7564912117853695,0.6828536479775174,0.8358904451742728,-0.5466254203188835,-0.6323871331667398]
[null,null,{"$f":"C27+Sheet2!B$12","v":-2.25373134328358},0.7603525534005733,-0.4798375876544603,-0.5898236134105855,{"$nulls":7},0.8873537859114553,0.8560164183599464,0.83236903626504,0.8020159592647043,0.7547402962756627,0.6832199030850145,0.83236903626504,-0.5252852096220548,-0.6456885170770078]
[null,null,{"$f":"C28+Sheet2!B$12","v":-2.223880597014923},0.7671021044720484,-0.4661210489651707,-0.6092428139888516,{"$nulls":7},0.8836286675542508,0.8523285325186449,0.8290220845510103,0.799344516800621,0.7533836098150709,0.684159549758427,0.8290220845510103,-0.5037460351280915,-0.6584204954024672]
[null,null,{"$f":"C29+Sheet2!B$12","v":-2.1940298507462663},0.775388136920581,-0.4525659972316186,-0.6296116112548436,{"$nulls":7},0.8799035491970468,0.8487399333864175,0.825846612983229,0.7969287859844287,0.75240038087513,0.6856316272571769,0.825846612983229,-0.48201678381286733,-0.6705836624154893]
[null,null,{"$f":"C30+Sheet2!B$12","v":-2.1641791044776095},0.7850926564657026,-0.43899925726451455,-0.6508841151522891,{"$nulls":7},0.8761784308398424,0.8452506209632642,0.8228396445127405,0.7947598489744578,0.751770360165943,0.6875966090083045,0.8228396445127405,-0.46010619232517397,-0.6821784021543655]
[null,null,{"$f":"C31+Sheet2!B$12","v":-2.1343283582089527},0.7960774693689592,-0.4252450086164729,-0.6729829268886857,{"$nulls":7},0.8724533124826381,0.8418605952491851,0.8199982020905878,0.7928289094797847,0.7514738152578208,0.6900163758392335,0.8199982020905878,-0.4380228758262869,-0.693204884348535]
[{"$f":"n+1","v":4},null,{"$f":"C32+Sheet2!B$12","v":-2.104477611940296},0.8081861503323986,-0.41112926294037966,-0.6957999588554188,{"$nulls":7},0.8687281941254339,0.8385698562441799,0.8173193086678168,0.7911272927602312,0.7514915252029213,0.6928541894263104,0.8173193086678168,-0.4157753567310415,-0.7036630621657024]
[null,null,{"$f":"C33+Sheet2!B$12","v":-2.074626865671639},0.8212462700170615,-0.3964842530603038,-0.7191979373525409,{"$nulls":7},0.8650030757682297,0.835378403948249,0.8147999871954712,0.7896464456263662,0.75180477515689,0.6960746659591152,0.8147999871954712,-0.393372093257763,-0.7135526717627408]
[null,null,{"$f":"C34+Sheet2!B$12","v":-2.0447761194029823},0.8350718504612881,-0.3811526349545533,-0.7430125599880805,{"$nulls":7},0.8612779574110254,0.8322862383613919,0.8124372606245951,0.7883779364395038,0.7523953510004987,0.6996437500205611,0.8124372606245951,-0.3708215076957367,-0.7228732336180784]
[null,null,{"$f":"C35+Sheet2!B$12","v":-2.0149253731343255},0.8494660134333425,-0.3649914084576189,-0.7670552651083619,{"$nulls":7},0.8575528390538212,0.8292933594836093,0.8102281519062339,0.7873134551117046,0.7532455339612886,0.703528688682759,0.8102281519062339,-0.34813201430038787,-0.7316240556191039]
[null,null,{"$f":"C36+Sheet2!B$12","v":-1.9850746268656687},0.8642237840054317,-0.34787546919271334,-0.7911165570095322,{"$nulls":7},0.8538277206966169,0.8263997673149005,0.8081696839914306,0.7864448131057752,0.7543380952352061,0.7076980058186655,0.8081696839914306,-0.3253120467280253,-0.7398042378740689]
[null,null,{"$f":"C37+Sheet2!B$12","v":-1.955223880597012},0.8791350094258271,-0.3297007128966606,-0.8149698182838325,{"$nulls":7},0.8501026023394127,0.8236054618552657,0.8062588798312309,0.7857639434352686,0.755656290608247,0.7121214766295086,0.8062588798312309,-0.3023700849238532,-0.7474126792140023]
[null,null,{"$f":"C38+Sheet2!B$12","v":-1.925373134328355},0.8939873517239367,-0.31038662369802394,-0.8383755297429184,{"$nulls":7},0.8463774839822085,0.8209104431047052,0.8044927623766782,0.7852629006644828,0.7571838550780924,0.7167701023879826,0.8044927623766782,-0.2793146813789624,-0.7544480853462531]
[null,null,{"$f":"C39+Sheet2!B$12","v":-1.8955223880596983},0.9085693114332042,-0.2898782898227403,-0.8610858091779531,{"$nulls":7},0.8426523656250042,0.8183147110632187,0.802868354578817,0.7849338609084626,0.7589049974757514,0.7216160853972278,0.802868354578817,-0.25615448667420126,-0.7609089786175305]
[null,null,{"$f":"C40+Sheet2!B$12","v":-1.8656716417910415},0.9226732393735908,-0.2681478033606839,-0.8828491729672717,{"$nulls":7},0.8389272472678,0.8158182657308063,0.8013826793886925,0.7847691218330002,0.7608043950872019,0.7266328041655871,0.8013826793886925,-0.23289827423115328,-0.7667937093406221]
[null,null,{"$f":"C41+Sheet2!B$12","v":-1.8358208955223847},0.9360982936054298,-0.2451950148354647,-0.9034154193895706,{"$nulls":7},0.8352021289105958,0.8134211071074678,0.800032759757348,0.7847611026546307,0.7628671882750266,0.7317947887971296,0.800032759757348,-0.20955496419294278,-0.7721004686354316]
[null,null,{"$f":"C42+Sheet2!B$12","v":-1.805970149253728},0.9486532994472111,-0.22104762806129927,-0.9225405295598419,{"$nulls":7},0.8314770105533915,0.8111232351932036,0.7988156186358286,0.7849023441406383,0.7650789751000566,0.7370776965979642,0.7988156186358286,-0.18613364636022658,-0.7768273027315581]
[null,null,{"$f":"C43+Sheet2!B$12","v":-1.776119402985071},0.9601594718302325,-0.1957606358139995,-0.9399914812438513,{"$nulls":7},0.8277518921961873,0.8089246499880136,0.7977282789751784,0.7851855086090516,0.7674258059430101,0.74245828789832,0.7977282789751784,-0.1626436021105045,-0.7809721286763184]
[null,null,{"$f":"C44+Sheet2!B$12","v":-1.7462686567164143},0.9704529612234054,-0.16941511185048083,-0.9555508724416327,{"$nulls":7},0.824026773838983,0.8068253514918976,0.7967677637264419,0.7856033799286459,0.7698941781261337,0.7479144020904102,0.7967677637264419,-0.1390943252318009,-0.7845327513889685]
[null,null,{"$f":"C45+Sheet2!B$12","v":-1.7164179104477575},0.9793871868738786,-0.14211638944617447,-0.969021255527201,{"$nulls":7},0.8203016554817788,0.8048253397048556,0.795931095840663,0.7861488635189423,0.7724710305348383,0.753424933882066,0.795931095840663,-0.11549554160481225,-0.7875068819988368]
[null,null,{"$f":"C46+Sheet2!B$12","v":-1.6865671641791007},0.986834924137805,-0.11399167055430304,-0.9802290888064416,{"$nulls":7},0.8165765371245745,0.8029246146268878,0.7952152982688867,0.7868149863502084,0.7751437382393446,0.7589698097661555,0.7952152982688867,-0.09185722767078557,-0.7898921574022063]
[null,null,{"$f":"C47+Sheet2!B$12","v":-1.6567164179104439},0.9926901161773639,-0.08518712261293797,-0.9890282204756125,{"$nulls":7},0.8128514187673703,0.801123176257994,0.7946173939621571,0.7875948969434567,0.7779001071163193,0.7645299647057715,0.7946173939621571,-0.06818962762568005,-0.7916861609700407]
[null,null,{"$f":"C48+Sheet2!B$12","v":-1.626865671641787},0.996869384225213,-0.0558645316456528,-0.9953028299515515,{"$nulls":7},0.809126300410166,0.7994210245981742,0.7941344058715186,0.7884818653704477,0.7807283684705166,0.7700873190352024,0.7941344058715186,-0.04450326928456298,-0.7928864443360698]
[null,null,{"$f":"C49+Sheet2!B$12","v":-1.5970149253731303},0.9993132149099955,-0.026197590359212198,-0.998969763182611,{"$nulls":7},0.8054011820529617,0.7978181596474286,0.7937633569480157,0.7894692832536867,0.7836171736564174,0.7756247555766772,0.7937633569480157,-0.020808978563693015,-0.7934905501923251]
[null,null,{"$f":"C50+Sheet2!B$12","v":-1.5671641791044735},0.9999868077352092,3.6320917880968513E-3,-0.9999802115810578,{"$nulls":7},0.8016760636957575,0.7963145814057571,0.7935012701426928,0.7905506637664247,0.7865555886998695,0.7811260969728833,0.7935012701426928,2.8821074686545775E-3,-0.7934960360169455]
[null,null,{"$f":"C51+Sheet2!B$12","v":-1.5373134328358167},0.9988805706432283,0.033439163276310496,-0.9983206983569567,{"$nulls":7},0.7979509453385534,0.7949102898731597,0.7933451684065939,0.7917196416326596,0.7895330889197286,0.7865760832352712,0.7933451684065939,0.02655852901787542,-0.7929004986569838]
[null,null,{"$f":"C52+Sheet2!B$12","v":-1.5074626865671599},0.9960102566075663,0.06303879251661222,-0.9940133509694513,{"$nulls":7},0.7942258269813491,0.7936052850496363,0.7932920746907638,0.7929699731271356,0.7925395535494972,0.7919603495081271,0.7932920746907638,0.05020849350671638,-0.7917015996870048]
[null,null,{"$f":"C53+Sheet2!B$12","v":-1.477611940298503},0.9914167393082937,0.09225091771512245,-0.9871154538155134,{"$nulls":7},0.7905007086241448,0.7923995669351871,0.7933390119462462,0.7942955360753418,0.7955652603589642,0.7972654040484237,0.7933390119462462,0.07381986707457792,-0.7898970914625132]
[null,null,{"$f":"C54+Sheet2!B$12","v":-1.4477611940298463},0.9851654310850211,0.12090438545027085,-0.9777182908096932,{"$nulls":7},0.7867755902669405,0.791293135529812,0.7934830031240865,0.7956903298535141,0.7986008802758456,0.8024786064214526,0.7934830031240865,0.09738016766614871,-0.7874848437856642]
[null,null,{"$f":"C55+Sheet2!B$12","v":-1.4179104477611895},0.9773453514558799,0.14884088132629836,-0.9659453028295277,{"$nulls":7},0.7830504719097364,0.7902859908335108,0.7937210711753284,0.7971484753886349,0.8016374720074253,0.8075881459122288,0.7937210711753284,0.12087655973910115,-0.7844628710992957]
[null,null,{"$f":"C56+Sheet2!B$12","v":-1.3880597014925327},0.9680678594669248,0.17591856077426554,-0.9519495997730051,{"$nulls":7},0.7793253535525321,0.7893781328462839,0.7940502390510165,0.7986642151584321,0.8046664766621936,0.8125830201526737,0.7940502390510165,0.14429585061654343,-0.7808293601241084]
[null,null,{"$f":"C57+Sheet2!B$12","v":-1.3582089552238759},0.9574650679234802,0.20201529486428033,-0.935910880872005,{"$nulls":7},0.7756002351953277,0.788569561568131,0.7944675297021948,0.8002319131913793,0.8076797123714871,0.8174530139645734,0.7944675297021948,0.16762448850584266,-0.7765826978527544]
[null,null,{"$f":"C58+Sheet2!B$12","v":-1.328358208955219},0.9456879620850049,0.22703145471645905,-0.9180318296234713,{"$nulls":7},0.7718751168381235,0.787860276999052,0.7949699660799083,0.8018460550666971,0.8106693689111301,0.8221886784183181,0.7949699660799083,0.19084856220131585,-0.7717214998137483]
[null,null,{"$f":"C59+Sheet2!B$12","v":-1.2985074626865623},0.9329042496135243,0.25089216855810376,-0.8985340609588403,{"$nulls":7},0.7681499984809194,0.7872502791390473,0.7955545711352009,0.8035012479143514,0.8136280023230736,0.8267813101074133,0.7955545711352009,0.21395380248413565,-0.7662446385174208]
{"$rows_left_out":152}
{"sheet":"Sheet3","index":2,"n_rows":0,"n_cols":0,"rows_kept":0}