{"text_format":"3","workbook":"xlsx","n_sheets":3,"sheets":["Sheet1","Sheet2","Sheet3"],"not_rendered":{"charts":1,"images":2,"macros":1,"defined_names":4,"comments":1},"read":"whole","date_system":"1900"}

{"sheet":"Sheet1","index":0,"n_rows":37,"n_cols":14,"rows_kept":37,"merged":[[30,2,30,3]]}
[null,"       Intersection of Curves"]
[null,"        in Polar Coordinates"]
[]
[null,"  This graphing utility lets you locate the"]
[null,null," the points of intersection"]
[null,"    of any two polar coordinate curves"]
[null,null,"r = f(Q)   and   r = g(Q)"]
[null,"  on any interval from Q = a  to Q = b."]
[]
["Enter the first function  in terms of Q:    r = f(Q) = ",{"$nulls":4},"(sin(Q))^2+(cos(Q))^4"]
[]
[]
["Enter the second function  in terms of Q:   r = g(Q) = ",{"$nulls":4},"sin(2*Q)"]
[]
["Now enter the interval for Q (in radians):  "]
[null,"   Starting angle a =",null,-3.14]
[null,"    Ending angle b =",null,3.14]
[]
[]
[]
[]
[]
["Click each item below for suggestions and investigations",{"$nulls":7},"The graphs of the polar functions r =",{"$nulls":4},{"$f":"F10","v":"(sin(Q))^2+(cos(Q))^4"}]
[null,"   Item 1",{"$nulls":9},"      and  r =",null,{"$f":"F13","v":"sin(2*Q)"}]
[null,"   Item 2"]
[null,"   Item 3",{"$nulls":6},"Now trace along the first polar curve:"]
[{"$nulls":8},"Q =",{"$f":"Sheet1!D16+K27*Sheet2!B12","v":0.1718407960199002},106]
[{"$nulls":8},"r =",{"$f":"LOOKUP(J27,Sheet2!C3:C204,Sheet2!D3:D204)","v":0.9716152204088453}]
[]
["To access/download all the DIGMath Apps for Calculus",{"$nulls":7},"Now trace along the second polar curve:"]
["     Click this link:",null,"DIGMath for Calculus",{"$nulls":5},"Q =",{"$f":"Sheet1!D16+K31*Sheet2!B12","v":-0.7654726368159204},76]
[{"$nulls":8},"r =",{"$f":"LOOKUP(J31,Sheet2!C3:C204,Sheet2!E3:E204)","v":-0.9992060518620877}]
["Created by:  Sheldon P. Gordon   "]
["                      Farmingdale State College    ",{"$nulls":7},"Be sure that both the Q and the r coordinates are the same"]
["Development of this module was supported by the ",{"$nulls":8},"for a true point of intersection in polar coordinates."]
["NSF's Division of Undergraduate Education  "]
["under grants DUE-0310123 and DUE-0442160."]

{"sheet":"Sheet2","index":1,"n_rows":204,"n_cols":11,"rows_kept":204}
[null,null,"Q","r = f(Q)","r = g(Q)","x1","y1","x2","y2","Tracing point"]
[]
[null,null,{"$f":"Sheet1!D16","v":-3.14},{"$f":"(SIN(Q))^2+(COS(Q))^4","v":0.9999974634631215},{"$f":"SIN(2*Q)","v":3.1853017931379904E-3},{"$f":"D3*COS($C3)","v":-0.999996195193878},{"$f":"D3*SIN($C3)","v":-0.001592648876663971},{"$f":"E3*COS($C3)","v":-0.003185297753307448},{"$f":"E3*SIN($C3)","v":-5.0730801907319441E-6},0,0]
[null,null,{"$f":"C3+Sheet2!B$12","v":-3.108756218905473},0.9989233177768206,0.06562567251249009,{"$f":"D4*COS(C4)","v":-0.9983848308988108},{"$f":"D4*SIN(C4)","v":-0.03279518607057916},{"$f":"E4*COS($C4)","v":-0.06559029585956823},{"$f":"E4*SIN($C4)","v":-0.002154525880769209},{"$f":"LOOKUP(Sheet1!$J$27,Sheet2!C3:C204,F3:F204)","v":0.9573049479427408},{"$f":"LOOKUP(Sheet1!J27,Sheet2!C3:C204,G3:G204)","v":0.1661426290103635}]
[null,null,{"$f":"C4+Sheet2!B$12","v":-3.0775124378109457},0.9959161587497741,0.1278098783385016,-0.9938721060053526,-0.06377485525965802,-0.12754755692691816,-0.008184480611324643]
[null,null,{"$f":"C5+Sheet2!B$12","v":-3.0462686567164186},0.9910228934421007,0.18949518788506967,-0.9865237556240214,-0.09432526128153286,-0.18863490002310457,-0.018036095056058996]
[null,null,{"$f":"C6+Sheet2!B$12","v":-3.0150248756218914},0.9843198492737655,0.2504408171703209,-0.9764462606590817,-0.12425081778091124,-0.2484375374760435,-0.03161317569902774,"Start line:"]
[null,null,{"$f":"C7+Sheet2!B$12","v":-2.983781094527364},0.9759115834341137,0.31040886949883534,-0.9637844938077971,-0.15337166679842568,-0.30655159774889906,-0.04878303169281473,0,0]
[null,null,{"$f":"C8+Sheet2!B$12","v":-2.952537313432837},0.9659292519503736,0.36916526407356437,-0.9487185219202878,-0.1815281959883712,-0.36258755283474803,-0.06937765294252395,{"$f":"1.2*D3*COS(C3)","v":-1.1999954342326535},{"$f":"1.2*D3*SIN(C3)","v":-0.001911178651996765}]
[null,null,{"$f":"C9+Sheet2!B$12","v":-2.92129353233831},0.9545285638551636,0.42648064971267524,-0.9314596402334471,-0.20858503741059298,-0.41617352019669085,-0.09319520194967201]
[null,null,{"$f":"C10+Sheet2!B$12","v":-2.8900497512437826},0.9418873523648387,0.48213130010469696,-0.9122457320692272,-0.23443444470965746,-0.46695841038019703,-0.12000180630242559]
["delta Q = ",{"$f":"(Sheet1!D17-Sheet1!D16)/201","v":0.031243781094527363},{"$f":"C11+Sheet2!B$12","v":-2.8588059701492554},0.9282028009545705,0.5358999871074068,-0.8913360634107483,-0.25899896093100566,-0.5146148927787662,-0.1495336360556306,"End line"]
[null,null,{"$f":"C12+Sheet2!B$12","v":-2.8275621890547282},0.9136883675991183,0.5875768286815999,-0.8690056349588317,-0.28223330685044845,-0.5588421536297592,-0.18149924773942955,0,0]
[null,null,{"$f":"C13+Sheet2!B$12","v":-2.796318407960201},0.8985704551564179,0.6369601081498966,-0.8455392245104806,-0.30412543907773826,-0.5993684221405026,-0.21558217439095528,{"$f":"1.2*D204*COS(C204)","v":-1.1999954342326535},{"$f":"1.2*D204*SIN(C204)","v":1.9111786520068902E-3}]
[null,null,{"$f":"C14+Sheet2!B$12","v":-2.765074626865674},0.8830848798308787,0.6838570615826716,-0.8212252595446417,-0.3246967478613751,-0.6359532426794792,-0.2514437388402053]
[null,null,{"$f":"C15+Sheet2!B$12","v":-2.7338308457711467},0.8674731928029431,0.7280846302376038,-0.7963496635820585,-0.34400138596301394,-0.6683894731957372,-0.2887260655177384]
[null,null,{"$f":"C16+Sheet2!B$12","v":-2.7025870646766195},0.8519789124018323,0.7694701751157551,-0.7711898201192757,-0.36212474165929104,-0.6965049924320058,-0.3270552643055335,"Second Tracing Point"]
[null,null,{"$f":"C17+Sheet2!B$12","v":-2.6713432835820923},0.8368437255937923,0.8078521508449614,-0.7460087947196502,-0.37918109033367303,-0.7201641010523188,-0.36604475843854933]
[null,null,{"$f":"C18+Sheet2!B$12","v":-2.640099502487565},0.8223037180367889,0.8430807362600834,-0.7210499492578843,-0.3953104797147797,-0.7392686044907752,-0.4052987271965037,0,0]
[null,null,{"$f":"C19+Sheet2!B$12","v":-2.608855721393038},0.8085856915070045,0.8750184192186939,-0.696532072522005,-0.4106749230937544,-0.7537585681208481,-0.4444156331143077,{"$f":"LOOKUP(Sheet1!$J$31,Sheet2!C3:C2040,H3:H204)","v":-0.7204824781521331},{"$f":"LOOKUP(Sheet1!J31,Sheet2!C3:C204,I3:I204)","v":0.6923277639626929}]
[null,null,{"$f":"C20+Sheet2!B$12","v":-2.5776119402985107},0.7959036261396267,0.9035405333694185,-0.6726451386183616,-0.42545399233676473,-0.7636127382198409,-0.4829918026943005]
[null,null,{"$f":"C21+Sheet2!B$12","v":-2.5463681592039835},0.784455342667534,0.9285357447776924,-0.6495467892132915,-0.43983991776820586,-0.7688486251354889,-0.5206250291304985]
[null,null,{"$f":"C22+Sheet2!B$12","v":-2.5151243781094563},0.7744194167218281,0.9499064865094289,-0.6273596179559071,-0.4540323146583235,-0.7695222480255202,-0.5569181653586438]
[null,null,{"$f":"C23+Sheet2!B$12","v":-2.483880597014929},0.7659523933263818,0.9675693394762327,-0.6061693158911998,-0.4682326657917056,-0.7657275435102512,-0.5914826758276438]
[null,null,{"$f":"C24+Sheet2!B$12","v":-2.452636815920402},0.759186345036009,0.9814553580555583,-0.5860237157669747,-0.482638696177381,-0.7575954435269046,-0.623942115747316]
[null,null,{"$f":"C25+Sheet2!B$12","v":-2.4213930348258748},0.7542268118075481,0.9915103392147799,-0.5669327513704817,-0.4974387792209954,-0.745292630576421,-0.6539355072010438]
[null,null,{"$f":"C26+Sheet2!B$12","v":-2.3901492537313476},0.7511511547387042,0.9976950340886656,-0.5488693259299476,-0.5128065135297071,-0.7290199813836297,-0.6811205824144473]
[null,null,{"$f":"C27+Sheet2!B$12","v":-2.3589054726368204},0.7500073493537958,0.9999853011843808,-0.53177106171902,-0.5288956059591844,-0.7090107127248793,-0.7051768656345553]
[null,null,{"$f":"C28+Sheet2!B$12","v":-2.327661691542293},0.7508132372592933,0.9983722006159964,-0.5155428818394916,-0.5458351896208341,-0.6855282457896422,-0.725808566488026]
[null,null,{"$f":"C29+Sheet2!B$12","v":-2.296417910447766},0.7535562478421717,0.9928620290006628,-0.500060355242234,-0.5637256955088913,-0.6588638079112364,-0.7427472593392844]
[null,null,{"$f":"C30+Sheet2!B$12","v":-2.265174129353239},0.7581935943521603,0.9834762948802369,-0.48517371785987845,-0.5826353834214596,-0.6293337928050027,-0.7557543250455326]
[null,null,{"$f":"C31+Sheet2!B$12","v":-2.2339303482587116},0.7646529413093002,0.9702516347643015,-0.47071246670670674,-0.6025976222487537,-0.5972769025698172,-0.7646231335889627]
[null,null,{"$f":"C32+Sheet2!B$12","v":-2.2026865671641844},0.7728335328262839,0.9532396701222965,-0.4564904103375684,-0.6236089918615616,-0.563051096622106,-0.7691809483388863]
[null,null,{"$f":"C33+Sheet2!B$12","v":-2.1714427860696572},0.7826077642454796,0.932506805882982,-0.4423110484718648,-0.6456282591840508,-0.5270303744237788,-0.7692905351379367]
[null,null,{"$f":"C34+Sheet2!B$12","v":-2.14019900497513},0.7938231725755168,0.9081339712277768,-0.4279731461338512,-0.6685762600527722,-0.4896014203218624,-0.7648514619955614]
[null,null,{"$f":"C35+Sheet2!B$12","v":-2.108955223880603},0.8063048146796814,0.8802163036897659,-0.4132763635132126,-0.6923366966562803,-0.45116014002528687,-0.7558010778859988]
[null,null,{"$f":"C36+Sheet2!B$12","v":-2.0777114427860757},0.8198579961200372,0.8488627777914705,-0.3980268020058184,-0.7167578382459336,-0.412108119192688,-0.7421151619629642]
[null,null,{"$f":"C37+Sheet2!B$12","v":-2.0464676616915485},0.8342713080914957,0.8141957796709688,-0.3820423295663809,-0.741655090944698,-0.3728490352858912,-0.7238082373946825]
[null,null,{"$f":"C38+Sheet2!B$12","v":-2.0152238805970213},0.849319925074333,0.7763506293567799,-0.36515755452178317,-0.7668143813883133,-0.33378505425097355,-0.7009335469652903]
[null,null,{"$f":"C39+Sheet2!B$12","v":-1.9839800995024939},0.8647691117668358,0.7354750525562759,-0.3472283262037953,-0.7919962791249165,-0.2953132437188859,-0.6735826905561682]
[null,null,{"$f":"C40+Sheet2!B$12","v":-1.9527363184079665},0.8803778845953233,0.6917286040194573,-0.3281356529327352,-0.8169407646573551,-0.2578220342694191,-0.6418849275874031]
[null,null,{"$f":"C41+Sheet2!B$12","v":-1.921492537313439},0.8959027706876077,0.6452820447289462,-0.30778894271707524,-0.8413725341766495,-0.22168775987711323,-0.6060061504392816]
[null,null,{"$f":"C42+Sheet2!B$12","v":-1.8902487562189116},0.9111016056756883,0.5963166753472909,-0.28612848916111056,-0.8650067187919396,-0.1872713079592915,-0.5661475377606641]
[null,null,{"$f":"C43+Sheet2!B$12","v":-1.8590049751243842},0.9257373110877912,0.5450236285234201,-0.2631271440708174,-0.8875548857356311,-0.15491490848085895,-0.5225438993799488]
[null,null,{"$f":"C44+Sheet2!B$12","v":-1.8277611940298568},0.9395815924082401,0.4916031228206748,-0.23879113864880133,-0.9087311818657997,-0.12493909034634462,-0.4754617272404451]
[null,null,{"$f":"C45+Sheet2!B$12","v":-1.7965174129353294},0.9524185001211122,0.43626368117865527,-0.2131600364706552,-0.9282584759778808,-0.09763983183762084,-0.42519696936158013]
[null,null,{"$f":"C46+Sheet2!B$12","v":-1.765273631840802},0.9640477981908648,0.3792213169595569,-0.18630582311329127,-0.9458743560699452,-0.07328593014873404,-0.3720725462578173]
[null,null,{"$f":"C47+Sheet2!B$12","v":-1.7340298507462746},0.9742880874368144,0.32069869075620333,-0.15833115882820126,-0.9613368407927602,-0.05211661314232137,-0.3164356315071306]
[null,null,{"$f":"C48+Sheet2!B$12","v":-1.7027860696517472},0.9829796350816219,0.26092424125311303,-0.12936684149055952,-0.9744296707859192,-0.03433941432208119,-0.25865472023052116]
[null,null,{"$f":"C49+Sheet2!B$12","v":-1.6715422885572198},0.9899868663371802,0.20013129353321807,-0.09956854669709062,-0.9849670553012112,-0.020128329701421005,-0.1991165111052069]
[null,null,{"$f":"C50+Sheet2!B$12","v":-1.6402985074626923},0.9952004791629883,0.13855714831089302,-0.06911292984967596,-0.9927977622123426,-0.00962227277004112,-0.13822262917042827]
[null,null,{"$f":"C51+Sheet2!B$12","v":-1.609054726368165},0.9985391492100327,0.07644215564640454,-0.03819319090708816,-0.9978084549017565,-0.002923841139590986,-0.07638621808192608]
[null,null,{"$f":"C52+Sheet2!B$12","v":-1.5778109452736375},0.9999507983556724,0.014028776757467715,-0.007014215825381424,-0.9999261972308264,-9.840570966569992E-5,-0.01402843161679778]
[null,null,{"$f":"C53+Sheet2!B$12","v":-1.54656716417911},0.9994134070423296,-0.04843936240994232,0.024212580788738572,-0.9991200674130742,-1.173530360350709E-3,0.04842514488543187]
[null,null,{"$f":"C54+Sheet2!B$12","v":-1.5153233830845827},0.9969353577487546,-0.11071842215720824,0.05527457987533008,-0.9954018426491098,-0.006138727272166276,0.11054811184484221]
[null,null,{"$f":"C55+Sheet2!B$12","v":-1.4840796019900553},0.9925553042362364,-0.17256530084305585,0.085963312894863,-0.9888257383399907,-0.014945550024119457,0.1719168798853996]
[null,null,{"$f":"C56+Sheet2!B$12","v":-1.4528358208955279},0.9863415686093215,-0.2337385838125878,0.11607971074027158,-0.9794872080436537,-0.02750802365154369,0.23211426969813864]
[null,null,{"$f":"C57+Sheet2!B$12","v":-1.4215920398010005},0.9783910755959638,-0.29399948574129253,0.14543911238006393,-0.9675208325384659,-0.04370340788356353,0.2907330558356021]
[null,null,{"$f":"C58+Sheet2!B$12","v":-1.390348258706473},0.9688278406707009,-0.3531127827156591,0.17387590498489064,-0.9530973478739401,-0.06337328685137057,0.34737942344193357]
[null,null,{"$f":"C59+Sheet2!B$12","v":-1.3591044776119456},0.9578010356038084,-0.41084773041209127,0.20124767643288843,-0.9364198826029332,-0.08632497568875082,0.4016763076870517]
[null,null,{"$f":"C60+Sheet2!B$12","v":-1.3278606965174182},0.9454826616108969,-0.4669789647900777,0.2274387731910355,-0.9177194930130789,-0.1123332316606608,0.4532665867026655]
[null,null,{"$f":"C61+Sheet2!B$12","v":-1.2966169154228908},0.9320648663982396,-0.5212873817838312,0.25236317133393865,-0.8972501016596461,-0.1411422547785691,0.5018161001034774]
[null,null,{"$f":"C62+Sheet2!B$12","v":-1.2653731343283634},0.9177569469538027,-0.573560992558585,0.275966585525845,-0.8752829584512494,-0.17246796031626754,0.5470164667074799]
[null,null,{"$f":"C63+Sheet2!B$12","v":-1.234129353233836},0.9027820848358321,-0.6235957509931189,0.29822775973765026,-0.8521007546190732,-0.20600050324925767,0.588587676831349]
[null,null,{"$f":"C64+Sheet2!B$12","v":-1.2028855721393086},0.8873738648834777,-0.6711963501584981,0.31915890383341955,-0.827991527844392,-0.24140703242562547,0.6262804365150985]
[null,null,{"$f":"C65+Sheet2!B$12","v":-1.1716417910447812},0.8717726316522229,-0.7161769846840296,0.338805261440663,-0.8032425014389902,-0.2783346502559818,0.6598782432070246]
[null,null,{"$f":"C66+Sheet2!B$12","v":-1.1403980099502538},{"$f":"(SIN(Q))^2+(COS(Q))^4","v":0.8562217404081229},{"$f":"SIN(2*Q)","v":-0.7583620760345994},0.3572438161928166,-0.7781340016600663,-0.3164135519023047,0.6891991747964263]
[null,null,{"$f":"C67+Sheet2!B$12","v":-1.1091542288557263},0.8409637611595887,-0.7975869578683223,{"$f":"D68*COS(C68)","v":0.37458116496863664},{"$f":"D68*SIN(C68)","v":-0.7529335949699819},{"$f":"E68*COS($C68)","v":-0.3552603163662501},{"$f":"E68*SIN($C68)","v":0.7140973763969427}]
[null,null,{"$f":"C68+Sheet2!B$12","v":-1.077910447761199},0.826236694937978,-0.8336985187992645,0.3909506076220897,-0.7278905813801633,-0.3944813205405688,0.7344642319355358]
[null,null,{"$f":"C69+Sheet2!B$12","v":-1.0466666666666715},0.8122702613472134,-0.8665558000562609,0.406508522384437,-0.7032309710883701,-0.43367624620440964,0.7502292103678706]
[null,null,{"$f":"C70+Sheet2!B$12","v":-1.015422885572144},0.7992823152909393,-0.8960305457049123,0.4214301141426528,-0.6791530596489683,-0.47244164912403047,0.7613603791958243]
[null,null,{"$f":"C71+Sheet2!B$12","v":-0.9841791044776167},0.7874754487707745,-0.9220077032850115,0.43590463871063745,-0.6558237021999748,-0.5103745588719534,0.7678645808820463]
[null,null,{"$f":"C72+Sheet2!B$12","v":-0.9529353233830893},0.7770338307623837,-0.9443858729091967,0.45013021961864463,-0.6333753701679089,-0.5470760777047252,0.7697872707142402]
[null,null,{"$f":"C73+Sheet2!B$12","v":-0.9216915422885619},0.7681203344624441,-0.9630777030698114,0.4643083845196253,-0.6119040547990124,-0.5821549468445675,0.7672120176422048]
[null,null,{"$f":"C74+Sheet2!B$12","v":-0.8904477611940345},0.7608739967170439,-0.9780102316089667,0.4786384557855291,-0.5914680612876847,-0.6152310487932825,0.7602596725675659]
[null,null,{"$f":"C75+Sheet2!B$12","v":-0.859203980099507},0.7554078492605224,-0.9891251705208549,0.49331193405418466,-0.5720877156906342,-0.6459388148653412,0.7490872114835955]
[null,null,{"$f":"C76+Sheet2!B$12","v":-0.8279601990049796},0.7518071555940957,-0.996379133474611,0.5085070142805799,-0.5537459847528783,-0.6739305079562147,0.733886263714954]
[null,null,{"$f":"C77+Sheet2!B$12","v":-0.7967164179104522},0.7501280810062505,-0.9997438051696037,0.5243833712202977,-0.5363899867649987,-0.6988793516544503,0.7148813382695438]
[null,null,{"$f":"C78+Sheet2!B$12","v":-0.7654726368159248},0.7503968164805448,-0.9992060518620877,0.5410773452861308,-0.519933350153892,-0.7204824781521331,0.6923277639626929]
[null,null,{"$f":"C79+Sheet2!B$12","v":-0.7342288557213974},0.7526091701565103,-0.9947679726317888,0.5586976505121727,-0.5042593562006057,-0.7384636689964335,0.6665093614843571]
[null,null,{"$f":"C80+Sheet2!B$12","v":-0.70298507462687},0.7567306327162326,-0.9864468911883034,0.5773217141522837,-0.489224783570271,-0.7525758645409286,0.6377358679308718]
[null,null,{"$f":"C81+Sheet2!B$12","v":-0.6717412935323426},0.7626969156766875,-0.9742752882492965,0.5969927425245537,-0.47466435568277515,-0.7626034199834195,0.6063401364934059]
[null,null,{"$f":"C82+Sheet2!B$12","v":-0.6404975124378152},0.770414954191289,-0.9583006747544548,0.6177175904492095,-0.46039567775033313,-0.7683640880991958,0.5726751359665746]
[null,null,{"$f":"C83+Sheet2!B$12","v":-0.6092537313432878},0.7797643587184987,-0.9385854064100958,0.6394654924310617,-0.44622453890118063,-0.7697107111756497,0.5371107764953895]
[null,null,{"$f":"C84+Sheet2!B$12","v":-0.5780099502487603},0.7905992929136856,-0.9152064402883415,0.6621676930730868,-0.43195044647029357,-0.7665326072047545,0.5000305895014215]
[null,null,{"$f":"C85+Sheet2!B$12","v":-0.5467661691542329},0.8027507484520149,-0.888255034430957,0.6857179925755076,-0.4173722544665448,-0.7587566380718151,0.46182829100640543]
[null,null,{"$f":"C86+Sheet2!B$12","v":-0.5155223880597055},0.8160291812986233,-0.8578363916304244,0.7099742010990862,-0.4022937465392868,-0.7463479502685288,0.4229042585922637]
[null,null,{"$f":"C87+Sheet2!B$12","v":-0.48427860696517816},0.8302274683043154,-0.8240692487787288,0.734760473787978,-0.3865290355016801,-0.7293103815312715,0.38366195299175754]
[null,null,{"$f":"C88+Sheet2!B$12","v":-0.4530348258706508},0.8451241380084322,-0.7870854133868007,0.7598704768903622,-0.3699076465753433,-0.7076865297364264,0.3445043157870231]
[null,null,{"$f":"C89+Sheet2!B$12","v":-0.42179104477612345},0.8604868252533316,-0.747029249083778,0.7850713152033658,-0.3522791598709966,-0.6815574833477831,0.30583017489991005]
[null,null,{"$f":"C90+Sheet2!B$12","v":-0.3905472636815961},0.8760758957238032,-0.7040571121044003,0.8101081324944306,-0.3335172990035902,-0.6510422156805161,0.2680306894864697]
[null,null,{"$f":"C91+Sheet2!B$12","v":-0.35930348258706873},0.8916481838741698,-0.6583367409641675,0.834709280066731,-0.31352336687491905,-0.6162966481959739,0.23148586549880212]
[null,null,{"$f":"C92+Sheet2!B$12","v":-0.3280597014925414},0.9069607859371616,-0.6100466017046187,0.8585919346437441,-0.2922289461919654,-0.5775123909455332,0.19656117255380648]
[null,null,{"$f":"C93+Sheet2!B$12","v":-0.296815920398014},0.9217748488494465,-0.5593751912645162,0.881468035589586,-0.26959780081680246,-0.5349151711146497,0.1636042918556818]
[null,null,{"$f":"C94+Sheet2!B$12","v":-0.26557213930348667},0.935859295992404,-0.506520301696175,0.9030504034308027,-0.2456269341071185,-0.48876296335505476,0.13294202376513445]
[null,null,{"$f":"C95+Sheet2!B$12","v":-0.2343283582089593},0.948994431632311,-0.4516882480990135,0.9230588969002708,-0.22034678151129922,-0.43934383820982537,0.10487738220328895]
[null,null,{"$f":"C96+Sheet2!B$12","v":-0.20308457711443195},0.9609753678362106,-0.3950930632840277,0.9412264644030417,-0.1938205363094684,-0.3869735474097758,0.07968690143461915]
[null,null,{"$f":"C97+Sheet2!B$12","v":-0.1718407960199046},0.9716152204088426,-0.3369556623127581,0.9573049479427368,-0.16614262901037097,-0.3319928671286072,0.057618178905241554]
[null,null,{"$f":"C98+Sheet2!B$12","v":-0.14059701492537724},0.9807480239989276,-0.2775029801719061,0.9710705030970491,-0.13743640199250312,-0.27476472240820743,0.0388876757370509]
[null,null,{"$f":"C99+Sheet2!B$12","v":-0.10935323383084988},0.9882313209036319,-0.2169670859496252,0.9823285074609105,-0.10785104099894809,-0.21567111788579127,0.02367879421265297]
[null,null,{"$f":"C100+Sheet2!B$12","v":-0.07810945273632253},0.9939483831898346,-0.1555842769712307,0.9909178418753124,-0.07755784356762097,-0.15510990165433727,0.012140249150756437]
[null,null,{"$f":"C101+Sheet2!B$12","v":-0.04686567164179516},0.997810033470525,-0.09359415643030368,0.9967144434436029,-0.046745920948879825,-0.09349139055210684,0.004384747488007003]
[null,null,{"$f":"C102+Sheet2!B$12","v":-0.0156218905472678},0.9997560359350108,-0.03123869811558535,0.9996340464527181,-0.01561744412673276,-0.031234886393051407,4.8798767386860778E-4]
[null,null,{"$f":"C103+Sheet2!B$12","v":0.015621890547259563},0.9997560359350111,0.031238698115568883,0.9996340464527185,0.01561744412672453,0.031234886393034948,4.8798767386809327E-4]
[null,null,{"$f":"C104+Sheet2!B$12","v":0.04686567164178693},0.997810033470526,0.09359415643028728,{"$f":"D105*COS(C105)","v":0.9967144434436044},{"$f":"D105*SIN(C105)","v":0.04674592094887166},0.09349139055209049,0.004384747488005465]
[null,null,{"$f":"C105+Sheet2!B$12","v":0.07810945273631428},0.9939483831898359,0.1555842769712144,0.9909178418753144,0.0775578435676129,0.15510990165432115,0.012140249150753889]
[null,null,{"$f":"C106+Sheet2!B$12","v":0.10935323383084164},0.9882313209036335,0.2169670859496091,0.982328507460913,0.10785104099894016,0.21567111788577545,0.023678794212649436]
[null,null,{"$f":"C107+Sheet2!B$12","v":0.140597014925369},0.9807480239989299,0.2775029801718903,0.9710705030970526,0.13743640199249543,0.2747647224081921,0.03888767573704642]
[null,null,{"$f":"C108+Sheet2!B$12","v":0.17184079601989635},0.9716152204088453,0.33695566231274254,0.9573049479427408,0.1661426290103635,0.3319928671285924,0.05761817890523616]
[null,null,{"$f":"C109+Sheet2!B$12","v":0.2030845771144237},0.9609753678362136,0.3950930632840126,0.9412264644030462,0.19382053630946125,0.3869735474097617,0.0796869014346129]
[null,null,{"$f":"C110+Sheet2!B$12","v":0.23432835820895107},0.9489944316323143,0.45168824809899877,0.9230588969002759,0.2203467815112924,0.43934383820981193,0.1048773822032819]
[null,null,{"$f":"C111+Sheet2!B$12","v":0.26557213930347845},0.9358592959924075,0.5065203016961608,0.9030504034308079,0.24562693410711198,0.4887629633550421,0.13294202376512668]
[null,null,{"$f":"C112+Sheet2!B$12","v":0.2968159203980058},0.9217748488494505,0.5593751912645025,0.8814680355895921,0.2695978008167964,0.534915171114638,0.16360429185567343]
[null,null,{"$f":"C113+Sheet2!B$12","v":0.32805970149253316},0.9069607859371656,0.6100466017046057,0.8585919346437503,0.2922289461919596,0.5775123909455225,0.19656117255379754]
[null,null,{"$f":"C114+Sheet2!B$12","v":0.3593034825870605},0.8916481838741738,0.6583367409641552,0.8347092800667372,0.3135233668749136,0.6162966481959642,0.23148586549879271]
[null,null,{"$f":"C115+Sheet2!B$12","v":0.3905472636815879},0.8760758957238071,0.7040571121043886,0.8101081324944369,0.333517299003585,0.6510422156805076,0.2680306894864599]
[null,null,{"$f":"C116+Sheet2!B$12","v":0.42179104477611523},0.8604868252533358,0.7470292490837671,0.7850713152033725,0.35227915987099184,0.6815574833477758,0.3058301748999]
[null,null,{"$f":"C117+Sheet2!B$12","v":0.4530348258706426},0.8451241380084362,0.7870854133867906,0.7598704768903688,0.3699076465753388,0.7076865297364202,0.3445043157870129]
[null,null,{"$f":"C118+Sheet2!B$12","v":0.48427860696516994},0.830227468304319,0.8240692487787195,0.7347604737879844,0.3865290355016758,0.7293103815312664,0.3836619529917472]
[null,null,{"$f":"C119+Sheet2!B$12","v":0.5155223880596973},0.8160291812986271,0.8578363916304159,0.7099742010990927,0.4022937465392828,0.7463479502685251,0.42290425859225345]
{"$rows_left_out":85}
{"sheet":"Sheet3","index":2,"n_rows":0,"n_cols":0,"rows_kept":0}