{"text_format":"3","workbook":"xlsx","n_sheets":3,"sheets":["Sheet1","Sheet2","Sheet3"],"not_rendered":{"charts":1,"images":1,"macros":1,"defined_names":6,"comments":1},"read":"whole","date_system":"1900"}

{"sheet":"Sheet1","index":0,"n_rows":35,"n_cols":15,"rows_kept":35,"merged":[[28,2,28,3]]}
[null,"      Slopes of Polar Curves"]
[]
[null,"   This graphing utility produces the graph "]
[null,"       of any polar coordinate function"]
[{"$nulls":3},"r = f(Q)"]
[null,"   along with the tangent line to the curve"]
[null,"  on any interval from Q = a  to Q = b."]
[]
["Enter the function  in terms of Q:  r = f(Q) =",{"$nulls":4},"(sin(Q))^4+(cos(Q))^2"]
[]
[]
["Now enter the interval for Q (in radians):  "]
[null,"   Starting angle a =",null,-6.28]
[null,"    Ending angle b =",null,6.28]
[]
[]
[]
[]
[{"$nulls":8},"The graph of the polar function r =",{"$nulls":4},{"$f":"F9","v":"(sin(Q))^4+(cos(Q))^2"}]
["Click each item below for suggestions and investigations"]
[null,null,"   Item 1"]
[null,null,"   Item 2",{"$nulls":5},"Now trace along the polar curve:"]
[null,null,"   Item 3",{"$nulls":5},"Q =",{"$f":"Sheet1!D13+K23*Sheet2!B12","v":0.46865671641791007},108]
[null,null,"   Item 4",{"$nulls":5},"r =",{"$f":"LOOKUP(J23,Sheet2!C3:C204,Sheet2!D3:D204)","v":0.8376028146014278}]
[]
[{"$nulls":8},"     The slope of the tangent line at Q is m =",{"$nulls":5},{"$f":"m","v":-0.6613856764037016}]
[]
["To access/download all the DIGMath Apps for Calculus"]
["     Click this link:",null,"DIGMath for Calculus"]
[]
["Created by:  Sheldon P. Gordon   "]
["                      Farmingdale State College    "]
["Development of this module was supported by the "]
["NSF's Division of Undergraduate Education  "]
["under grants DUE-0310123 and DUE-0442160."]

{"sheet":"Sheet2","index":1,"n_rows":205,"n_cols":13,"rows_kept":205}
[null,null,"Q","r = f(Q)","x","y",null,"Tracing point",null,"slope calculation"]
[{"$nulls":9},"Q0+.0001","R0+DR","x =","y ="]
[null,null,{"$f":"Sheet1!D13","v":-6.28},{"$f":"(SIN(Q))^4+(COS(Q))^2","v":0.9999898539554309},{"$f":"D3*COS(C3)","v":0.9999847809202779},{"$f":"D3*SIN(C3)","v":0.003185269474924031},null,0,0]
[null,null,{"$f":"C3+Sheet2!B$12","v":-6.217512437810946},0.9957118190210387,{"$f":"D4*COS(C4)","v":0.9935653750594573},{"$f":"D4*SIN(C4)","v":0.06534425775189048},null,{"$f":"LOOKUP(Sheet1!$J$23,Sheet2!C3:C204,E3:E204)","v":0.7472889933184063},{"$f":"LOOKUP(Sheet1!J23,Sheet2!C3:C204,F3:F204)","v":0.3783353479301094},{"$f":"Q0+0.0001","v":0.46875671641791006},{"$f":"D205","v":0.8375551077203999},{"$f":"K4*COS(J4)","v":0.7472085952757288},{"$f":"K4*SIN(J4)","v":0.3783885220439472}]
[null,null,{"$f":"C4+Sheet2!B$12","v":-6.1550248756218915},0.9839314791488102,0.9758619488519698,0.12575616264343137]
[null,null,{"$f":"C5+Sheet2!B$12","v":-6.092537313432837},0.9653809888428323,0.9478898777915157,0.18293505186144685,{"$nulls":5},"m =",{"$f":"(M4-I4)/(L4-H4)","v":-0.6613856764037016}]
[null,null,{"$f":"C6+Sheet2!B$12","v":-6.030049751243783},0.9412132711238208,0.9112186028309609,0.2357182207518005,null,"Start line:"]
[null,null,{"$f":"C7+Sheet2!B$12","v":-5.967562189054728},0.9129303627388817,0.8678344713217774,0.28338168182893797,null,0,0,null,null,"Tangent line"]
[null,null,{"$f":"C8+Sheet2!B$12","v":-5.905074626865674},0.8822900617640731,0.8199684136737039,0.3257108436406155,null,{"$f":"1.2*D3*COS(C3)","v":1.1999817371043333},{"$f":"1.2*D3*SIN(C3)","v":0.003822323369908837},null,"start",{"$f":"H4","v":0.7472889933184063},{"$f":"I4","v":0.3783353479301094}]
[null,null,{"$f":"C9+Sheet2!B$12","v":-5.84258706467662},0.8511966795018372,0.7699045759486152,0.36301891290721533,{"$nulls":4},"end",{"$f":"H4+10000*(L4-H4)","v":-0.05669143345613581},{"$f":"M9+m*(L10-L9)","v":0.9100764863077266}]
[null,null,{"$f":"C10+Sheet2!B$12","v":-5.780099502487565},0.8215826865020495,0.7197877473949945,0.39611072878674275]
["delta Q = ",{"$f":"(Sheet1!D14-Sheet1!D13)/201","v":0.06248756218905473},{"$f":"C11+Sheet2!B$12","v":-5.717611940298511},0.795288608470586,0.6714474369564594,0.42619515502605454,null,"End line"]
[null,null,{"$f":"C12+Sheet2!B$12","v":-5.6551243781094565},0.7739486365997523,0.6262547660132124,0.4547542854557305,null,0,0]
[null,null,{"$f":"C13+Sheet2!B$12","v":-5.592636815920402},0.7588890617004913,0.5850251218408398,0.48338205881451846,null,{"$f":"1.2*D204*COS(C204)","v":1.199981737104333},{"$f":"1.2*D204*SIN(C204)","v":-0.003822323369929087}]
[null,null,{"$f":"C14+Sheet2!B$12","v":-5.530149253731348},0.751045844510076,0.5479750709961035,0.5136080043405367]
[null,null,{"$f":"C15+Sheet2!B$12","v":-5.467661691542293},0.7509064452253069,0.5147367948563707,0.5467234415149012]
[null,null,{"$f":"C16+Sheet2!B$12","v":-5.405174129353239},0.75847952758724,0.4844277872084159,0.5836273749142687]
[null,null,{"$f":"C17+Sheet2!B$12","v":-5.3426865671641846},0.7732944204249889,0.45576827902871997,0.6247075607767352]
[null,null,{"$f":"C18+Sheet2!B$12","v":-5.28019900497513},0.7944303701239399,0.42723433637314573,0.6697689413514618]
[null,null,{"$f":"C19+Sheet2!B$12","v":-5.217711442786076},0.8205737659616444,0.39723124749283556,0.7180171595440886]
[null,null,{"$f":"C20+Sheet2!B$12","v":-5.155223880597021},0.8500997817257592,0.36426999286833384,0.7680996101977187]
[null,null,{"$f":"C21+Sheet2!B$12","v":-5.092736318407967},0.8811733595432589,0.3271294481880139,0.8182009616817613]
[null,null,{"$f":"C22+Sheet2!B$12","v":-5.030248756218913},0.9118632597212366,0.2849885137861809,0.8661848252188347]
[null,null,{"$f":"C23+Sheet2!B$12","v":-4.967761194029858},0.9402620883399068,0.23751543949124912,0.9097687677495867]
[null,null,{"$f":"C24+Sheet2!B$12","v":-4.905273631840804},0.9646048428178936,0.18490591763030798,0.9467165913899613]
[null,null,{"$f":"C25+Sheet2!B$12","v":-4.8427860696517495},0.983378607778711,0.12786662673145033,0.9750300569752278]
[null,null,{"$f":"C26+Sheet2!B$12","v":-4.780298507462695},0.9954165835609026,0.06754632421436661,0.9931221822682177]
[null,null,{"$f":"C27+Sheet2!B$12","v":-4.717810945273641},0.9999706034490247,5.4217789371511565E-3,0.9999559050654999]
[null,null,{"$f":"C28+Sheet2!B$12","v":-4.655323383084586},0.9967576326402656,-0.056849702934038265,0.9951351111798529]
[null,null,{"$f":"C29+Sheet2!B$12","v":-4.592835820895532},0.9859773590107522,-0.117596107920761,0.9789394812161304]
[null,null,{"$f":"C30+Sheet2!B$12","v":-4.530348258706478},0.9682997824058828,-0.17529803967575783,0.9522998823338772]
[null,null,{"$f":"C31+Sheet2!B$12","v":-4.467860696517423},0.9448235737870203,-0.2287405290792487,0.9167166170307062]
[null,null,{"$f":"C32+Sheet2!B$12","v":-4.405373134328369},0.9170077922361284,-0.2771338514095735,0.8741282053707424]
[null,null,{"$f":"C33+Sheet2!B$12","v":-4.3428855721393145},0.886581203643502,-0.3201909306643608,0.8267430063654916]
[null,null,{"$f":"C34+Sheet2!B$12","v":-4.28039800995026},0.8554348369712691,-0.358153200003445,0.7768494356253045]
[null,null,{"$f":"C35+Sheet2!B$12","v":-4.217910447761206},0.8255044557790865,-0.39176188812424423,0.7266224807452993]
[null,null,{"$f":"C36+Sheet2!B$12","v":-4.155422885572151},0.7986502494703654,-0.4221771163781961,0.6779444692492653]
[null,null,{"$f":"C37+Sheet2!B$12","v":-4.092935323383097},0.7765412215132457,-0.45085239165200963,0.6322565852966235]
[null,null,{"$f":"C38+Sheet2!B$12","v":-4.030447761194043},0.760551459971006,-0.47937655675133356,0.5904546046067083]
[null,null,{"$f":"C39+Sheet2!B$12","v":-3.9679601990049878},0.751674737184632,-0.5092985741805315,0.552838016836092]
[null,null,{"$f":"C40+Sheet2!B$12","v":-3.905472636815933},0.7504627462835298,-0.5419523441246461,0.5191165478553142]
[null,null,{"$f":"C41+Sheet2!B$12","v":-3.842985074626878},0.7569908131586992,-0.5782989106276403,0.4884725797560731]
[null,null,{"$f":"C42+Sheet2!B$12","v":-3.7804975124378233},0.7708532149178062,-0.6188018710209804,0.45967262630055694]
[null,null,{"$f":"C43+Sheet2!B$12","v":-3.7180099502487685},0.7911883957827088,-0.663348716433124,0.4312163703151158]
[null,null,{"$f":"C44+Sheet2!B$12","v":-3.6555223880597136},0.816732513247745,-0.7112264900496663,0.4015082540217696]
[null,null,{"$f":"C45+Sheet2!B$12","v":-3.593034825870659},0.8458979865760421,-0.7611549712040876,0.36903456952527686]
[null,null,{"$f":"C46+Sheet2!B$12","v":-3.530547263681604},0.8768721658022558,-0.8113750758363877,0.3325286175207104]
[null,null,{"$f":"C47+Sheet2!B$12","v":-3.468059701492549},0.9077299889097675,-0.8597848396437034,0.2911078190035054]
[null,null,{"$f":"C48+Sheet2!B$12","v":-3.4055721393034943},0.9365536254777633,-0.90411073398219,0.24436954412063758]
[null,null,{"$f":"C49+Sheet2!B$12","v":-3.3430845771144395},0.9615516708807128,-0.9420986034220554,0.19243657969238423]
[null,null,{"$f":"C50+Sheet2!B$12","v":-3.2805970149253847},0.9811704830561918,-0.9717065442045791,0.13594818413908732]
[null,null,{"$f":"C51+Sheet2!B$12","v":-3.21810945273633},0.9941907422006196,-0.9912817577198744,0.07599808345751422]
[null,null,{"$f":"C52+Sheet2!B$12","v":-3.155621890547275},0.9998032321555178,-0.999704843388338,0.014026016345304426]
[null,null,{"$f":"C53+Sheet2!B$12","v":-3.09313432835822},0.9976591336300861,-0.9964880066078883,-0.04832597233549681]
[null,null,{"$f":"C54+Sheet2!B$12","v":-3.0306467661691654},0.9878917035090682,-0.9818179629615938,-0.1093778106747206]
[null,null,{"$f":"C55+Sheet2!B$12","v":-2.9681592039801106},0.9711079928651856,-0.9565395081201358,-0.1675795429398769]
[null,null,{"$f":"C56+Sheet2!B$12","v":-2.9056716417910557},0.9483511184061478,-0.9220812971520538,-0.22166624737333676]
[null,null,{"$f":"C57+Sheet2!B$12","v":-2.843184079602001},0.921035432206245,-0.8803308033723818,-0.2707839434181451]
[null,null,{"$f":"C58+Sheet2!B$12","v":-2.780696517412946},0.8908586189588229,-0.833470185777961,-0.314573565946779]
[null,null,{"$f":"C59+Sheet2!B$12","v":-2.7182089552238913},0.8596961839530103,-0.783788430269453,-0.35320422602103]
[null,null,{"$f":"C60+Sheet2!B$12","v":-2.6557213930348365},0.8294848894040991,-0.7334872962417021,-0.3873519949629383]
[null,null,{"$f":"C61+Sheet2!B$12","v":-2.5932338308457816},0.8021023836327829,-0.684499091415086,-0.4181258514865035]
[null,null,{"$f":"C62+Sheet2!B$12","v":-2.530746268656727},0.7792505042049647,-0.638333070069438,-0.4469476926435773]
[null,null,{"$f":"C63+Sheet2!B$12","v":-2.468258706467672},0.7623495078052058,-0.5959644247506267,-0.4753979138390219]
[null,null,{"$f":"C64+Sheet2!B$12","v":-2.405771144278617},0.7524498005144731,-0.557775694330994,-0.5050415597828043]
[null,null,{"$f":"C65+Sheet2!B$12","v":-2.3432835820895623},0.7501666545032357,-0.5235553442478007,-0.5372520926326335]
[null,null,{"$f":"C66+Sheet2!B$12","v":-2.2807960199005075},{"$f":"(SIN(Q))^4+(COS(Q))^2","v":0.7556419685327985},-0.49255277802499986,-0.5730502119954045]
[null,null,{"$f":"C67+Sheet2!B$12","v":-2.2183084577114527},0.7685354488704241,{"$f":"D68*COS(C68)","v":-0.46358364353674403},{"$f":"D68*SIN(C68)","v":-0.6129738506785272}]
[null,null,{"$f":"C68+Sheet2!B$12","v":-2.155820895522398},0.788045758729149,-0.4351745228212431,-0.656992581798534]
[null,null,{"$f":"C69+Sheet2!B$12","v":-2.093333333333343},0.8129603217831505,-0.4057323994637505,-0.7044754820567932]
[null,null,{"$f":"C70+Sheet2!B$12","v":-2.030845771144288},0.8417306844432115,-0.373722036129589,-0.7542164045182201]
[null,null,{"$f":"C71+Sheet2!B$12","v":-1.9683582089552334},0.8725687530860371,-0.3378337807858058,-0.8045151119911234]
[null,null,{"$f":"C72+Sheet2!B$12","v":-1.9058706467661786},0.9035579250414927,-0.2971254075463854,-0.8533073397643326]
[null,null,{"$f":"C73+Sheet2!B$12","v":-1.8433830845771237},0.9327722064867173,-0.25112427591075576,-0.8983321141105876]
[null,null,{"$f":"C74+Sheet2!B$12","v":-1.780895522388069},0.9583959140054612,-0.19988009534328657,-0.9373210098295685]
[null,null,{"$f":"C75+Sheet2!B$12","v":-1.718407960199014},0.9788365202959028,-0.14396351734421772,-0.9681918400497251]
[null,null,{"$f":"C76+Sheet2!B$12","v":-1.6559203980099593},0.9928236306050772,-0.08441116113206963,-0.9892287487554041]
[null,null,{"$f":"C77+Sheet2!B$12","v":-1.5934328358209044},0.9994879384509052,-0.02262298557814004,-0.9992318748080307]
[null,null,{"$f":"C78+Sheet2!B$12","v":-1.5309452736318496},0.9984152534909287,0.03977736894534974,-0.9976225635595564]
[null,null,{"$f":"C79+Sheet2!B$12","v":-1.4684577114427948},0.9896722436764493,0.10110498919614147,-0.9844942514119752]
[null,null,{"$f":"C80+Sheet2!B$12","v":-1.40597014925374},0.9738022918032416,0.1597823241756872,-0.9606042433813528]
[null,null,{"$f":"C81+Sheet2!B$12","v":-1.3434825870646852},0.9517917239764645,0.21449690868135776,-0.9273071562304649]
[null,null,{"$f":"C82+Sheet2!B$12","v":-1.2809950248756303},0.9250085089089622,0.26433211339544205,-0.8864362782410706]
[null,null,{"$f":"C83+Sheet2!B$12","v":-1.2185074626865755},0.8951172379247803,0.30885752105098285,-0.8401439765423123]
[null,null,{"$f":"C84+Sheet2!B$12","v":-1.1560199004975207},0.8639756697067176,0.34816951550149255,-0.7907160971680209]
[null,null,{"$f":"C85+Sheet2!B$12","v":-1.0935323383084659},0.8335192695879046,0.3828775948219342,-0.7403776875066703]
[null,null,{"$f":"C86+Sheet2!B$12","v":-1.031044776119411},0.8056409193329702,0.41403730041759257,-0.6911080991904129]
[null,null,{"$f":"C87+Sheet2!B$12","v":-0.9685572139303563},0.7820732735110574,0.4430359660686216,-0.6444825349921783]
[null,null,{"$f":"C88+Sheet2!B$12","v":-0.9060696517413016},0.7642810740758272,0.4714422144942641,-0.6015544851326805]
[null,null,{"$f":"C89+Sheet2!B$12","v":-0.8435820895522469},0.7533701158596373,0.5008338015038746,-0.5627895119327837]
[null,null,{"$f":"C90+Sheet2!B$12","v":-0.7810945273631922},0.7500185208257361,0.5326206677643187,-0.5280558737973817]
[null,null,{"$f":"C91+Sheet2!B$12","v":-0.7186069651741375},0.7544345924209307,0.5678806810277091,-0.49667201084502555]
[null,null,{"$f":"C92+Sheet2!B$12","v":-0.6561194029850828},0.766343869403537,0.6072244713760923,-0.46750547326679587]
[null,null,{"$f":"C93+Sheet2!B$12","v":-0.593631840796028},0.785006183758217,0.6507030779549379,-0.4391129841835805]
[null,null,{"$f":"C94+Sheet2!B$12","v":-0.5311442786069733},0.8092616625390566,0.6977680929180864,-0.4099074614604311]
[null,null,{"$f":"C95+Sheet2!B$12","v":-0.4686567164179186},0.83760281460142,0.747288993318393,-0.3783353479301182]
[null,null,{"$f":"C96+Sheet2!B$12","v":-0.4061691542288639},0.8682682219931479,0.7976268748944773,-0.343046751579449]
[null,null,{"$f":"C97+Sheet2!B$12","v":-0.3436815920398092},0.8993520130343878,0.8467583711802683,-0.30304175320431437]
[null,null,{"$f":"C98+Sheet2!B$12","v":-0.2811940298507545},0.9289223132748445,0.8924386817172723,-0.2577787102819503]
[null,null,{"$f":"C99+Sheet2!B$12","v":-0.21870646766169977},0.9551413125373005,0.9323888148036881,-0.2072342272513183]
[null,null,{"$f":"C100+Sheet2!B$12","v":-0.15621890547264505},0.9763794858156125,0.9644897438562827,-0.15190929635016406]
[null,null,{"$f":"C101+Sheet2!B$12","v":-0.09373134328359033},0.9913168691365033,0.9869654171139223,-0.09278146612196077]
[null,null,{"$f":"C102+Sheet2!B$12","v":-0.0312437810945356},0.9990250960354834,0.9985375246096326,-0.031208243384946127]
[null,null,{"$f":"C103+Sheet2!B$12","v":0.031243781094519127},0.9990250960354845,0.9985375246096343,0.031208243384929713]
[null,null,{"$f":"C104+Sheet2!B$12","v":0.09373134328357385},0.9913168691365063,{"$f":"D105*COS(C105)","v":0.9869654171139268},{"$f":"D105*SIN(C105)","v":0.0927814661219448}]
[null,null,{"$f":"C105+Sheet2!B$12","v":0.15621890547262857},0.9763794858156174,0.96448974385629,0.15190929635014894]
[null,null,{"$f":"C106+Sheet2!B$12","v":0.21870646766168328},0.9551413125373068,0.9323888148036976,0.20723422725130428]
[null,null,{"$f":"C107+Sheet2!B$12","v":0.281194029850738},0.9289223132748519,0.8924386817172835,0.25777871028193766]
[null,null,{"$f":"C108+Sheet2!B$12","v":0.3436815920397927},0.8993520130343959,0.846758371180281,0.30304175320430315]
[null,null,{"$f":"C109+Sheet2!B$12","v":0.4061691542288474},0.8682682219931562,0.7976268748944906,0.3430467515794392]
[null,null,{"$f":"C110+Sheet2!B$12","v":0.46865671641790213},0.8376028146014278,0.7472889933184063,0.3783353479301094]
[null,null,{"$f":"C111+Sheet2!B$12","v":0.5311442786069569},0.8092616625390636,0.6977680929180992,0.4099074614604232]
[null,null,{"$f":"C112+Sheet2!B$12","v":0.5936318407960116},0.7850061837582227,0.65070307795495,0.43911298418357303]
[null,null,{"$f":"C113+Sheet2!B$12","v":0.6561194029850663},0.7663438694035412,0.6072244713761031,0.46750547326678843]
[null,null,{"$f":"C114+Sheet2!B$12","v":0.718606965174121},0.7544345924209328,0.5678806810277188,0.4966720108450176]
[null,null,{"$f":"C115+Sheet2!B$12","v":0.7810945273631758},0.7500185208257361,0.5326206677643274,0.528055873797373]
[null,null,{"$f":"C116+Sheet2!B$12","v":0.8435820895522305},0.7533701158596355,0.5008338015038827,0.5627895119327742]
[null,null,{"$f":"C117+Sheet2!B$12","v":0.9060696517412852},0.7642810740758236,0.47144221449427176,0.60155448513267]
[null,null,{"$f":"C118+Sheet2!B$12","v":0.9685572139303399},0.7820732735110519,0.4430359660686291,0.6444825349921666]
[null,null,{"$f":"C119+Sheet2!B$12","v":1.0310447761193946},0.8056409193329634,0.41403730041760045,0.6911080991904004]
{"$rows_left_out":86}
{"sheet":"Sheet3","index":2,"n_rows":0,"n_cols":0,"rows_kept":0}