{"text_format":"3","workbook":"xlsx","n_sheets":3,"sheets":["Sheet1","Sheet2","Sheet3"],"not_rendered":{"charts":4,"images":3,"macros":1,"defined_names":7,"comments":1},"read":"whole","date_system":"1900"}

{"sheet":"Sheet1","index":0,"n_rows":38,"n_cols":13,"rows_kept":38,"merged":[[31,2,31,3]]}
[null,"     Visualizing the Product Rule"]
[]
[null,"    This DIGMath program helps you visualize "]
[null,"      the Product Rule for finding the derivative"]
[null,null,"of the product of two functions:  "]
[null,null,"   y = f(x)    and    y = g(x)"]
[null,"        on any interval from x = a  to x = b."]
[]
[]
["Enter the first function in terms of x:   y = f(x) =  ",{"$nulls":4},"sin(3*x)"]
[]
["Enter the second function in terms of x:  y = g(x) = ",{"$nulls":4},"x^3"]
[]
[{"$nulls":8},"Now trace along the various curves:"]
["Now enter the interval for x :  ",{"$nulls":7},"x  = ",{"$f":"D16+K15*Sheet2!B12","v":1.1177644710578842},280]
[null,"   Starting value a =",null,0,{"$nulls":4},"f(x) =",{"$f":"LOOKUP(J15,Sheet2!C3:C504,Sheet2!D3:D504)","v":-0.19839952238850211},null,"slope of  f(x) =",{"$f":"LOOKUP(x0,Sheet2!C3:C504,Sheet2!E3:E504)","v":-2.9367293886784376}]
[null,"    Ending value b =",null,2,{"$nulls":4},"g(x) =",{"$f":"LOOKUP(J15,Sheet2!C$3:C$504,Sheet2!F$3:F$504)","v":1.38162257005585},null,"slope of g(x) =",{"$f":"LOOKUP(x0,Sheet2!C3:C504,Sheet2!G3:G504)","v":3.7348217736185436}]
[{"$nulls":8},"f(x)g(x) =",{"$f":"LOOKUP(x0,Sheet2!C$3:C$504,Sheet2!H$3:H$504)","v":-0.27411325802025543},null,"slope of product f∙g is",{"$f":"LOOKUP(x0,Sheet2!C3:C504,Sheet2!I3:I504)","v":-4.842223534946171}]
[]
[{"$nulls":8},"f'(x)g'(x) =",{"$f":"LOOKUP(x0,Sheet2!C$3:C$504,Sheet2!J$3:J$504)","v":-10.968160864061703},null,"f'(x)g(x) + f(x)g'(x) =",{"$f":"LOOKUP(x0,Sheet2!C$3:C$504,Sheet2!K$3:K$504)","v":-4.798438461636545}]
[]
[]
["Click each item below for suggestions and investigations"]
[null,null,"   Item 1"]
[null,null,"   Item 2"]
[null,null,"   Item 3"]
[null,null,"   Item 4"]
[]
[]
[]
["To access/download all the DIGMath Apps for Calculus"]
["     Click this link:",null,"DIGMath for Calculus"]
[]
["Created by:  Sheldon P. Gordon   "]
["                      Farmingdale State College    "]
["Development of this module was supported by the "]
["NSF's Division of Undergraduate Education  "]
["under grants DUE-0310123 and DUE-0442160."]

{"sheet":"Sheet2","index":1,"n_rows":504,"n_cols":20,"rows_kept":504}
[null,null,"x","y = f(x)","f'(x)","y = g(x)","g'(x)","f g","slope of fg","f' * g'","fg' + f'g",null,"Tracing points",{"$nulls":5},"Product"]
[{"$nulls":12},{"$f":"x0","v":1.1177644710578842},{"$f":"Sheet1!J16","v":-0.19839952238850211},null,{"$f":"x0","v":1.1177644710578842},{"$f":"Sheet1!J17","v":1.38162257005585},null,{"$f":"x0","v":1.1177644710578842},{"$f":"Sheet1!J18","v":-0.27411325802025543}]
[null,null,{"$f":"a","v":0},{"$f":"SIN(3*x)","v":0},{"$f":"(D4-D3)/dx","v":2.99992828765257},{"$f":"x^3","v":0},{"$f":"(F4-F3)/dx","v":1.5936191489276934E-5},{"$f":"D3*F3","v":0},{"$f":"(H4-H3)/dx","v":1.9084803052347308E-7},{"$f":"E3*G3","v":4.7807431646130011E-5},{"$f":"D3*G3+F3*E3","v":0},null,{"$f":"M2+40*dx","v":1.2774451097804391},{"$f":"N2+40*dx*LOOKUP(x0,C3:C504,E3:E504)","v":-0.6673383469279732},null,{"$f":"P2+40*dx","v":1.2774451097804391},{"$f":"Q2+40*dx*LOOKUP(x0,C3:C504,G3:G504)","v":1.9780012963821645},null,{"$f":"S2+40*dx","v":1.2774451097804391},{"$f":"T2+40*dx*LOOKUP(x0,C3:C504,I3:I504)","v":-1.0473226049178477}]
[null,null,{"$f":"C3+B$12","v":0.003992015968063872},0.011975761627355568,2.9994980259103414,6.3617530895317091E-8,1.1155334042493853E-4,{"$f":"D4*F4","v":7.618683853232458e-10},2.8625014803346614E-6,{"$f":"E4*G4","v":3.3460402438830741E-4},{"$f":"D4*G4+F4*E4","v":1.5267568719981054E-6}]
[null,null,{"$f":"C4+B$12","v":0.007984031936127744},0.023949805642965713,2.998637564135751,5.0894024716253673E-7,3.0278763829626171E-4,1.2189020003425686E-8,1.240238487105521E-5,0.000907950386151119,8.7778324313301866E-6,null,"Tan to f'g'"]
[null,null,0.011976047904191616,0.035920414681431784,2.9973470257396686,1.7176733341735614E-6,5.8963908510324648E-4,6.1699538450751873E-8,3.33838447381834e-05,1.7673529579940752E-3,2.6328543508666122E-5,null,{"$f":"x0","v":1.1177644710578842},{"$f":"LOOKUP(x0,C3:C503,J3:J503)","v":-10.968160864061703}]
[null,null,0.015968063872255488,0.047885871870013294,2.9956265958162978,4.0715219773002938E-6,9.7210768084589317E-4,1.9496837972094505E-7,7.037201978761432E-5,2.912071622739259E-3,5.8746983369493538E-5,null,{"$f":"M6+40*dx","v":1.2774451097804391},{"$f":"N6+40*dx*LOOKUP(x0,C3:C503,J3:J503)","v":-12.719563796446806}]
[null,null,0.01996007984031936,0.05984446107486877,2.9934765211165852,7.9521913619146374E-6,1.4501934255242023E-3,4.7589460641800821E-7,1.2792056237918652E-4,0.004341119970384333,1.1059074213813131E-4]
[null,null,0.023952095808383235,0.07179446714719047,2.990897110012865,1.3741386673388498E-5,2.0238963191381723E-3,9.8655553407943143E-7,2.1056836462391386E-4,6.0532656518760344E-3,1.8640363148269217E-4]
[null,null,0.02794411177644711,0.08373417616919791,2.9878887324546204,2.1820813097093776E-5,2.6932163616878034E-3,1.8271478080271913E-6,3.2283629041066807E-4,8.047030821149416E-3,2.9071241487713746E-4,null,"Tangent to f'g+fg'"]
[null,null,0.03193612774451098,0.09566187569995488,2.9844518199154253,3.2572175818402371E-5,3.458153553173097E-3,3.1159154344170837E-6,4.6922391467625331E-4,0.010320692665314444,4.2802354475483828E-4,null,{"$f":"x0","v":1.1177644710578842},{"$f":"LOOKUP(x0,C3:C503,K3:K503)","v":-4.798438461636545}]
["delta x = ",{"$f":"(Sheet1!D17-Sheet1!D16)/501","v":0.003992015968063872},0.035928143712574856,0.10757585502097454,2.980586865331055,4.6377180022686191E-5,0.004318707893594053,4.9890647944021266E-6,0.000654206271230587,0.012872284022847982,6.0281990786592446E-4,null,{"$f":"M11+40*dx","v":1.2774451097804391},{"$f":"N11+40*dx*LOOKUP(x0,C3:C503,I3:I503)","v":-5.571647808534137}]
[null,null,0.03992015968063873,0.11947440538157755,2.9762944230287856,6.361753089531714E-5,0.005274879382950669,7.600666675562154E-6,8.8223061044607446E-4,0.0156995940896256,8.1955758014816773E-4]
[null,null,0.0439121756487026,0.1313558202439679,2.9715751086478974,8.4674933621667114E-5,0.006326668021242949,1.1122545359977621E-5,1.1577131681172266E-3,0.018800169212604193,1.0826625924182079E-3]
[null,null,0.04790419161676648,0.14321839552799145,2.9664295990514042,1.0993109338710803E-4,0.007474073808470892,1.5744154813539403E-5,1.4850359467931454E-3,0.02217131377094291,0.001396527708186587]
[null,null,0.05189620758483035,0.15506042985554197,2.9608586322288892,1.3976771537701178E-4,0.008717096744634488,2.1672442026286489E-5,1.8685435108816365E-3,0.025810091144325375,0.001765509214896305]
[null,null,0.055888223552894224,0.16688022479457945,2.954863007190768,1.7456650477675026E-4,0.010055736829733753,2.9131697558748112E-5,2.3125397968195354E-3,0.029713324768226038,2.1939237298805106E-3]
[null,null,0.0598802395209581,0.17867608510272623,2.9484435838536114,2.1470916677169538E-4,0.01148999406376866,3.8363393354434879E-5,0.00282128493959911,0.03387759927583479,0.002686045022330309]
[null,null,0.06387225548902196,0.19044631897040531,2.941601282916866,2.6057740654721897E-4,0.013019868446739245,4.9626007883772644E-5,0.003398992116935461,0.038299261726336985,0.003246100852558867]
[null,null,0.06786427145708583,0.20218923826348661,2.934337085730743,0.000312552929288693,0.014645359978645479,6.3194838689902227E-5,0.004049824412354315,0.042974422919216236,3.8782698298424722E-3]
[null,null,0.0718562874251497,0.21390315876540575,2.926652034155553,3.7101744018148931E-4,0.016366468659487383,7.9361802411875539E-5,0.004777891698473914,0.04789895879423185,0.004586678290113709]
[null,null,0.07584830339321356,0.22558640041872133,2.9185472304121745,4.3635264441097986E-4,0.018183194489264958,9.8435222365863219E-5,0.005587247541748323,0.05306851191669016,0.005375397194775506]
[null,null,0.07984031936127743,0.23723728756607532,2.910023836924071,5.0894024716253657E-4,0.020095537467978177,1.2073960377004814E-4,0.006481886129932991,0.05847849304761729,0.006248439051898589]
[null,null,0.0838323353293413,0.2488541491905227,2.901083076150513,5.8916195362153129E-4,0.022103497595627068,1.4661539670391237E-4,0.007465739223526428,0.06412408279840724,7.209754861057736E-3]
[null,null,0.08782435129740516,0.2604353191551954,2.8917262304112277,6.7739946897333594E-4,0.024207074872211624,1.7641874689763065E-4,0.00854267313243423,0.07000023336950287,0.008263231083054979]
[null,null,0.09181636726546903,0.2719791364422662,2.881954641702591,7.7403449840332246E-4,0.02640626929773183,2.1052123445225831E-4,0.009716485719094364,0.07610167037264685,0.00941268663577042]
[null,null,0.0958083832335329,0.2834839453911787,2.8717697115049923,8.7944874709686269E-4,0.028701080872187673,2.4930960059634758E-4,0.010990903429293814,0.08242289473620384,0.010661869917372838]
[null,null,0.09980039920159677,0.2949480959361088,2.861172900581956,9.9402392023932844E-4,0.031091509595579245,2.9318546258953645E-4,0.012369578351899009,0.08895818469305519,0.012014455858114361]
[null,null,0.10379241516966063,0.3063699438426236,2.850165728770605,1.1181417230160919E-3,0.03357755546790646,3.4256501688853449E-4,0.013856085308712567,0.09570159785052101,0.01347404300192406]
[null,null,0.1077844311377245,0.3177478509435043,2.8387497747636505,1.2521838606125248E-3,0.03615921848916929,3.9787873069577028E-4,0.01545391897566038,0.10264697334175894,0.015044150619006649]
[null,null,0.11177644710578837,0.3290801853736985,2.8269266758829676,1.396532038213999E-3,0.038836498659367794,4.5957102201577178E-4,0.017166491036503022,0.10978793405805992,0.016728215850642512]
[null,null,0.11576846307385223,0.340365321804369,2.8146981278448133,1.5515679610058864E-3,0.04160939597850196,5.2809992834911717E-4,0.01899712737025552,0.11711788896144297,0.018529590887375498]
[null,null,0.1197604790419161,0.351601641676005,2.8020658845165785,0.001717673334173559,0.0444779104465718,6.0393676415852044E-4,0.02094906527348879,0.12463003547692238,0.020451540181764552]
[null,null,0.12375249500997997,0.3627875334305622,2.7890317576652346,1.8952298629023884E-3,0.047442042063577425,0.0006875657672463,0.02302545071867612,0.13231736196380733,0.022497237696864524]
[null,null,0.12774451097804385,0.37392139274259906,2.775597616697498,2.0846192523777474E-3,0.05050179082951855,7.7948373418712286E-4,0.025229335649735587,0.14017265026536724,0.02466976419159039]
[null,null,0.1317365269461077,0.3850016227493755,2.7617653883917397,0.002286223207785007,0.05365715674439529,8.8019964496451042E-4,0.02756367531590949,0.14818847833618132,0.026972104544108352]
[null,null,0.13572854291417158,0.39602663427988144,2.7475370566216184,0.002500423434309539,0.05690813980820776,0.000990234276964149,0.030031325645108346,0.1563572229464547,0.029407145114384005]
[null,null,0.13972055888223545,0.40699484608276215,2.732914662071486,0.002727601637136716,0.060254740020956064,1.1101198084815477E-3,0.03263504065783565,0.1646710624625764,0.03197767114700698]
[null,null,0.1437125748502993,0.4179046850531074,2.7179003019438164,2.9681395214519097E-3,0.06369695738263965,1.2403994119060413E-3,0.03537746992279666,0.17312197970317872,0.03468636421539875]
[null,null,0.14770459081836318,0.42875458645807274,2.70249612965833,0.003222418792440491,0.06723479189325919,0.001381626836747545,0.03826115605528372,0.1817017648699162,0.03753579970849762]
[null,null,0.15169660678642705,0.4395429941612996,2.686704354543167,3.4908211552878332E-3,0.07086824355281435,1.5343659826768212E-3,0.04128853225941135,0.19040201855217204,0.04052844436099946]
[null,null,0.1556886227544909,0.45026836084610267,2.6705272415180215,3.7737283151793076E-3,0.07459731236130522,1.6991904627543116E-3,0.044461919915269335,0.19921415480489463,0.043666653828223864]
[null,null,0.15968063872255478,0.46092914823739217,2.6539671107693064,4.0715219773002865E-3,0.0784219983187316,1.8766831570268439E-3,0.047783526212040586,0.2081294042987195,0.046952670306656535]
[null,null,0.16367265469061865,0.4715238273222996,2.6370263374173963,0.004384583846836141,0.0823423014250936,2.0674357566757085E-3,0.05125544182812068,0.21713881754153386,0.050388620201208364]
[null,null,0.1676646706586825,0.4820508785694748,2.6197073511758564,0.004713295628972243,0.08635822168039144,0.002272048298903735,0.05487963865925811,0.22623326817059566,0.05397651184021378]
[null,null,0.17165668662674638,0.49250879214702314,2.602012636003192,0.005058039028893966,0.09046975908462489,0.002491128692753069,0.05865796759572451,0.23540345631435855,0.05771823323918019]
[null,null,0.17564870259481025,0.5028960681390519,2.583944729746368,0.00541919575178668,0.09467691363779394,2.7252922360493743E-3,0.0625921563495019,0.2446399120230297,0.06161554991428025]
[null,null,0.1796407185628741,0.5132112167607938,2.565506223776926,0.005797147502835757,0.09897968533989907,2.9751611236721364E-3,0.06668380733246439,0.2539329987669928,0.06567010274656811]
[null,null,0.18363273453093798,0.5234527585722786,2.546699762619318,0.006192275987226572,0.10337807419093892,0.003241363947354629,0.07093439558651099,0.2632729170021064,0.06988340589787986]
[null,null,0.18762475049900185,0.5336192246905194,2.5275280435716487,0.006604962910144492,0.10787208019091549,3.5245351872209402E-3,0.07534526676660003,0.2726497078009486,0.07425684477937067]
[null,null,0.1916167664670657,0.5437091570001866,2.50799381631868,0.007035589976774893,0.1124617033398268,3.8253146952712397E-3,0.07991763517759524,0.28205325654895147,0.07879167407360742]
[null,null,0.19560878243512958,0.5537211083627362,2.488099882537557,7.4845388923031435E-3,0.11714694363767417,0.004144347171030103,0.0846525818658559,0.29147329670453087,0.08348901581114716]
[null,null,0.19960079840319345,0.563653642823964,2.46784909549613,0.007952191361914617,0.12192780108445801,0.004482281629576434,0.08955105276644404,0.30089941362211176,0.08834985750248356]
[null,null,0.2035928143712573,0.5735053358199566,2.44724435964341,8.438929090794689E-3,0.12680427568017597,0.004839770862177009,0.09461385690683037,0.31032104843697866,0.09337505032624366]
[null,null,0.20758483033932118,0.5832747743814073,2.426288630193181,0.008945133784128725,0.1317763674248306,0.005217470889749186,0.09984166466796512,0.31972750201102557,0.09856530737450793]
[null,null,0.21157684630738505,0.5929605573362703,2.4049849127002414,0.0094711871471021,0.13684407631842063,0.005616040409381781,0.10523500610353678,0.329107938938202,0.1039212019560788]
[null,null,0.2155688622754489,0.6025612955107224,2.3833362626291104,0.010017470884900187,0.14200740236094608,0.006036140234146399,0.11079426931825304,0.33845139160860555,0.10944316595853801]
[null,null,0.21956087824351278,0.6120756119284034,2.361345784916031,0.010584366702708355,0.14726634555240822,0.006478432726434834,0.1165196989059445,0.3477467643301668,0.11513148826989593]
[null,null,0.22355289421157665,0.6215021420079085,2.339016633523437,0.01117225630571198,0.15262090589280447,0.006943581225061359,0.12241139444826409,0.35698283750668475,0.12098631326061282]
[null,null,0.2275449101796405,0.6308395337585011,2.316352010987743,0.01178152139909643,0.1580710833821374,0.007432249466371795,0.12846930907476967,0.3661482718712252,0.12700763932678086]
[null,null,0.23153692614770438,0.640086447974021,2.293355167960019,0.012412543688047077,0.16361687802040575,7.945100999604408E-3,0.13469324808510721,0.3752316127735815,0.13319531749519248]
[null,null,0.23552894211576825,0.6492415584249592,2.270029402739624,0.013065704877749296,0.16925828980760993,0.008482798596750545,0.14108286763404226,0.384221294520699,0.13954905009104548]
[null,null,0.23952095808383211,0.6583035520486703,2.246378060801392,0.013741386673388457,0.17499531874374952,0.009046003657165883,0.14763767348004134,0.3931056447689055,0.146068389468988]
[null,null,0.24351297405189598,0.6672711291376978,2.222404534315582,0.014439970780149932,0.1808279648288245,0.009635375607186008,0.15435701979807842,0.40187288896663814,0.15275273680819135]
[null,null,0.24750499001995985,0.6761430035261832,2.198112261661437,0.015161838903219092,0.18675622806283615,0.010251571295002688,0.16124010805734393,0.4105111548465599,0.15960134097212816]
[null,null,0.2514970059880237,0.6849179027743326,2.173504726934147,0.015907372747781312,0.19278010844578192,0.01089524438105995,0.16828598596450076,0.41900847696578447,0.16661329743369946]
[null,null,0.2554890219560876,{"$f":"SIN(3*x)","v":0.693594568350916},{"$f":"(D68-D67)/dx","v":2.148585459444974},{"$f":"x^3","v":0.01667695401902196},{"$f":"(F68-F67)/dx","v":0.19889960597766485},0.011567044724231609,{"$f":"(H68-H67)/dx","v":0.1754935464731073},0.4273528012929453,0.17378754726634874]
[null,null,0.25948103792415145,0.7021717558137702,2.123358033215172,0.01747096442212641,0.20511472065848357,{"$f":"D68*F68","v":0.012267617764044413},0.1828615268598044,{"$f":"E68*G68","v":0.4355319898408771},{"$f":"D68*G68+F68*E68","v":0.181122876201757}]
[null,null,{"$f":"C68+B$12","v":0.2634730538922153},0.7106482349882819,2.097826066463348,0.018289785662280036,0.21142545248823555,0.012997603899213292,0.19038850786787023,0.4435338253436287,0.18861791375472212]
[null,null,0.2674650698602792,0.7190227901438242,2.0719932210865597,0.0191337994446682,0.21783180146692596,0.013757637862757684,0.1980729129186875,0.4513460159765439,0.19627113241578698]
[null,null,0.27145708582834305,0.7272942201681218,2.0458632021349663,0.02000338747447629,0.22433376759455045,0.01454834809397001,0.20591300739164656,0.4589562001179883,0.2040808469121338]
[null,null,0.2754491017964069,0.7354613387395189,2.019439757280801,0.020898931456889664,0.23093135087111166,0.015370356107509517,0.21390689797305776,0.4663519511516852,0.2120452135373227]
[null,null,0.2794411177644708,0.7435229744971269,1.992726676280314,0.021820813097093703,0.23762455129660695,0.016224275859896973,0.22205253207448708,0.4735207823078885,0.2201622295503038]
[null,null,0.28343313373253465,0.7514779712088248,1.9657277904307844,0.02276941410027377,0.24441336887103984,0.01711071311368734,0.23034769732107468,0.4804501515426134,0.22842973264425784]
[null,null,0.2874251497005985,0.7593251879370914,1.938446972020587,0.023745116171615246,0.2512978035944077,0.018030264799599814,0.23879002111020942,0.48712746645300375,0.23684540048564653]
[null,null,0.2914171656686624,0.7670634992026426,1.9108881337741095,0.0247483010163035,0.25827785546671045,0.01898351837688608,0.24737697024105082,0.4935400892279615,0.2454067503239734]
[null,null,0.29540918163672625,0.7746917951458526,1.883055228290441,0.0257793503395239,0.26535352448794997,0.019971051192219615,0.2561058506152645,0.49967534163232974,0.25411113867262036]
[null,null,0.2994011976047901,0.7822089816859342,1.8549522474764435,0.026838645846461825,0.27252481065812273,0.02099342983739033,0.2649738070093578,0.505520510023377,0.2629557610611609]
[null,null,0.303393213572854,0.7896139806778562,1.826583221974289,0.027926569242302635,0.27979171397723474,0.022051209506090363,0.27397782291901196,0.5110628503982462,0.2719376518595377]
[null,null,0.30738522954091785,0.7969057300669751,1.7979522205833496,0.029043502232231715,0.28715423444528,0.023144933350078434,0.28311472047567887,0.5162895934708029,0.2810536841743977]
{"$rows_left_out":425}
{"sheet":"Sheet3","index":2,"n_rows":0,"n_cols":0,"rows_kept":0}