{"text_format":"3","workbook":"xlsx","n_sheets":3,"sheets":["Sheet1","Sheet2","Sheet3"],"not_rendered":{"charts":4,"images":3,"macros":1,"defined_names":7,"comments":1},"read":"whole","date_system":"1900"}

{"sheet":"Sheet1","index":0,"n_rows":37,"n_cols":13,"rows_kept":37,"merged":[[30,2,30,3]]}
[null,"     Visualizing the Quotient Rule"]
[]
[null,"    This DIGMath program helps you visualize "]
[null,"      the Quotient Rule for finding the derivative"]
[null,"     of the quotient f(x)/g(x) of two functions:  "]
[null,null,"       y = f(x)    and    y = g(x)"]
[null,"          on any interval from x = a  to x = b."]
[]
[]
["Enter the first function in terms of x:   y = f(x) =  ",{"$nulls":4},"sin(3*x)"]
[]
["Enter the second function in terms of x:  y = g(x) = ",{"$nulls":4},"x^3"]
[]
[{"$nulls":8},"Now trace along the various curves:"]
["Now enter the interval for x :  ",{"$nulls":7},"x  = ",{"$f":"D16+K15*Sheet2!B12","v":1.3317365269461077},315]
[null,"   Starting value a =",null,0.2,{"$nulls":4},"f(x) =",{"$f":"LOOKUP(J15,Sheet2!C3:C504,Sheet2!D3:D504)","v":-0.7465347002785719},null,"        slope of  f(x) =",{"$f":"LOOKUP(x0,Sheet2!C3:C504,Sheet2!E3:E504)","v":-1.9839311924992915}]
[null,"    Ending value b =",null,2,{"$nulls":4},"g(x) =",{"$f":"LOOKUP(J15,Sheet2!C$3:C$504,Sheet2!F$3:F$504)","v":2.3427999818785756},null,"        slope of g(x) =",{"$f":"LOOKUP(x0,Sheet2!C3:C504,Sheet2!G3:G504)","v":5.306225393524542}]
[{"$nulls":8},"f(x)/g(x) =",{"$f":"LOOKUP(x0,Sheet2!C$3:C$504,Sheet2!H$3:H$504)","v":-0.31865063430637497},null,"slope of quotient f/g is",{"$f":"LOOKUP(x0,Sheet2!C3:C504,Sheet2!I3:I504)","v":{"v":-0.12409650692338754,"d":"-0.12"}}]
[]
[{"$nulls":8},"f'(x)/g'(x) =",{"$f":"LOOKUP(x0,Sheet2!C$3:C$504,Sheet2!J$3:J$504)","v":{"v":-0.3738874709167809,"d":"-0.37"}},null,"[f '(x)g(x) - f(x)g'(x)]/g2(x) =",{"$f":"LOOKUP(x0,Sheet2!C$3:C$504,Sheet2!K$3:K$504)","v":0.12510632890012235}]
[]
["Click each item below for suggestions and investigations"]
[null,null,"   Item 1"]
[null,null,"   Item 2"]
[null,null,"   Item 3"]
[null,null,"   Item 4"]
[]
[]
[]
["To access/download all the DIGMath Apps for Calculus"]
["     Click this link:",null,"DIGMath for Calculus"]
[]
["Created by:  Sheldon P. Gordon   "]
["                      Farmingdale State College    "]
["Development of this module was supported by the "]
["NSF's Division of Undergraduate Education  "]
["under grants DUE-0310123 and DUE-0442160."]

{"sheet":"Sheet2","index":1,"n_rows":504,"n_cols":20,"rows_kept":504}
[null,null,"x","y = f(x)","f'(x)","y = g(x)","g'(x)","f/g","slope of f /g","f' / g'","(fg' - f'g)/g^2",null,"Tracing points",{"$nulls":5},"Quotient"]
[{"$nulls":12},{"$f":"x0","v":1.3317365269461077},{"$f":"Sheet1!J16","v":-0.7465347002785719},null,{"$f":"x0","v":1.3317365269461077},{"$f":"Sheet1!J17","v":2.3427999818785756},null,{"$f":"x0","v":1.3317365269461077},{"$f":"Sheet1!J18","v":-0.31865063430637497}]
[null,null,{"$f":"a","v":{"v":0.2,"d":"0.2000"}},{"$f":"SIN(3*x)","v":{"v":0.5646424733950355,"d":"0.5646"}},{"$f":"(D4-D3)/dx","v":{"v":2.4668300416031856,"d":"2.4668"}},{"$f":"x^3","v":{"v":0.008000000000000002,"d":"0.0080"}},{"$f":"(F4-F3)/dx","v":{"v":0.12216859693786085,"d":"0.1222"}},{"$f":"IF(F3=0,\"\",D3/F3)","v":{"v":70.58030917437942,"d":"70.5803"}},{"$f":"(H4-H3)/dx","v":{"v":-729.460721311913,"d":"-729.4607"}},{"$f":"IF(G3=0,\"\",E3/G3)","v":{"v":20.192014179043902,"d":"20.1920"}},{"$f":"IF(F3=0,\"\",(D3*G3-F3*E3)/F3^2)","v":{"v":769.4834127088969,"d":"769.4834"}},null,{"$f":"M2+40*dx","v":1.475449101796407},{"$f":"N2+40*dx*LOOKUP(x0,C3:C504,E3:E504)","v":-1.0316505602784702},null,{"$f":"P2+40*dx","v":1.475449101796407},{"$f":"Q2+40*dx*LOOKUP(x0,C3:C504,G3:G504)","v":3.105371295918031},null,{"$f":"S2+40*dx","v":1.475449101796407},{"$f":"T2+40*dx*LOOKUP(x0,C3:C504,I3:I504)","v":-0.336484862846263}]
[null,null,{"$f":"C3+B$12","v":{"v":0.2035928143712575,"d":"0.2036"}},{"v":0.5735053358199571,"d":"0.5735"},{"v":2.4482857372233013,"d":"2.4483"},{"v":0.008438929090794712,"d":"0.0084"},{"v":0.12655742407400858,"d":"0.1266"},{"$f":"IF(F4=0,\"\",D4/F4)","v":{"v":67.95949221158213,"d":"67.9595"}},{"v":-691.7867072403008,"d":"-691.7867"},{"$f":"IF(G4=0,\"\",E4/G4)","v":{"v":19.345255761460397,"d":"19.3453"}},{"$f":"IF(F4=0,\"\",(D4*G4-F4*E4)/F4^2)","v":{"v":729.0608171081088,"d":"729.0608"}}]
[null,null,{"$f":"C4+B$12","v":{"v":0.207185628742515,"d":"0.2072"}},{"v":0.5823015720015977,"d":"0.5823"},{"v":2.4294570064031173,"d":"2.4295"},{"v":0.008893626422797138,"d":"0.0089"},{"v":0.13102370110079245,"d":"0.1310"},{"$f":"IF(F5=0,\"\",D5/F5)","v":{"v":65.47403098796428,"d":"65.4740"}},{"v":-656.6584500074223,"d":"-656.6585"},{"v":18.54211860901572,"d":"18.5421"},{"v":691.4156911139913,"d":"691.4157"},null,"Tan to f'/g'"]
[null,null,{"v":0.2107784431137725,"d":"0.2108"},{"v":0.591030160048555,"d":"0.5910"},{"v":2.410346036546163,"d":"2.4103"},{"v":0.00936437025908741,"d":"0.0094"},{"v":0.13556742801821542,"d":"0.1356"},{"v":63.11477907176995,"d":"63.1148"},{"v":-623.864424048067,"d":"-623.8644"},{"v":17.77968404196839,"d":"17.7797"},{"v":656.3134585785297,"d":"656.3135"},null,{"$f":"x0","v":1.3317365269461077},{"$f":"LOOKUP(x0,C3:C503,J3:J503)","v":-0.3738874709167809}]
[null,null,{"v":0.21437125748503,"d":"0.2144"},{"v":0.5996900859283616,"d":"0.5997"},{"v":2.3909550478448063,"d":"2.3910"},{"v":0.009851438862745669,"d":"0.0099"},{"v":0.1401886048262765,"d":"0.1402"},{"v":60.87335000333378,"d":"60.8734"},{"v":-593.2138495375389,"d":"-593.2138"},{"v":17.055273863433538,"d":"17.0553"},{"v":623.5429205629896,"d":"623.5429"},null,{"$f":"M6+40*dx","v":1.475449101796407},{"$f":"N6+40*dx*LOOKUP(x0,C3:C503,J3:J503)","v":-0.42761980206649786}]
[null,null,{"v":0.2179640718562875,"d":"0.2180"},{"v":0.608280343585289,"d":"0.6083"},{"v":2.371286293022105,"d":"2.3713"},{"v":0.010355110496852052,"d":"0.0104"},{"v":0.14488723152497426,"d":"0.1449"},{"v":58.74204275948634,"d":"58.7420"},{"v":-564.534356837298,"d":"-564.5344"},{"v":16.366426965742427,"d":"16.3664"},{"v":592.9135819833108,"d":"592.9136"}]
[null,null,{"v":0.221556886227545,"d":"0.2216"},{"v":0.6167999350572247,"d":"0.6168"},{"v":2.3513420570702905,"d":"2.3513"},{"v":0.01087566342448669,"d":"0.0109"},{"v":0.14966330811431108,"d":"0.1497"},{"v":56.71377560917269,"d":"56.7138"},{"v":-537.6699466769968,"d":"-537.6699"},{"v":15.710878549299224,"d":"15.7109"},{"v":564.2533220028238,"d":"564.2533"}]
[null,null,{"v":0.2251497005988025,"d":"0.2251"},{"v":0.625247870591609,"d":"0.6252"},{"v":2.3311246569853257,"d":"2.3311"},{"v":0.011413375908729723,"d":"0.0114"},{"v":0.15451683459428503,"d":"0.1545"},{"v":54.78202729775833,"d":"54.7820"},{"v":-512.4792046019292,"d":"-512.4792"},{"v":15.086541625746873,"d":"15.0865"},{"v":537.4063592377255,"d":"537.4064"},null,"Tangent to (f'g-fg')/g^2"]
[null,null,{"v":0.22874251497005998,"d":"0.2287"},{"v":0.6336231687604186,"d":"0.6336"},{"v":2.31063644149757,"d":"2.3106"},{"v":0.011968526212661286,"d":"0.0120"},{"v":0.1594478109648976,"d":"0.1594"},{"v":52.94078464649392,"d":"52.9408"},{"v":-488.83373457761616,"d":"-488.8337"},{"v":14.491490522916344,"d":"14.4915"},{"v":512.2314704599498,"d":"512.2315"},null,{"$f":"x0","v":1.3317365269461077},{"$f":"LOOKUP(x0,C3:C503,K3:K503)","v":0.12510632890012235}]
["delta x = ",{"$f":"(Sheet1!D17-Sheet1!D16)/501","v":3.592814371257485E-3},{"v":0.23233532934131748,"d":"0.2323"},{"v":0.6419248565741823,"d":"0.6419"},{"v":2.2898797907990773,"d":"2.2899"},{"v":0.012541392599361517,"d":"0.0125"},{"v":0.1644562372261473,"d":"0.1645"},{"v":51.18449577974799,"d":"51.1845"},{"v":-466.6167819475349,"d":"-466.6168"},{"v":13.92394614775367,"d":"13.9239"},{"v":488.6004278159554,"d":"488.6004"},null,{"$f":"M11+40*dx","v":1.475449101796407},{"$f":"N11+40*dx*LOOKUP(x0,C3:C503,I3:I503)","v":0.10727210036023432}]
[null,null,{"v":0.23592814371257498,"d":"0.2359"},{"v":0.6501519695950173,"d":"0.6502"},{"v":2.2688571162669975,"d":"2.2689"},{"v":0.01313225333191055,"d":"0.0131"},{"v":0.1695421133780351,"d":"0.1695"},{"v":49.50802829969697,"d":"49.5080"},{"v":-445.7220203769177,"d":"-445.7220"},{"v":13.382262796312043,"d":"13.3823"},{"v":466.39662486256066,"d":"466.3966"}]
[null,null,{"v":0.23952095808383247,"d":"0.2395"},{"v":0.6583035520486712,"d":"0.6583"},{"v":2.247570860183365,"d":"2.2476"},{"v":0.01374138667338852,"d":"0.0137"},{"v":0.17470543942056105,"d":"0.1747"},{"v":47.906631819300856,"d":"47.9066"},{"v":-426.0524811355985,"d":"-426.0525"},{"v":12.864916327950628,"d":"12.8649"},{"v":445.5138661385904,"d":"445.5139"}]
[null,null,{"v":0.24311377245508997,"d":"0.2431"},{"v":0.6663786569355575,"d":"0.6664"},{"v":2.2260234954517055,"d":"2.2260"},{"v":0.014369070886875565,"d":"0.0144"},{"v":0.1799462153537241,"d":"0.1799"},{"v":46.37590434216697,"d":"46.3759"},{"v":-407.51960620221865,"d":"-407.5196"},{"v":12.370493544840405,"d":"12.3705"},{"v":425.8552986969178,"d":"425.8553"}]
[null,null,{"v":0.24670658682634747,"d":"0.2467"},{"v":0.6743763461407732,"d":"0.6744"},{"v":2.2042175253092497,"d":"2.2042"},{"v":0.01501558423545182,"d":"0.0150"},{"v":0.18526444117752675,"d":"0.1853"},{"v":44.91176204443445,"d":"44.9118"},{"v":-390.0424093106824,"d":"-390.0424"},{"v":11.897682638391966,"d":"11.8977"},{"v":407.33246713839327,"d":"407.3325"}]
[null,null,{"v":0.25029940119760496,"d":"0.2503"},{"v":0.6822956905430819,"d":"0.6823"},{"v":2.182155483036403,"d":"2.1822"},{"v":0.015681204982197425,"d":"0.0157"},{"v":0.19066011689196313,"d":"0.1907"},{"v":43.51041207086313,"d":"43.5104"},{"v":-373.54673129026133,"d":"-373.5467"},{"v":11.445264581857534,"d":"11.4453"},{"v":389.86447631750474,"d":"389.8645"}]
[null,null,{"v":0.25389221556886243,"d":"0.2539"},{"v":0.6901357701228534,"d":"0.6901"},{"v":2.1598399316626584,"d":"2.1598"},{"v":0.016366211390192502,"d":"0.0164"},{"v":0.1961332424970415,"d":"0.1961"},{"v":42.168328006347224,"d":"42.1683"},{"v":-357.9645779421378,"d":"-357.9646"},{"v":11.01210536350174,"d":"11.0121"},{"v":373.37724811271386,"d":"373.3772"}]
[null,null,{"v":0.2574850299401199,"d":"0.2575"},{"v":0.6978956740689468,"d":"0.6979"},{"v":2.1372734636683353,"d":"2.1373"},{"v":0.017070881722517202,"d":"0.0171"},{"v":0.20168381799275606,"d":"0.2017"},{"v":40.88222772631559,"d":"40.8822"},{"v":-343.2335303012886,"d":"-343.2335"},{"v":10.597148967822001,"d":"10.5971"},{"v":357.80286053810477,"d":"357.8029"}]
[null,null,{"v":0.26107784431137737,"d":"0.2611"},{"v":0.7055745008845217,"d":"0.7056"},{"v":2.114458700683822,"d":"2.1145"},{"v":0.017795494242251655,"d":"0.0178"},{"v":0.2073118433791087,"d":"0.2073"},{"v":39.64905336595168,"d":"39.6491"},{"v":-329.2962185014724,"d":"-329.2962"},{"v":10.1994110236005,"d":"10.1994"},{"v":343.07895907451797,"d":"343.0790"}]
[null,null,{"v":0.26467065868263484,"d":"0.2647"},{"v":0.7131713584917689,"d":"0.7132"},{"v":2.0913982931847017,"d":"2.0914"},{"v":0.018540327212475997,"d":"0.0185"},{"v":0.2130173186561014,"d":"0.2130"},{"v":38.465953179718845,"d":"38.4660"},{"v":-316.0998516289474,"d":"-316.0999"},{"v":9.817973047351558,"d":"9.8180"},{"v":329.14823146183164,"d":"329.1482"}]
[null,null,{"v":0.2682634730538923,"d":"0.2683"},{"v":0.7206853643355463,"d":"0.7207"},{"v":2.0680949201842553,"d":"2.0681"},{"v":0.019305658896270374,"d":"0.0193"},{"v":0.21880024382372837,"d":"0.2188"},{"v":37.330265090034004,"d":"37.3303"},{"v":-303.59579695022927,"d":"-303.5958"},{"v":9.451977219231852,"d":"9.4520"},{"v":315.9579383585817,"d":"315.9579"}]
[null,null,{"v":0.2718562874251498,"d":"0.2719"},{"v":0.7281156454859089,"d":"0.7281"},{"v":2.0445512889216686,"d":"2.0446"},{"v":0.020091767556714907,"d":"0.0201"},{"v":0.22466061888199632,"d":"0.2247"},{"v":36.23950174769785,"d":"36.2395"},{"v":-291.7392027562877,"d":"-291.7392"},{"v":9.100621635853214,"d":"9.1006"},{"v":303.459493271592,"d":"303.4595"}]
[null,null,{"v":0.27544910179640725,"d":"0.2754"},{"v":0.7354613387395197,"d":"0.7355"},{"v":2.0207701345480134,"d":"2.0208"},{"v":0.020898931456889744,"d":"0.0209"},{"v":0.2305984438308995,"d":"0.2306"},{"v":35.19133694737586,"d":"35.1913"},{"v":-280.4886598018185,"d":"-280.4887"},{"v":8.763155990895877,"d":"8.7632"},{"v":291.60808601229195,"d":"291.6081"}]
[null,null,{"v":0.2790419161676647,"d":"0.2790"},{"v":0.7427215907199317,"d":"0.7427"},{"v":1.9967542198083061,"d":"1.9968"},{"v":0.02172742885987501,"d":"0.0217"},{"v":0.2366137186704427,"d":"0.2366"},{"v":34.183593259465134,"d":"34.1836"},{"v":-269.805896952735,"d":"-269.8059"},{"v":8.438877640012919,"d":"8.4389"},{"v":280.3623446712167,"d":"280.3623"}]
[null,null,{"v":0.2826347305389222,"d":"0.2826"},{"v":0.749895557976728,"d":"0.7499"},{"v":1.9725063347203815,"d":"1.9725"},{"v":0.022577538028750854,"d":"0.0226"},{"v":0.24270644340062308,"d":"0.2427"},{"v":33.21423075544333,"d":"33.2142"},{"v":-259.6555072018517,"d":"-259.6555"},{"v":8.127128011449066,"d":"8.1271"},{"v":269.6840317339833,"d":"269.6840"}]
[null,null,{"v":0.28622754491017965,"d":"0.2862"},{"v":0.7569824070835078,"d":"0.7570"},{"v":1.9480292962511405,"d":"1.9480"},{"v":0.023449537226597403,"d":"0.0234"},{"v":0.24887661802144057,"d":"0.2489"},{"v":32.28133671759237,"d":"32.2813"},{"v":-250.00470068595675,"d":"-250.0047"},{"v":7.827289328093164,"d":"7.8273"},{"v":259.5377705079641,"d":"259.5378"}]
[null,null,{"v":0.2898203592814371,"d":"0.2898"},{"v":0.7639813147347095,"d":"0.7640"},{"v":1.923325947988906,"d":"1.9233"},{"v":0.024343704716494795,"d":"0.0243"},{"v":0.25512424253289717,"d":"0.2551"},{"v":31.383116236085936,"d":"31.3831"},{"v":-240.8230817471116,"d":"-240.8231"},{"v":7.538781610457506,"d":"7.5388"},{"v":249.89079850046355,"d":"249.8908"}]
[null,null,{"v":0.2934131736526946,"d":"0.2934"},{"v":0.7708914678412565,"d":"0.7709"},{"v":1.8983991598133971,"d":"1.8984"},{"v":0.025260318761523168,"d":"0.0253"},{"v":0.2614493169349909,"d":"0.2614"},{"v":30.517883607054397,"d":"30.5179"},{"v":-232.08244743647148,"d":"-232.0824"},{"v":7.261059933407407,"d":"7.2611"},{"v":240.71274479775744,"d":"240.7127"}]
[null,null,{"v":0.29700598802395206,"d":"0.2970"},{"v":0.7777120636250172,"d":"0.7777"},{"v":1.8732518275620265,"d":"1.8733"},{"v":0.026199657624762656,"d":"0.0262"},{"v":0.2678518412277237,"d":"0.2679"},{"v":29.684054454588033,"d":"29.6841"},{"v":-223.7566051681336,"d":"-223.7566"},{"v":6.993611912375899,"d":"6.9936"},{"v":231.97542884908023,"d":"231.9754"}]
[null,null,{"v":0.30059880239520953,"d":"0.3006"},{"v":0.7844423097120664,"d":"0.7844"},{"v":1.8478868726937887,"d":"1.8479"},{"v":0.0271619995692934,"d":"0.0272"},{"v":0.2743318154110927,"d":"0.2743"},{"v":28.880138507876175,"d":"28.8801"},{"v":-215.8212074994789,"d":"-215.8212"},{"v":6.735955397388694,"d":"6.7360"},{"v":223.65267836773336,"d":"223.6527"}]
[null,null,{"v":0.304191616766467,"d":"0.3042"},{"v":0.7910814242247387,"d":"0.7911"},{"v":1.8223072419495947,"d":"1.8223"},{"v":0.02814762285819553,"d":"0.0281"},{"v":0.2808892394850988,"d":"0.2809"},{"v":28.104732971949904,"d":"28.1047"},{"v":-208.25360224947877,"d":"-208.2536"},{"v":6.487636355490465,"d":"6.4876"},{"v":215.72016433015602,"d":"215.7202"}]
[null,null,{"v":0.30778443113772447,"d":"0.3078"},{"v":0.7976286358724618,"d":"0.7976"},{"v":1.7965159070100083,"d":"1.7965"},{"v":0.029156805754549178,"d":"0.0292"},{"v":0.28752411344974693,"d":"0.2875"},{"v":27.356516436921837,"d":"27.3565"},{"v":-201.0326963714192,"d":"-201.0327"},{"v":6.24822692418805,"d":"6.2482"},{"v":208.1552512878554,"d":"208.1553"}]
[null,null,{"v":0.31137724550898194,"d":"0.3114"},{"v":0.80408318404136,"d":"0.8041"},{"v":1.7705158641502665,"d":"1.7705"},{"v":0.030189826521434496,"d":"0.0302"},{"v":0.29423643730502924,"d":"0.2942"},{"v":26.63424327630596,"d":"26.6342"},{"v":-194.13883217617405,"d":"-194.1388"},{"v":6.017323620306097,"d":"6.0173"},{"v":200.93686141185498,"d":"200.9369"}]
[null,null,{"v":0.3149700598802394,"d":"0.3150"},{"v":0.8104443188826185,"d":"0.8104"},{"v":1.7443101338917135,"d":"1.7443"},{"v":0.031246963421931607,"d":"0.0312"},{"v":0.3010262110509507,"d":"0.3010"},{"v":25.936738490044256,"d":"25.9367"},{"v":-187.5536746596346,"d":"-187.5537"},{"v":5.794545690230534,"d":"5.7945"},{"v":194.0453508685563,"d":"194.0454"}]
[null,null,{"v":0.3185628742514969,"d":"0.3186"},{"v":0.8167113013995947,"d":"0.8167"},{"v":1.717901760651381,"d":"1.7179"},{"v":0.03232849471912065,"d":"0.0323"},{"v":0.30789343468751024,"d":"0.3079"},{"v":25.26289295234497,"d":"25.2629"},{"v":-181.26010882593752,"d":"-181.2601"},{"v":5.579533588934522,"d":"5.5795"},{"v":187.46239728274773,"d":"187.4624"}]
[null,null,{"v":0.32215568862275434,"d":"0.3222"},{"v":0.8228834035336715,"d":"0.8229"},{"v":1.6912938123879528,"d":"1.6913"},{"v":0.033434698676081766,"d":"0.0334"},{"v":0.3148381082147059,"d":"0.3148"},{"v":24.611659028419446,"d":"24.6117"},{"v":-175.24214601991048,"d":"-175.2421"},{"v":5.371947576417795,"d":"5.3719"},{"v":181.17089718168455,"d":"181.1709"}]
[null,null,{"v":0.3257485029940118,"d":"0.3257"},{"v":0.8289599082488378,"d":"0.8290"},{"v":1.6644893802455363,"d":"1.6645"},{"v":0.03456585355589508,"d":"0.0346"},{"v":0.32186023163254074,"d":"0.3219"},{"v":23.98204652774911,"d":"23.9820"},{"v":-169.48483838902627,"d":"-169.4848"},{"v":5.171466421318678,"d":"5.1715"},{"v":175.15487243524498,"d":"175.1549"}]
[null,null,{"v":0.3293413173652693,"d":"0.3293"},{"v":0.8349401096149894,"d":"0.8349"},{"v":1.6374915781944661,"d":"1.6375"},{"v":0.035722237621640736,"d":"0.0357"},{"v":0.3289598049410146,"d":"0.3290"},{"v":23.373118964674763,"d":"23.3731"},{"v":-163.97420068963456,"d":"-163.9742"},{"v":4.977786202445258,"d":"4.9778"},{"v":169.399384814073,"d":"169.3994"}]
[null,null,{"v":0.33293413173652675,"d":"0.3329"},{"v":0.8408233128899396,"d":"0.8408"},{"v":1.6103035426696675,"d":"1.6103"},{"v":0.03690412913639887,"d":"0.0369"},{"v":0.33613682814012563,"d":"0.3361"},{"v":22.783990099921585,"d":"22.7840"},{"v":-158.69713873562733,"d":"-158.6971"},{"v":4.790619199864583,"d":"4.7906"},{"v":163.89045788181386,"d":"163.8905"}]
[null,null,{"v":0.3365269461077842,"d":"0.3365"},{"v":0.84660883460013,"d":"0.8466"},{"v":1.5829284322060229,"d":"1.5829"},{"v":0.03811180636324962,"d":"0.0381"},{"v":0.34339130122987377,"d":"0.3434"},{"v":22.21382073919478,"d":"22.2138"},{"v":-153.64138386140368,"d":"-153.6414"},{"v":4.609692867980879,"d":"4.6097"},{"v":158.61500552076666,"d":"158.6150"}]
[null,null,{"v":0.3401197604790417,"d":"0.3401"},{"v":0.8522960026200319,"d":"0.8523"},{"v":1.5553694270718201,"d":"1.5554"},{"v":0.03934554756527312,"d":"0.0393"},{"v":0.3507232242102591,"d":"0.3507"},{"v":21.66181576723764,"d":"21.6618"},{"v":-148.79543283631398,"d":"-148.7954"},{"v":4.434748883750492,"d":"4.4347"},{"v":153.56076646382928,"d":"153.5608"}]
[null,null,{"v":0.34371257485029916,"d":"0.3437"},{"v":0.8578841562502301,"d":"0.8579"},{"v":1.5276297288988978,"d":"1.5276"},{"v":0.0406056310055495,"d":"0.0406"},{"v":0.3581325970812854,"d":"0.3581"},{"v":21.127221397765855,"d":"21.1272"},{"v":-144.14849272572795,"d":"-144.1485"},{"v":4.265542263811779,"d":"4.2655"},{"v":148.71624427087443,"d":"148.7162"}]
[null,null,{"v":0.3473053892215566,"d":"0.3473"},{"v":0.8633726462941782,"d":"0.8634"},{"v":1.4997125603109638,"d":"1.4997"},{"v":0.04189233494715891,"d":"0.0419"},{"v":0.365619419842945,"d":"0.3656"},{"v":20.609322621505754,"d":"20.6093"},{"v":-139.6904302451964,"d":"-139.6904"},{"v":4.101840544890035,"d":"4.1018"},{"v":144.0706522454025,"d":"144.0707"}]
[null,null,{"v":0.3508982035928141,"d":"0.3509"},{"v":0.8687608351336188,"d":"0.8688"},{"v":1.471621164549136,"d":"1.4716"},{"v":0.04320593765318147,"d":"0.0432"},{"v":0.37318369249524563,"d":"0.3732"},{"v":20.10744083619367,"d":"20.1074"},{"v":-135.41172520003965,"d":"-135.4117"},{"v":3.9434230223441085,"d":"3.9434"},{"v":139.61386283876033,"d":"139.6139"}]
[null,null,{"v":0.35449101796407156,"d":"0.3545"},{"v":0.8740480968026576,"d":"0.8740"},{"v":1.4433588050950081,"d":"1.4434"},{"v":0.04454671738669732,"d":"0.0445"},{"v":0.3808254150381853,"d":"0.3808"},{"v":19.6209316438582,"d":"19.6209"},{"v":-131.3034276432537,"d":"-131.3034"},{"v":3.7900800421901537,"d":"3.7901"},{"v":135.33636113473742,"d":"135.3364"}]
[null,null,{"v":0.35808383233532903,"d":"0.3581"},{"v":0.879233817060484,"d":"0.8792"},{"v":1.4149287652918632,"d":"1.4149"},{"v":0.04591495241078661,"d":"0.0459"},{"v":0.3885445874717621,"d":"0.3885"},{"v":19.14918280202615,"d":"19.1492"},{"v":-127.35711842100083,"d":"-127.3571"},{"v":3.641612342353616,"d":"3.6416"},{"v":131.2292020480725,"d":"131.2292"}]
[null,null,{"v":0.3616766467065865,"d":"0.3617"},{"v":0.8843173934627302,"d":"0.8843"},{"v":1.3863343479629204,"d":"1.3863"},{"v":0.047310920988529466,"d":"0.0473"},{"v":0.39634120979597415,"d":"0.3963"},{"v":18.691612316681237,"d":"18.6916"},{"v":-123.56487280730822,"d":"-123.5649"},{"v":3.497830439273696,"d":"3.4978"},{"v":127.28397090658767,"d":"127.2840"}]
[null,null,{"v":0.36526946107784397,"d":"0.3653"},{"v":0.8892982354314592,"d":"0.8893"},{"v":1.3575788750277578,"d":"1.3576"},{"v":0.04873490138300602,"d":"0.0487"},{"v":0.4042152820108253,"d":"0.4042"},{"v":18.247666665876537,"d":"18.2477"},{"v":-119.91922695847441,"d":"-119.9192"},{"v":3.358554056329321,"d":"3.3586"},{"v":123.49274711896095,"d":"123.4927"}]
[null,null,{"v":0.36886227544910144,"d":"0.3689"},{"v":0.8941757643237745,"d":"0.8942"},{"v":1.3286656871163256,"d":"1.3287"},{"v":0.05018717185729641,"d":"0.0502"},{"v":0.4121668041163155,"d":"0.4122"},{"v":17.816819143870042,"d":"17.8168"},{"v":-116.4131469435836,"d":"-116.4131"},{"v":3.223611590858175,"d":"3.2236"},{"v":119.84807065904667,"d":"119.8481"}]
[null,null,{"v":0.3724550898203589,"d":"0.3725"},{"v":0.8989494134990428,"d":"0.8989"},{"v":1.2995981431810433,"d":"1.2996"},{"v":0.05166801067448078,"d":"0.0517"},{"v":0.42019577611244474,"d":"0.4202"},{"v":17.398568316527825,"d":"17.3986"},{"v":-113.04000013070525,"d":"-113.0400"},{"v":3.0928396168201124,"d":"3.0928"},{"v":116.34291112347276,"d":"116.3429"}]
[null,null,{"v":0.3760479041916164,"d":"0.3760"},{"v":0.9036186283847232,"d":"0.9036"},{"v":1.270379620106394,"d":"1.2704"},{"v":0.05317769609763926,"d":"0.0532"},{"v":0.4283021979992073,"d":"0.4283"},{"v":16.99243657953128,"d":"16.9924"},{"v":-109.79352872907758,"d":"-109.7935"},{"v":2.9660824204052885,"d":"2.9661"},{"v":112.9706391423693,"d":"112.9706"}]
[null,null,{"v":0.37964071856287385,"d":"0.3796"},{"v":0.908182866540794,"d":"0.9082"},{"v":1.2410135123165096,"d":"1.2410"},{"v":0.05471650638985198,"d":"0.0547"},{"v":0.4364860697766128,"d":"0.4365"},{"v":16.597968811642378,"d":"16.5980"},{"v":-106.66782530624792,"d":"-106.6678"},{"v":2.8431915661172007,"d":"2.8432"},{"v":109.72499994381145,"d":"109.7250"}]
[null,null,{"v":0.3832335329341313,"d":"0.3832"},{"v":0.9126415977227695,"d":"0.9126"},{"v":1.2115032313811809,"d":"1.2115"},{"v":0.056284719814199094,"d":"0.0563"},{"v":0.4447473914446516,"d":"0.4447"},{"v":16.214731115931308,"d":"16.2147"},{"v":-103.6573101158103,"d":"-103.6573"},{"v":2.724025491067892,"d":"2.7240"},{"v":106.60008889112508,"d":"106.6001"}]
[null,null,{"v":0.3868263473053888,"d":"0.3868"},{"v":0.9169943039433007,"d":"0.9170"},{"v":1.1818522056193632,"d":"1.1819"},{"v":0.057882614633760716,"d":"0.0579"},{"v":0.4530861630033314,"d":"0.4531"},{"v":15.84230964246133,"d":"15.8423"},{"v":-100.75671008655559,"d":"-100.7567"},{"v":2.6084491254054774,"d":"2.6084"},{"v":103.59032882900966,"d":"103.5903"}]
[null,null,{"v":0.39041916167664625,"d":"0.3904"},{"v":0.9212404795323523,"d":"0.9212"},{"v":1.152063879700614,"d":"1.1521"},{"v":0.059510469111617,"d":"0.0595"},{"v":0.46150238445265024,"d":"0.4615"},{"v":15.48030948646173,"d":"15.4803"},{"v":-97.96103933723795,"d":"-97.9610"},{"v":2.4963335369696553,"d":"2.4963"},{"v":100.69044908934747,"d":"100.6904"}]
[null,null,{"v":0.3940119760479037,"d":"0.3940"},{"v":0.9253796311959473,"d":"0.9254"},{"v":1.1221417142454155,"d":"1.1221"},{"v":0.061168561510848075,"d":"0.0612"},{"v":0.4699960557926043,"d":"0.4700"},{"v":15.128353656507581,"d":"15.1284"},{"v":-95.26558109350023,"d":"-95.2656"},{"v":2.3875555984252435,"d":"2.3876"},{"v":97.89546602116502,"d":"97.8955"}]
[null,null,{"v":0.3976047904191612,"d":"0.3976"},{"v":0.9294112780734758,"d":"0.9294"},{"v":1.0920891854226562,"d":"1.0921"},{"v":0.06285717009453408,"d":"0.0629"},{"v":0.4785671770231917,"d":"0.4786"},{"v":14.786082107668658,"d":"14.7861"},{"v":-92.66587089445348,"d":"-92.6659"},{"v":2.281997675259983,"d":"2.2820"},{"v":95.20066492140438,"d":"95.2007"}]
[null,null,{"v":0.40119760479041866,"d":"0.4012"},{"v":0.9333349517935572,"d":"0.9333"},{"v":1.0619097845462775,"d":"1.0619"},{"v":0.06457657312575513,"d":"0.0646"},{"v":0.4872157481444297,"d":"0.4872"},{"v":14.453150834993975,"d":"14.4532"},{"v":-90.15768098633855,"d":"-90.1577"},{"v":2.179547333169301,"d":"2.1795"},{"v":92.60158325410791,"d":"92.6016"}]
[null,null,{"v":0.40479041916167613,"d":"0.4048"},{"v":0.937150196528454,"d":"0.9372"},{"v":1.0316070176692,"d":"1.0316"},{"v":0.0663270488675914,"d":"0.0663"},{"v":0.4959417691562933,"d":"0.4959"},{"v":14.12923102306701,"d":"14.1292"},{"v":-87.7370058097008,"d":"-87.7370"},{"v":2.080097063460075,"d":"2.0801"},{"v":90.0939950555897,"d":"90.0940"}]
{"$rows_left_out":445}
{"sheet":"Sheet3","index":2,"n_rows":0,"n_cols":0,"rows_kept":0}