{"text_format":"3","workbook":"xlsx","n_sheets":3,"sheets":["total time","Sheet2","Sheet3"],"not_rendered":{"charts":3,"images":3,"macros":1,"defined_names":7,"comments":1},"read":"whole","date_system":"1900"}

{"sheet":"total time","index":0,"n_rows":43,"n_cols":18,"rows_kept":43,"merged":[[36,2,36,3]]}
[null,"  The Swim vs. Run Problem"]
[]
[null,"This DIGMath module lets you investigate "]
[null,"       the calculus problem of finding"]
[null,null,"    the best combination"]
[null,null,"of running and swimming"]
[null,"    to get from one point A to another B"]
[null,null,"in the minimum time."]
[]
[]
["How fast can you run (10-20 ft/sec.)?",{"$nulls":4},{"$f":"D12","v":13}]
[{"$nulls":3},13,{"$f":"#REF!+D12*(#REF!-#REF!)/100","v":{"$error":"#REF!"}}]
[]
[]
["How fast can you swim (3 - 8 ft/sec.)?",{"$nulls":4},{"$f":"D16","v":6}]
[{"$nulls":3},6,{"$f":"#REF!+D16*(#REF!-#REF!)/100","v":{"$error":"#REF!"}}]
[]
[]
[]
[]
[{"$f":"\"Running \"&TEXT(1000-x0,\"0\") &\" feet at \" &TEXT(RR,\"0\") & \" feet per second takes \" &TEXT((1000-x0)/RR,\"0.0\") & \" seconds\"","v":"Running 768 feet at 13 feet per second takes 59.1 seconds"}]
[]
[{"$f":"\"Swimming \"&TEXT(Sheet2!L6,\"0\") &\" feet at \" &TEXT(s,\"0\") & \" feet per second takes \" &TEXT(Sheet2!L7,\"0.0\") & \" seconds\"","v":"Swimming 306 feet at 6 feet per second takes 51.1 seconds"}]
[]
[{"$nulls":3},"Total time =",null,{"$f":"(1000-x0)/RR +Sheet2!L7","v":{"v":110.12809566112747,"d":"110.1"}},"seconds"]
[]
[]
[]
["Click each item below for suggestions and investigations"]
[null,null,"   Item 1",{"$nulls":9},"The graph of the function y =",null,null,{"$f":"\"(1000-x)/\" & TEXT(RR,\"0\") & \"+ sqrt(x^2 + 200^2)/\" & TEXT(s,\"0\")","v":"(1000-x)/13+ sqrt(x^2 + 200^2)/6"}]
[null,null,"   Item 2"]
[null,null,"   Item 3"]
[{"$nulls":11},"Select the point where you take to the water: x0 =",{"$nulls":4},{"$f":"O35","v":232},"feet"]
[]
[{"$nulls":14},232,{"$f":"Sheet2!H7+O35*(Sheet2!H8-Sheet2!H7)/100","v":2320}]
["To access/download all the DIGMath Apps for Calculus"]
["     Click this link:",null,"DIGMath for Calculus",{"$nulls":8},"       The value of the derivative there is T' = ",{"$nulls":4},{"$f":"Sheet2!I25","v":{"v":0.0493119166770192,"d":"0.049"}}]
[]
["Created by:  Sheldon P. Gordon   "]
["                      Farmingdale State College    "]
["Development of this module was supported by the "]
["NSF's Division of Undergraduate Education  "]
["under grants DUE-0310123 and DUE-0442160."]

{"sheet":"Sheet2","index":1,"n_rows":1003,"n_cols":12,"rows_kept":1003}
[null,"x","f(x)","f'(x)",null,null,"xl=",{"$f":"IF('total time'!$P$35<Sheet2!H7+80*Sheet2!H5,Sheet2!H7,'total time'!P35-80*Sheet2!H5)","v":2240},{"$f":"LOOKUP('total time'!P35,Sheet2!B3:B1002,Sheet2!C3:C1002)+LOOKUP('total time'!P35,Sheet2!B3:B1002,Sheet2!D3:D1002)*(H1-'total time'!P35)","v":116.2670841640469},"\"=yl"]
[{"$nulls":6},"xr=",{"$f":"IF('total time'!$P$35>Sheet2!H8-80*Sheet2!H5,Sheet2!H8,'total time'!P35+80*Sheet2!H5)","v":1000},{"$f":"LOOKUP('total time'!P35,Sheet2!B3:B1003,Sheet2!C3:C1003)+LOOKUP('total time'!P35,Sheet2!B3:B1003,Sheet2!D3:D1003)*(H2-'total time'!P35)","v":211.7948717948718},"\"=yR"]
[0,1000,{"$f":"(1000-B3)/RR+SQRT(B3^2+200^2)/s","v":169.96731711975949},{"$f":"-1/RR+B3/SQRT(B3^2+200^2)/s","v":0.08650703569207643}]
[1,999,169.88081322997908,0.08650074084097431]
[2,998,169.79431564414463,0.0864944277886017,null,null,"delta x = ",{"$f":"(xMax-xMin)/1000","v":1},null,null,"swim distance"]
[3,997,169.70782438049216,0.08648809646542718,{"$nulls":6},"distance =",{"$f":"SQRT(x0^2+200^2)","v":306.30703550522634}]
[4,996,169.62133945732734,0.0864817468015906,null,null,"xMin =",0,null,null,"time =",{"$f":"L6/s","v":51.05117258420439}]
[5,995,169.53486089302592,0.08647537872690095,null,null,"xMax =",1000]
[6,994,169.44838870603397,0.0864689921708347]
[7,993,169.36192291486833,0.08646258706253382]
[8,992,169.27546353811672,0.08645616333080394,null,null,"Point"]
[9,991,169.18901059443834,0.0864497209041124,null,null,{"$f":"1000-x0","v":768},0]
[10,990,169.10256410256412,0.08644325971058645]
[11,989,169.01612408129685,0.0864367796780112,null,null,"Horizontal Line"]
[12,988,168.92969054951197,0.0864302807338278,null,null,0,0]
[13,987,168.84326352615736,0.08642376280513142,null,null,{"$f":"G12","v":768},0]
[14,986,168.75684303025426,0.08641722581866929]
[15,985,168.67042908089718,0.08641066970083877,null,null,"Diagnonal Line"]
[16,984,168.58402169725437,0.08640409437768534,null,null,{"$f":"G16","v":768},0]
[17,983,168.49762089856833,0.0863974997749006,null,null,1000,200]
[18,982,168.41122670415598,0.08639088581782031]
[19,981,168.3248391334091,0.0863842524314222]
[20,980,168.23845820579473,0.0863775995403242,null,null,"Point on curve",null,"T'"]
[21,979,168.15208394085528,0.08637092706878216,null,null,"x=",{"$f":"G12*H5","v":768},{"$f":"H24","v":768}]
[22,978,168.0657163582093,0.08636423494068787,null,null,{"$f":"1000-H24","v":232},{"$f":"LOOKUP(H24,A3:A1003,C3:C1003)","v":110.12809566112747},{"$f":"LOOKUP(H24,A3:A1003,D3:D1003)","v":0.0493119166770192}]
[23,977,167.9793554775516,0.08635752307956698,null,null,{"$f":"G25","v":232},0,0]
[24,976,167.89300131865346,0.0863507914085769]
[25,975,167.80665390136346,0.08634403985050476]
[26,974,167.72031324560734,0.08633726832776514]
[27,973,167.63397937138876,0.08633047676239816]
[28,972,167.54765229878956,0.08632366507606701]
[29,971,167.46133204796988,0.08631683319005615]
[30,970,167.37501863916904,0.08630998102526888]
[31,969,167.28871209270542,0.08630310850222525]
[32,968,167.20241242897725,0.08629621554105985]
[33,967,167.11611966846277,0.08628930206151952]
[34,966,167.02983383172057,0.08628236798296127]
[35,965,166.94355493939017,0.0862754132243499]
[36,964,166.85728301219237,0.08626843770425566]
[37,963,166.77101807092941,0.08626144134085223]
[38,962,166.68476013648583,0.08625442405191422]
[39,961,166.59850922982832,0.08624738575481491]
[40,960,166.51226537200657,0.08624032636652393]
[41,959,166.42602858415347,0.08623324580360489]
[42,958,166.33979888748553,0.0862261439822131]
[43,957,166.2535763033033,0.08621902081809318]
[44,956,166.1673608529918,0.08621187622657658]
[45,955,166.08115255802093,0.08620471012257921]
[46,954,165.99495143994596,0.08619752242059917]
[47,953,165.90875752040773,0.08619031303471406]
[48,952,165.82257082113327,0.08618308187857873]
[49,951,165.73639136393624,0.08617582886542277]
[50,950,165.65021917071715,0.08616855390804792]
[51,949,165.5640542634641,0.08616125691882565]
[52,948,165.47789666425282,0.08615393780969471]
[53,947,165.39174639524748,0.08614659649215844]
[54,946,165.30560347870096,0.08613923287728228]
[55,945,165.21946793695517,0.08613184687569128]
[56,944,165.13333979244175,0.08612443839756737]
[57,943,165.0472190676823,0.08611700735264688]
[58,942,164.96110578528894,0.08610955365021786]
[59,941,164.87499996796473,0.08610207719911739]
[60,940,164.78890163850411,0.08609457790772898]
[61,939,164.70281081979337,0.08608705568397995]
[62,938,164.61672753481113,0.0860795104353386]
[63,937,164.53065180662867,0.08607194206881161]
[64,936,{"$f":"(1000-B67)/RR+SQRT(B67^2+200^2)/s","v":164.44458365841064},{"$f":"-1/RR+B67/SQRT(B67^2+200^2)/s","v":0.08606435049094116}]
[65,935,164.3585231134152,0.08605673560780247]
[66,934,164.27247019499487,0.08604909732500066]
[67,933,164.18642492659671,0.08604143554766822]
[68,932,164.10038733176285,0.08603375018046208]
[69,931,164.01435743413103,0.08602604112756093]
[70,930,163.92833525743504,0.08601830829266213]
[71,929,163.84232082550525,0.0860105515789791]
[72,928,163.7563141622691,0.08600277088923822]
[73,927,163.6703152917514,0.08599496612567611]
[74,926,163.58432423807508,0.08598713719003653]
[75,925,163.4983410254616,0.0859792839835676]
[76,924,163.4123656782313,0.08597140640701872]
[77,923,163.32639822080418,0.08596350436063763]
[78,922,163.24043867770007,0.08595557774416737]
[79,921,163.15448707353943,0.08594762645684326]
[80,920,163.06854343304377,0.0859396503973899]
[81,919,162.98260778103597,0.08593164946401807]
[82,918,162.8966801424411,0.0859236235544216]
[83,917,162.8107605422868,0.08591557256577431]
[84,916,162.7248490057037,0.08590749639472689]
[85,915,162.63894555792612,0.08589939493740364]
[86,914,162.55305022429243,0.08589126808939943]
[87,913,162.4671630302458,0.0858831157457764]
[88,912,162.3812840013346,0.08587493780106076]
[89,911,162.29541316321274,0.08586673414923959]
[90,910,162.20955054164068,0.08585850468375752]
[91,909,162.12369616248546,0.0858502492975135]
[92,908,162.03785005172176,0.08584196788285739]
[93,907,161.95201223543197,0.08583366033158671]
[94,906,161.86618273980704,0.08582532653494324]
[95,905,161.78036159114697,0.0858169663836097]
[96,904,161.69454881586134,0.08580857976770617]
[97,903,161.60874444046988,0.08580016657678696]
[98,902,161.5229484916031,0.08579172669983684]
[99,901,161.43716099600275,0.08578326002526773]
[100,900,161.35138198052246,0.0857747664409152]
[101,899,161.26561147212843,0.08576624583403489]
[102,898,161.17984949789968,0.0857576980912989]
[103,897,161.0940960850291,0.08574912309879243]
[104,896,161.00835126082353,0.08574052074200997]
[105,895,160.92261505270483,0.08573189090585168]
[106,894,160.83688748821018,0.08572323347461983]
[107,893,160.75116859499272,0.08571454833201511]
[108,892,160.66545840082225,0.08570583536113288]
[109,891,160.5797569335857,0.08569709444445939]
[110,890,160.4940642212879,0.0856883254638682]
[111,889,160.4083802920522,0.08567952830061618]
[112,888,160.3227051741207,0.08567070283533981]
[113,887,160.23703889585548,0.0856618489480514]
[114,886,160.15138148573882,0.08565296651813506]
[115,885,160.06573297237384,0.08564405542434292]
[116,884,159.98009338448537,0.08563511554479117]
[117,883,159.89446275092035,0.0856261467569562]
[118,882,159.80884110064858,0.08561714893767042]
[119,881,159.72322846276342,0.08560812196311848]
[120,880,159.63762486648227,0.08559906570883302]
[121,879,159.5520303411474,0.08558998004969087]
[122,878,159.4664449162264,0.08558086485990868]
[123,877,159.38086862131323,0.08557172001303892]
[124,876,159.2953014861284,0.08556254538196581]
[125,875,159.20974354051998,0.08555334083890095]
[126,874,159.12419481446406,0.08554410625537931]
[127,873,159.03865533806575,0.0855348415022548]
[128,872,{"$f":"(1000-B131)/RR+SQRT(B131^2+200^2)/s","v":158.95312514155938},{"$f":"-1/RR+B131/SQRT(B131^2+200^2)/s","v":0.08552554644969615}]
[129,871,158.86760425530966,0.08551622096718253]
[130,870,158.78209270981208,0.08550686492349915]
[131,869,158.69659053569364,0.08549747818673312]
[132,868,158.61109776371381,0.08548806062426867]
[133,867,158.5256144247648,0.08547861210278318]
[134,866,158.4401405498726,0.08546913248824234]
[135,865,158.3546761701976,0.08545962164589588]
[136,864,158.26922131703523,0.08545007944027291]
[137,863,158.18377602181684,0.08544050573517745]
[138,862,158.09834031611032,0.08543090039368376]
[139,861,158.0129142316208,0.08542126327813179]
[140,860,157.92749780019156,0.08541159425012249]
[141,859,157.84209105380444,0.08540189317051303]
[142,858,157.756694024581,0.08539215989941226]
[143,857,157.67130674478298,0.08538239429617575]
[144,856,157.58592924681315,0.0853725962194011]
[145,855,157.50056156321608,0.08536276552692312]
[146,854,157.41520372667884,0.08535290207580884]
[147,853,157.3298557700319,0.08534300572235279]
[148,852,157.24451772624974,0.0853330763220719]
[149,851,157.15918962845177,0.08532311372970058]
[150,850,157.07387150990306,0.08531311779918574]
[151,849,156.98856340401505,0.08530308838368167]
[152,848,156.90326534434652,0.08529302533554503]
[153,847,156.81797736460433,0.08528292850632962]
[154,846,156.73269949864397,0.08527279774678143]
[155,845,156.6474317804709,0.08526263290683309]
[156,844,156.56217424424074,0.08525243383559897]
[157,843,156.47692692426065,0.08524220038136973]
[158,842,156.39168985498986,0.08523193239160706]
[159,841,156.3064630710404,0.08522162971293826]
[160,840,156.22124660717836,0.08521129219115087]
[161,839,156.13604049832418,0.08520091967118734]
[162,838,156.05084477955396,0.08519051199713931]
[163,837,155.96565948610018,0.08518006901224243]
[164,836,155.8804846533523,0.08516959055887044]
[165,835,155.79532031685804,0.08515907647852985]
[166,834,155.710166512324,0.08514852661185415]
[167,833,155.6250232756165,0.08513794079859818]
[168,832,155.5398906427627,0.08512731887763239]
[169,831,155.45476864995118,0.08511666068693705]
[170,830,155.36965733353304,0.08510596606359652]
[171,829,155.2845567300228,0.08509523484379325]
[172,828,155.19946687609917,0.08508446686280202]
[173,827,155.11438780860612,0.08507366195498395]
[174,826,155.02931956455365,0.08506281995378043]
[175,825,154.94426218111883,0.08505194069170721]
[176,824,154.85921569564667,0.08504102400034827]
[177,823,154.774180145651,0.08503006971034963]
[178,822,154.68915556881558,0.08501907765141334]
[179,821,154.6041420029949,0.08500804765229111]
[180,820,154.51913948621512,0.084996979540778]
[181,819,154.4341480566752,0.0849858731437064]
[182,818,154.3491677527476,0.08497472828693928]
[183,817,154.26419861297956,0.08496354479536414]
[184,816,154.17924067609385,0.08495232249288626]
[185,815,154.09429398098976,0.08494106120242237]
[186,814,154.00935856674434,0.08492976074589406]
[187,813,153.92443447261303,0.08491842094422117]
[188,812,153.83952173803095,0.08490704161731508]
[189,811,153.75462040261382,0.0848956225840721]
[190,810,153.66973050615894,0.08488416366236659]
[191,809,153.58485208864627,0.08487266466904428]
[192,808,{"$f":"(1000-B195)/RR+SQRT(B195^2+200^2)/s","v":153.49998519023947},{"$f":"-1/RR+B195/SQRT(B195^2+200^2)/s","v":0.08486112541991539}]
[193,807,153.4151298512868,0.0848495457297476]
[194,806,153.3302861123224,0.08483792541225918]
[195,805,153.24545401406715,0.084826264280112]
[196,804,153.16063359742984,0.08481456214490435]
[197,803,153.0758249035082,0.08480281881716392]
{"$rows_left_out":804}
{"sheet":"Sheet3","index":2,"n_rows":1003,"n_cols":2,"rows_kept":1003}
[{"$f":"xMin","v":0},{"$f":"9","v":9}]
[{"$f":"A1+dx","v":1},{"$f":"9","v":9}]
[2,{"$f":"9","v":9}]
[3,{"$f":"9","v":9}]
[4,{"$f":"9","v":9}]
[5,{"$f":"9","v":9}]
[6,{"$f":"9","v":9}]
[7,{"$f":"9","v":9}]
[8,{"$f":"9","v":9}]
[9,{"$f":"9","v":9}]
[10,{"$f":"9","v":9}]
[11,{"$f":"9","v":9}]
[12,{"$f":"9","v":9}]
[13,{"$f":"9","v":9}]
[14,{"$f":"9","v":9}]
[15,{"$f":"9","v":9}]
[16,{"$f":"9","v":9}]
[17,{"$f":"9","v":9}]
[18,{"$f":"9","v":9}]
[19,{"$f":"9","v":9}]
[20,{"$f":"9","v":9}]
[21,{"$f":"9","v":9}]
[22,{"$f":"9","v":9}]
[23,{"$f":"9","v":9}]
[24,{"$f":"9","v":9}]
[25,{"$f":"9","v":9}]
[26,{"$f":"9","v":9}]
[27,{"$f":"9","v":9}]
[28,{"$f":"9","v":9}]
[29,{"$f":"9","v":9}]
[30,{"$f":"9","v":9}]
[31,{"$f":"9","v":9}]
[32,{"$f":"9","v":9}]
[33,{"$f":"9","v":9}]
[34,{"$f":"9","v":9}]
[35,{"$f":"9","v":9}]
[36,{"$f":"9","v":9}]
[37,{"$f":"9","v":9}]
[38,{"$f":"9","v":9}]
[39,{"$f":"9","v":9}]
[40,{"$f":"9","v":9}]
[41,{"$f":"9","v":9}]
[42,{"$f":"9","v":9}]
[43,{"$f":"9","v":9}]
[44,{"$f":"9","v":9}]
[45,{"$f":"9","v":9}]
[46,{"$f":"9","v":9}]
[47,{"$f":"9","v":9}]
[48,{"$f":"9","v":9}]
[49,{"$f":"9","v":9}]
[50,{"$f":"9","v":9}]
[51,{"$f":"9","v":9}]
[52,{"$f":"9","v":9}]
[53,{"$f":"9","v":9}]
[54,{"$f":"9","v":9}]
[55,{"$f":"9","v":9}]
[56,{"$f":"9","v":9}]
[57,{"$f":"9","v":9}]
[58,{"$f":"9","v":9}]
[59,{"$f":"9","v":9}]
[60,{"$f":"9","v":9}]
[61,{"$f":"9","v":9}]
[62,{"$f":"9","v":9}]
[63,{"$f":"9","v":9}]
[64,{"$f":"9","v":9}]
[{"$f":"A65+dx","v":65},{"$f":"9","v":9}]
[66,{"$f":"9","v":9}]
[67,{"$f":"9","v":9}]
[68,{"$f":"9","v":9}]
[69,{"$f":"9","v":9}]
[70,{"$f":"9","v":9}]
[71,{"$f":"9","v":9}]
[72,{"$f":"9","v":9}]
[73,{"$f":"9","v":9}]
[74,{"$f":"9","v":9}]
[75,{"$f":"9","v":9}]
[76,{"$f":"9","v":9}]
[77,{"$f":"9","v":9}]
[78,{"$f":"9","v":9}]
[79,{"$f":"9","v":9}]
[80,{"$f":"9","v":9}]
[81,{"$f":"9","v":9}]
[82,{"$f":"9","v":9}]
[83,{"$f":"9","v":9}]
[84,{"$f":"9","v":9}]
[85,{"$f":"9","v":9}]
[86,{"$f":"9","v":9}]
[87,{"$f":"9","v":9}]
[88,{"$f":"9","v":9}]
[89,{"$f":"9","v":9}]
[90,{"$f":"9","v":9}]
[91,{"$f":"9","v":9}]
[92,{"$f":"9","v":9}]
[93,{"$f":"9","v":9}]
[94,{"$f":"9","v":9}]
[95,{"$f":"9","v":9}]
[96,{"$f":"9","v":9}]
[97,{"$f":"9","v":9}]
[98,{"$f":"9","v":9}]
[99,{"$f":"9","v":9}]
[100,{"$f":"9","v":9}]
[101,{"$f":"9","v":9}]
[102,{"$f":"9","v":9}]
[103,{"$f":"9","v":9}]
[104,{"$f":"9","v":9}]
[105,{"$f":"9","v":9}]
[106,{"$f":"9","v":9}]
[107,{"$f":"9","v":9}]
[108,{"$f":"9","v":9}]
[109,{"$f":"9","v":9}]
[110,{"$f":"9","v":9}]
[111,{"$f":"9","v":9}]
[112,{"$f":"9","v":9}]
[113,{"$f":"9","v":9}]
[114,{"$f":"9","v":9}]
[115,{"$f":"9","v":9}]
[116,{"$f":"9","v":9}]
[117,{"$f":"9","v":9}]
[118,{"$f":"9","v":9}]
[119,{"$f":"9","v":9}]
[120,{"$f":"9","v":9}]
[121,{"$f":"9","v":9}]
[122,{"$f":"9","v":9}]
[123,{"$f":"9","v":9}]
[124,{"$f":"9","v":9}]
[125,{"$f":"9","v":9}]
[126,{"$f":"9","v":9}]
[127,{"$f":"9","v":9}]
[128,{"$f":"9","v":9}]
[{"$f":"A129+dx","v":129},{"$f":"9","v":9}]
[130,{"$f":"9","v":9}]
[131,{"$f":"9","v":9}]
[132,{"$f":"9","v":9}]
[133,{"$f":"9","v":9}]
[134,{"$f":"9","v":9}]
[135,{"$f":"9","v":9}]
[136,{"$f":"9","v":9}]
[137,{"$f":"9","v":9}]
[138,{"$f":"9","v":9}]
[139,{"$f":"9","v":9}]
[140,{"$f":"9","v":9}]
[141,{"$f":"9","v":9}]
[142,{"$f":"9","v":9}]
[143,{"$f":"9","v":9}]
[144,{"$f":"9","v":9}]
[145,{"$f":"9","v":9}]
[146,{"$f":"9","v":9}]
[147,{"$f":"9","v":9}]
[148,{"$f":"9","v":9}]
[149,{"$f":"9","v":9}]
[150,{"$f":"9","v":9}]
[151,{"$f":"9","v":9}]
[152,{"$f":"9","v":9}]
[153,{"$f":"9","v":9}]
[154,{"$f":"9","v":9}]
[155,{"$f":"9","v":9}]
[156,{"$f":"9","v":9}]
[157,{"$f":"9","v":9}]
[158,{"$f":"9","v":9}]
[159,{"$f":"9","v":9}]
[160,{"$f":"9","v":9}]
[161,{"$f":"9","v":9}]
[162,{"$f":"9","v":9}]
[163,{"$f":"9","v":9}]
[164,{"$f":"9","v":9}]
[165,{"$f":"9","v":9}]
[166,{"$f":"9","v":9}]
[167,{"$f":"9","v":9}]
[168,{"$f":"9","v":9}]
[169,{"$f":"9","v":9}]
[170,{"$f":"9","v":9}]
[171,{"$f":"9","v":9}]
[172,{"$f":"9","v":9}]
[173,{"$f":"9","v":9}]
[174,{"$f":"9","v":9}]
[175,{"$f":"9","v":9}]
[176,{"$f":"9","v":9}]
[177,{"$f":"9","v":9}]
[178,{"$f":"9","v":9}]
[179,{"$f":"9","v":9}]
[180,{"$f":"9","v":9}]
[181,{"$f":"9","v":9}]
[182,{"$f":"9","v":9}]
[183,{"$f":"9","v":9}]
[184,{"$f":"9","v":9}]
[185,{"$f":"9","v":9}]
[186,{"$f":"9","v":9}]
[187,{"$f":"9","v":9}]
[188,{"$f":"9","v":9}]
[189,{"$f":"9","v":9}]
[190,{"$f":"9","v":9}]
[191,{"$f":"9","v":9}]
[192,{"$f":"9","v":9}]
[{"$f":"A193+dx","v":193},{"$f":"9","v":9}]
[194,{"$f":"9","v":9}]
[195,{"$f":"9","v":9}]
[196,{"$f":"9","v":9}]
[197,{"$f":"9","v":9}]
[198,{"$f":"9","v":9}]
[199,{"$f":"9","v":9}]
{"$rows_left_out":803}