{"text_format":"3","workbook":"xlsx","n_sheets":3,"sheets":["Sheet1","Sheet2","Sheet3"],"not_rendered":{"charts":1,"images":1,"macros":1,"defined_names":5,"comments":1},"read":"whole","date_system":"1900"}

{"sheet":"Sheet1","index":0,"n_rows":43,"n_cols":11,"rows_kept":43,"merged":[[36,2,36,3]]}
["Taylor Approximations to Parametric Functions"]
[]
[null,"       This graphing utility produces the graphs"]
[null,"            of any parametric curve based on "]
[null,null,"    x = f(t)    and    y = g(t)"]
[null,"and the curve for the Taylor polynomials based on"]
[null,null,"   x = F(t)    and    y = G(t)"]
[null,"         on any interval from t = a  to t = b."]
[]
["Enter the first function in terms of t:   x = f(t) =  ",{"$nulls":4},"sin(t)"]
[]
["Enter the second function in terms of t:  y = g(t) = ",{"$nulls":4},"cos(t)"]
[]
["Enter the Taylor approximation to f in terms of t:    "]
[{"$nulls":4},"  x = F(t) =  ","t-t^3/6+t^5/120-t^7/5040"]
[]
["Enter the Taylor approximation to g in terms of t: "]
[{"$nulls":4},"  y = G(t) = ","1-t^2/2+t^4/24-t^6/720"]
[]
[]
["Now enter the interval for t :  "]
[null,"Starting value t = a =",null,-3.14]
[null,"Ending value t = b =",null,3.14,{"$nulls":4},"The graph of the parametric functions"]
[{"$nulls":9},"x =",{"$f":"F10","v":"sin(t)"}]
[{"$nulls":9},"y =",{"$f":"F12","v":"cos(t)"}]
[]
[{"$nulls":8},"Now trace along the parametric curve:"]
[{"$nulls":8},"t  = ",{"$f":"D22+K28*Sheet2!B12","v":{"v":-1.8739720558882236,"d":"-1.874"}},101]
["Click each item below for suggestions and investigations",{"$nulls":7},"x =",{"$f":"LOOKUP(J28,Sheet2!C3:C504,Sheet2!D3:D504)","v":{"v":-0.9543931811829954,"d":"-0.954"}}]
[null,"   Item 1",{"$nulls":6},"y =",{"$f":"LOOKUP(J28,Sheet2!C3:C504,Sheet2!E3:E504)","v":{"v":-0.29855260124708677,"d":"-0.299"}}]
[null,"   Item 2"]
[null,"   Item 3",{"$nulls":6},"Along the approximating Taylor functions:"]
[{"$nulls":8},"x =",{"$f":"LOOKUP($J28,Sheet2!C3:C503,Sheet2!F3:F503)","v":{"v":-0.9536322754554889,"d":"-0.954"}}]
[{"$nulls":8},"y =",{"$f":"LOOKUP(J28,Sheet2!C3:C503,Sheet2!G3:G503)","v":{"v":-0.30218136615335484,"d":"-0.302"}}]
[]
["To access/download all the DIGMath Apps for Calculus"]
["      Click this link:",null,"DIGMath for Calculus"]
[]
["Created by:  Sheldon P. Gordon   "]
["                      Farmingdale State College    "]
["Development of this module was supported by the "]
["NSF's Division of Undergraduate Education  "]
["under grants DUE-0310123 and DUE-0442160."]

{"sheet":"Sheet2","index":1,"n_rows":505,"n_cols":11,"rows_kept":505}
[null,null,"t","x = f(t)","y = g(t)","x = F(t)","y =G(t)",null,null,"Tracing point"]
[]
[null,null,{"$f":"a","v":-3.14},{"$f":"SIN(t)","v":-1.5926529164868282E-3},{"$f":"COS(t)","v":-0.9999987317275395},{"$f":"t-t^3/6+t^5/120-t^7/5040","v":0.07329201499745874},{"$f":"1-t^2/2+t^4/24-t^6/720","v":-1.2105183783510223},null,null,0,0]
[null,null,{"$f":"C3+B$12","v":-3.1274650698602797},-0.014127113783375127,-0.9999002073487891,0.05815936890268436,-1.203960788562937,null,null,{"$f":"LOOKUP(0,C3:C503,D3:D503)","v":-0.006267424037778639},{"$f":"LOOKUP(0,C3:C503,E3:E503)","v":0.9999803595050908}]
[null,null,{"$f":"C4+B$12","v":-3.1149301397205593},-0.026659354964010767,-0.9996445762334245,0.0431088234128707,-1.197418239967868]
[null,null,-3.102395209580839,-0.03918740736237808,-0.999231878546824,0.02814021411625578,-1.1908868986845254]
[null,null,-3.0898602794411185,-0.05170930254061299,-0.9986621791330457,0.01325342406157115,-1.18436302591589]
[null,null,-3.077325349301398,-0.06422307302828874,-0.9979355675046376,-0.001551617427804075,-1.1778429769871945]
[null,null,-3.0647904191616777,-0.07672675263154956,-0.9970521578285747,-0.016274935927651724,-1.171323200387784]
[null,null,-3.0522554890219573,-0.08921837674204385,-0.9960120889083198,-0.030916513074728758,-1.1648002368168564]
[null,null,-3.039720558882237,-0.10169598264560813,-0.9948155241620148,-0.045476287716655794,-1.158270718233081]
["delta t = ",{"$f":"(Sheet1!D23-Sheet1!D22)/501","v":0.01253493013972056},-3.0271856287425165,-0.1141576098306535,-0.9934626515968038,-0.05995415704991092,-1.1517313669080989]
[null,null,-3.014650698602796,-0.1266013002962059,-0.9919536837792932,-0.07434997774598467,-1.1451789944838984]
[null,null,-3.0021157684630757,-0.13902509885955197,-0.9902888578021525,-0.08866356706574302,-1.138610501034073]
[null,null,-2.9895808383233553,-0.15142705346344212,-0.988468435246862,-0.10289470396204786,-1.1320228741289566]
[null,null,-2.977045908183635,-0.1638052154828024,-0.9864927021426122,-0.11704313017068446,-1.1254131879046385]
[null,null,-2.9645109780439145,-0.1761576400309073,-0.9843619689213624,-0.131108551289641,-1.1187786021358583]
[null,null,-2.951976047904194,-0.18848238626496497,-0.9820765703690647,-0.1450906378467961,-1.1121163613127762]
[null,null,-2.9394411177644737,-0.20077751769106703,-0.9796368655730618,-0.15898902635604972,-1.105423793721629]
[null,null,-2.9269061876247533,-0.21304110246845545,-0.9770432378656664,-0.17280332036196366,-1.0986983105292567]
[null,null,-2.914371257485033,-0.22527121371305775,-0.9742960947639305,-0.1865330914729441,-1.0919374048715187]
[null,null,-2.9018363273453125,-0.23746592980024384,-0.9713958679056164,-0.2001778803830248,-1.0851386509455794]
[null,null,-2.889301397205592,-0.24962333466675632,-0.9683430129813756,-0.21373719788229878,-1.078299703106075]
[null,null,-2.8767664670658717,-0.2617415181117669,-0.9651380096631506,-0.22721052585603818,-1.0714182949651672]
[null,null,-2.8642315369261513,-0.2738185760970118,-0.9617813615288066,-0.24059731827256586,-1.064492238496465]
[null,null,-2.851696606786431,-0.2858526110459589,-0.9582735959830093,-0.2538970021599097,-1.0575194231428315]
[null,null,-2.8391616766467105,-0.2978417321419594,-0.9546152641743569,-0.26710897857130667,-1.0504978149280708]
[null,null,-2.82662674650699,-0.30978405562533773,-0.9508069409087828,-0.28023262353959216,-1.0434254555724904]
[null,null,-2.8140918163672697,-0.32167770508937216,-0.9468492245592405,-0.29326728902052557,-1.036300461612345]
[null,null,-2.8015568862275493,-0.3335208117751206,-0.9427427369716855,-0.3062123038251058,-1.0291210235231587]
[null,null,-2.789021956087829,-0.34531151486504436,-0.9384881233673702,-0.31906697454091976,-1.0218854048469264]
[null,null,-2.7764870259481085,-0.35704796177538434,-0.9340860522414643,-0.3318305864425758,-1.0145919413231939]
[null,null,-2.763952095808388,-0.36872830844724347,-0.9295372152580199,-0.3445024043912696,-1.0072390400240199]
[null,null,-2.7514171656686677,-0.3803507196363297,-0.924842327141295,-0.35708167372353083,-0.9998251784928109]
[null,null,-2.7388822355289473,-0.3919133692013141,-0.9200021255634546,-0.36956762112919783,-0.9923489038870419]
[null,null,-2.726347305389227,-0.4034144403907584,-0.9150173710286659,-0.38195945551867716,-0.9848088321248527]
[null,null,-2.7138123752495065,-0.4148521261285676,-0.9098888467536059,-0.39425636887951776,-0.9772036470355232]
[null,null,-2.701277445109786,-0.4262246292979219,-0.9046173585444008,-0.40645753712237653,-0.9695320995138293]
[null,null,-2.6887425149700657,-0.4375301630236442,-0.8992037346700154,-0.4185621209163925,-0.9617930066782776]
[null,null,-2.6762075848303453,-0.4487669509529583,-0.8936488257321133,-0.43056926651404637,-0.9539852510332172]
[null,null,-2.663672654690625,-0.45993322753459354,-0.8879535045314094,-0.4424781065655352,-0.9461077796348345]
[null,null,-2.6511377245509045,-0.4710272382961926,-0.8821186659305322,-0.4542877609227154,-0.938159603261022]
[null,null,-2.638602794411184,-0.4820472401199783,-0.8761452267134211,-0.46599733743266986,-0.930139795585131]
[null,null,-2.6260678642714637,-0.49299150151663684,-0.8700341254412793,-0.4776059327209423,-0.922047492353601]
[null,null,-2.6135329341317433,-0.5038583028973732,-0.8637863223051051,-0.4891126329644788,-0.9138818905674684]
[null,null,-2.600998003992023,-0.5146459368440972,-0.8574027989748234,-0.5005165146543462,-0.9056422476677541]
[null,null,-2.5884630738523025,-0.5253527083776972,-0.8508845584450444,-0.5118166453482546,-0.897327880724732]
[null,null,-2.575928143712582,-0.5359769352243594,-0.8442326248774699,-0.5230120844129466,-0.8889381656310731]
[null,null,-2.5633932135728617,-0.5465169480798906,-0.8374480434399749,-0.534101883756493,-0.8804725362988723]
[null,null,-2.5508582834331412,-0.5569710908720031,-0.8305318801423885,-0.5450850885505532,-0.8719304838605527]
[null,null,-2.538323353293421,-0.5673377210205217,-0.8234852216689992,-0.555960737942637,-0.8633115558736493]
[null,null,-2.5257884231537004,-0.5776152096954685,-0.816309175207813,-0.5667278657584269,-0.85461535552947]
[null,null,-2.51325349301398,-0.5878019420729897,-0.8090048682765894,-0.577385501194204,-0.8458415408656401]
[null,null,-2.5007185628742596,-0.5978963175890804,-0.8015734485456824,-0.5879326694994284,-0.8369898239825206]
[null,null,-2.4881836327345392,-0.6078967501910683,-0.7940160836577166,-0.5983683926495204,-0.8280599702635092]
[null,null,-2.475648702594819,-0.6178016685868195,-0.7863339610441239,-0.6086916900088912,-0.8190517975992198]
[null,null,-2.4631137724550984,-0.6276095164916224,-0.7785282877385714,-0.61890157898428,-0.8099651756155395]
[null,null,-2.450578842315378,-0.637318752872716,-0.7706002901873097,-0.6289970756684277,-0.8008000249055676]
[null,null,-2.4380439121756576,-0.6469278521914197,-0.7625512140564702,-0.6389771954741601,-0.7915563162654298]
[null,null,-2.4255089820359372,-0.6564353046428304,-0.7543823240363433,-0.6488409537589054,-0.7822340699339749]
[null,null,-2.412974051896217,-0.6658396163930461,-0.7460949036426674,-0.658587366439713,-0.7728333548363501]
[null,null,-2.4004391217564964,-0.6751393098138815,-0.7376902550149593,-0.668215450598811,-0.7633542878314528]
[null,null,-2.387904191616776,-0.6843329237150354,-0.7291696987119195,-0.6777242250797568,-0.7537970329632648]
[null,null,-2.3753692614770556,-0.6934190135736775,-0.7205345735039423,-0.6871127110742261,-0.7441618007160641]
[null,null,-2.3628343313373352,-0.7023961517614147,-0.7117862361627653,-0.6963799326994919,-0.7344488472735151]
[null,null,-2.350299401197615,-0.7112629277686036,-0.7029260612482897,-0.7055249175666395,-0.7246584737816391]
[null,null,-2.3377644710578944,{"$f":"SIN(t)","v":-0.7200179484259733},{"$f":"COS(t)","v":-0.6939554408926069},{"$f":"t-t^3/6+t^5/120-t^7/5040","v":-0.714546697339567},{"$f":"1-t^2/2+t^4/24-t^6/720","v":-0.7147910256156642}]
[null,null,-2.325229540918174,-0.7286598381235238,-0.6848757845812626,-0.7234443082848212,-0.7048468916507524]
[null,null,{"$f":"C68+B$12","v":-2.3126946107784536},-0.7371872390266645,-0.6756885189317956,-0.7322167918123147,-0.6948265035366077]
[null,null,-2.300159680638733,-0.7455988112895608,-0.6663950874695834,-0.740863195006978,-0.6847303349759627]
[null,null,-2.287624750499013,-0.7538932332656544,-0.6569969504010331,-0.7493825711513871,-0.6745589010069443]
[null,null,-2.2750898203592924,-0.7620692017153226,-0.6474955843841493,-0.7577739802394232,-0.6643127572893173]
[null,null,-2.262554890219572,-0.770125432010647,-0.6378924822965186,-0.7660364894810096,-0.6539924993946096]
[null,null,-2.2500199600798516,-0.7780606583372578,-0.6281891530007446,-0.7741691737979715,-0.6435987621001149]
[null,null,-2.237485029940131,-0.7858736338932207,-0.6183871211073724,-0.7821711163110774,-0.6331322186867738]
[null,null,-2.224950099800411,-0.7935631310849383,-0.6084879267353372,-0.7900414088182941,-0.6225935802409364]
[null,null,-2.2124151696606904,-0.8011279417200314,-0.5984931252699782,-0.7977791522643242,-0.6119835949600011]
[null,null,-2.19988023952097,-0.8085668771971748,-0.5884042871186518,-0.8053834572014538,-0.6013030474619347]
[null,null,-2.1873453093812496,-0.8158787686928516,-0.5782229974639856,-0.812853444241779,-0.5905527580986716]
[null,null,-2.174810379241529,-0.8230624673450024,-0.5679508560148112,-0.8201882445008422,-0.5797335822733891]
[null,null,-2.162275449101809,-0.8301168444335374,-0.5575894767548132,-0.8273870000327412,-0.5688464097616668]
[null,null,-2.1497405189620884,-0.8370407915576829,-0.547140487688937,-0.8344488642567474,-0.5578921640365202]
[null,null,-2.137205588822368,-0.8438332208101365,-0.5366055305875923,-0.8413730023754942,-0.5468718015973171]
[null,null,-2.1246706586826476,-0.8504930649480019,-0.5259862607286941,-0.8481585917847707,-0.5357863113025704]
[null,null,-2.112135728542927,-0.857019277560476,-0.5152843466375819,-0.854804822474983,-0.5246367137066121]
[null,null,-2.099600798403207,-0.8634108332332642,-0.5045014698248564,-0.8613108974243208,-0.513424060400145]
[null,null,-2.0870658682634864,-0.8696667277096951,-0.4936393245221769,-0.8676760329836812,-0.5021494333546744]
[null,null,-2.074530938123766,-0.8757859780485128,-0.4826996174160592,-0.8738994592534058,-0.49081394427081765]
[null,null,-2.0619960079840456,-0.8817676227783181,-0.47168406737971724,-0.8799804204518653,-0.4794187339304947]
[null,null,-2.049461077844325,-0.887610722048638,-0.46059440520298933,-0.8859181752759531,-0.467964971552996]
[null,null,-2.036926147704605,-0.8933143577775964,-0.4494323733203924,-0.8917119972535299,-0.45645385415493067]
[null,null,-2.0243912175648844,-0.898877633796166,-0.43819972553734626,-0.89736117508787,-0.4448866059140526]
[null,null,-2.011856287425164,-0.9042996759889765,-0.426898226754612,-0.9028650129941582,-0.43326447753696784]
[null,null,-1.9993213572854434,-0.9095796324316574,-0.41552965269098546,-0.9082228310280822,-0.4215887456307172]
[null,null,-1.9867864271457227,-0.9147166735246944,-0.40409578960429354,-0.9134339654065774,-0.4098607120782436]
[null,null,-1.974251497006002,-0.9197099921237787,-0.39259843401073174,-0.9184977688207623,-0.3980817034177323]
[null,null,-1.9617165668662815,-0.9245588036666266,-0.38103939240259166,-0.9234136107411213,-0.3862530702258352]
[null,null,-1.9491816367265609,-0.9292623462962524,-0.36942048096442065,-0.9281808777149806,-0.3743761865047713]
[null,null,-1.9366467065868402,-0.9338198809806731,-0.3577435252876584,-0.9327989736563237,-0.3624524490733075]
[null,null,-1.9241117764471196,-0.9382306916290268,-0.3460103600837956,-0.937267320127999,-0.3504832769616184]
[null,null,-1.911576846307399,-0.9424940852040868,-0.33422282889609967,-0.9415853566163666,-0.3384701108100252]
[null,null,-1.8990419161676784,-0.946609391831153,-0.32238278380995267,-0.9457525407984304,-0.32641441227161294]
[null,null,-1.8865069860279577,-0.9505759649033043,-0.31049208516184745,-0.9497683488015088,-0.3143176634187282]
[null,null,-1.8739720558882371,-0.9543931811829954,-0.29855260124708677,-0.9536322754554889,-0.30218136615335484]
[null,null,-1.8614371257485165,-0.9580604408999811,-0.28656620802623245,-0.9573438345377149,-0.290007041621369]
[null,null,-1.8489021956087959,-0.9615771678455532,-0.27453478883034976,-0.9609025590105569,-0.27779622963067374]
[null,null,-1.8363672654690752,-0.964942809463077,-0.262460234065094,-0.964308001251713,-0.2655504880732123]
[null,null,-1.8238323353293546,-0.9681568369348089,-0.2503444409136854,-0.9675597332772882,-0.2532713923508605]
[null,null,-1.811297405189634,-0.9712187452649869,-0.23818931303881896,-0.9706573469577028,-0.24096053480519855]
[null,null,-1.7987624750499134,-0.9741280533591755,-0.22599676028355656,-0.9736004542264763,-0.22861952415116155]
[null,null,-1.7862275449101928,-0.9768843040998573,-0.2137686983712477,-0.9763886872819374,-0.2162499849145692]
[null,null,-1.7736926147704721,-0.9794870644182562,-0.2015070486045264,-0.979021698781907,-0.20385355687353543]
[null,null,-1.7611576846307515,-0.9819359253623817,-0.18921373756343154,-0.9814991620314045,-0.1914318945037552]
[null,null,-1.7486227544910309,-0.9842305021612854,-0.176890696802698,-0.9838207711634234,-0.178986666427673]
[null,null,-1.7360878243513103,-0.9863704342855162,-0.1645398625482659,-0.9859862413128294,-0.16651955486752762]
[null,null,-1.7235528942115896,-0.988355385503768,-0.15216317539305638,-0.9879953087834237,-0.15403225510227891]
[null,null,-1.711017964071869,-0.9901850439357094,-0.13976257999206076,-0.989847731208225,-0.14152647492841158]
[null,null,-1.6984830339321484,-0.9918591221009865,-0.12734002475679174,-0.9915432877030176,-0.12900393412461805]
[null,null,-1.6859481037924278,-0.9933773569643929,-0.11489746154914415,-0.9930817790132113,-0.11646636392036264]
[null,null,-1.6734131736527071,-0.9947395099771985,-0.1024368453747139,-0.9944630276540664,-0.1039155064683219]
[null,null,-1.6608782435129865,-0.9959453671146304,-0.08996013407562262,-0.9956868780443291,-0.09135311432070606]
[null,null,-1.648343313373266,-0.9969947389095017,-0.07746928802289678,-0.996753196633327,-0.07878094990945936]
[null,null,-1.6358083832335453,-0.9978874604819803,-0.06496626980844955,-0.9976618720215727,-0.06620078503033831]
[null,null,-1.6232734530938246,-0.9986233915654956,-0.05245304393671352,-0.9984128150749269,-0.05361440033087061]
[null,null,-1.610738522954104,-0.9992024165287777,-0.03993157651597309,-0.9990059590323637,-0.04102358480219179]
[null,null,-1.5982035928143834,-0.9996244443940252,-0.027403834949444723,-0.9994412596073942,-0.028430135274762104]
[null,null,-1.5856686626746628,-0.9998894088512001,-0.014871787626153854,-0.9997186950831904,-0.015835855917961713]
[null,null,-1.5731337325349422,-0.9999972682684469,-2.3374036116568086E-3,-0.9998382664014629,-3.2425577435656397E-3]
[null,null,-1.5605988023952215,-0.9999480056986332,0.010197347661343515,-0.9997999972451375,0.009347941886903213]
[null,null,-1.548063872255501,-0.9997416288820129,0.022730496702439672,-0.9996039341148822,0.021933819750940498]
[null,null,-1.5355289421157803,{"$f":"SIN(t)","v":-0.9993781702450102},{"$f":"COS(t)","v":0.03526007427297077},{"$f":"t-t^3/6+t^5/120-t^7/5040","v":-0.9992501463995301},{"$f":"1-t^2/2+t^4/24-t^6/720","v":0.034513247249949065}]
[null,null,-1.5229940119760597,-0.9988576868951243,0.047784111695434006,-0.998738726440451,0.04708439089024772]
[null,null,{"$f":"C132+B$12","v":-1.510459081836339},-0.998180260611957,0.06030064116280801,-0.9980697895899145,0.059645412760201105]
[null,null,-1.4979241516966184,-0.9973459978343624,0.07280769604773948,-0.9972434742635007,0.0721944710034703]
[null,null,-1.4853892215568978,-0.9963550296437241,0.08530331121154439,-0.9962599419865996,0.08472972028838513]
[null,null,-1.4728542914171772,-0.9952075117433588,0.09778552331297533,-0.9951193774350533,0.09724931227343599]
[null,null,-1.4603193612774565,-0.9939036244340514,0.11025237111670644,-0.9938219884699863,0.10975139606888763]
[null,null,-1.447784431137736,-0.9924435725857269,0.12270189580148745,-0.9923680061668751,0.12223411869451374]
[null,null,-1.4352495009980153,-0.9908275856052593,0.1351321412679184,-0.9907576848389036,0.13469562553345188]
[null,null,-1.4227145708582947,-0.9890559174004276,0.14754115444579666,-0.9889913020546537,0.14713406078217947]
[null,null,-1.410179640718574,-0.9871288463400213,0.15992698560098814,-0.9870691586501801,0.15954756789661168]
[null,null,-1.3976447105788534,-0.9850466752101015,0.17228768864177416,-0.9849915787355178,0.17193429003431815]
[null,null,-1.3851097804391328,-0.9828097311664272,0.184621321424626,-0.9827589096956707,0.1842923704928629]
[null,null,-1.3725748502994122,-0.9804183656830517,0.19692594605935942,-0.9803715221861289,0.19661995314426342]
[null,null,-1.3600399201596916,-0.9778729544970981,0.20919962921362042,-0.977829810122966,0.2089151828655717]
[null,null,-1.347504990019971,-0.9751738975497222,0.22144044241665514,-0.975134190667563,0.22117620596557533]
[null,null,-1.3349700598802503,-0.9723216189232732,0.23364646236231598,-0.9722851042060059,0.23340117060762022]
[null,null,-1.3224351297405297,-0.9693165667746608,0.24581577121125595,-0.9692830143232116,0.24558822722855403]
[null,null,-1.309900199600809,-0.9661592132649397,0.25794645689226425,-0.9661284077718223,0.25773552895378987]
[null,null,-1.2973652694610884,-0.9628500544851224,0.2700366134026956,-0.9628217944359239,0.26984123200849186]
[null,null,-1.2848303393213678,-0.9593896103782321,0.2820843411079459,-0.9593637072896343,0.28190349612488114]
[null,null,-1.2722954091816472,-0.9557784246576084,0.2940877470399275,-0.9557547023506098,0.2939204849456625]
[null,null,-1.2597604790419266,-0.9520170647214773,0.3060449451944968,-0.9519953586285204,0.30589036642357215]
[null,null,-1.247225548902206,-0.9481061215638004,0.3179540568277879,-0.9480862780685375,0.31781131321704675]
[null,null,-1.2346906187624853,-0.9440462096814166,0.32981321075140513,-0.9440280854898916,0.32968150308201255]
[null,null,-1.2221556886227647,-0.9398379669774908,0.3416205436264292,-0.9398214285195381,0.34149911925979626]
[null,null,-1.209620758483044,-0.9354820546612848,0.3533742002561888,-0.9354669775209888,0.3532623508611563]
[null,null,-1.1970858283433234,-0.9309791571442668,0.36507233387775434,-0.9309654255183509,0.36496939324643496]
[null,null,-1.1845508982036028,-0.9263299819325751,0.37671310645210515,-0.9263174881156281,0.37661844840183145]
[null,null,-1.1720159680638822,-0.9215352595158525,0.3882946889529271,-0.9215239034113266,0.3882077253117964]
[null,null,-1.1594810379241616,-0.9165957432524705,0.3998152616539934,-0.9165854319084196,0.39973544032754627]
[null,null,-1.146946107784441,-0.9115122092511597,0.41127301441508424,-0.9115028564197157,0.41119981753169965]
[null,null,-1.1344111776447203,-0.9062854562490655,0.42266614696640076,-0.9062769819686814,0.42259908909903376]
[null,null,-1.1218762475049997,-0.9009163054862491,0.4339928691914275,-0.9009086356857654,0.43393149565336214]
[null,null,-1.109341317365279,-0.8954056005766515,0.4452514014082,-0.8953986667002745,0.4451952866205331]
[null,null,-1.0968063872255585,-0.8897542073755436,0.45643997464893266,-0.889747946027848,0.4563887205775495]
[null,null,-1.0842714570858378,-0.8839630138434803,0.46755683093796313,-0.8839573664535813,0.46751006559780833]
[null,null,-1.0717365269461172,-0.8780329299067827,0.47860022356797,-0.8780278424108456,0.4785575995924629]
[null,null,-1.0592015968063966,-0.8719648873145676,0.4895684173744192,-0.8719603098558528,0.48952961064790423]
[null,null,-1.046666666666676,-0.865759839492349,0.5004596890081977,-0.8657557261380152,0.5004243973593641]
[null,null,-1.0341317365269553,-0.8594187613922342,0.5112723272063902,-0.859415069866147,0.5112402691606395]
[null,null,-1.0215968063872347,-0.8529426493397356,0.5220046330611565,-0.8529393407705573,0.5219755466499368]
[null,null,-1.009061876247514,-0.8463325208772274,0.5326549202866687,-0.8463295595610835,0.5326285619118379]
[null,null,-0.9965269461077936,-0.8395894146040654,0.5432215154840635,-0.8395867677811121,0.5431976588353863]
[null,null,-0.9839920159680731,-0.8327143900134004,0.553702758404372,-0.8327120276576376,0.5536811934282952]
[null,null,-0.9714570858283526,-0.8257085273257081,0.564097002209381,-0.8257064219474073,0.5640775341272756]
[null,null,-0.958922155688632,-0.8185729273190621,0.5744026137303881,-0.8185710537791989,0.5743850621044857]
[null,null,-0.9463872255489115,-0.8113087111561769,0.5846179737248104,-0.8113070464922828,0.5846021715701004]
[null,null,-0.933852295409191,-0.8039170202082484,0.5947414771306022,-0.8039155434711156,0.5947272700710035]
[null,null,-0.9213173652694705,-0.7963990158756189,0.6047715333184472,-0.7963977079763129,0.6047587787855986]
[null,null,-0.90878243512975,-0.7887558794052945,0.6147065663416819,-0.7887547229719525,0.6146951328147426]
[null,null,-0.8962475049900295,-0.7809888117053454,0.6245450151839117,-0.7809877909492536,0.6245347814687998]
[null,null,-0.883712574850309,-0.7730990331562161,0.6342853340042822,-0.7730981337466833,0.6342761885508148]
[null,null,-0.8711776447105885,-0.7650877834189761,0.6439259923803651,-0.765086992366537,0.6439178326358105]
[null,null,-0.8586427145708679,-0.7569563212405415,0.6534654755486217,-0.7569556267880422,0.6534582073462025]
[null,null,-0.8461077844311474,-0.7487059242558974,0.6629022846424066,-0.7487053157770353,0.6628958216233377]
[null,null,-0.8335728542914269,-0.7403378887873536,0.6722349369274733,-0.7403373566922578,0.6722291999951518]
[null,null,-0.8210379241517064,-0.7318535296408624,0.6814619660349441,-0.7318530652883226,0.6814568828399488]
[null,null,-0.8085029940119859,-0.7232541798994333,0.6905819221917109,-0.7232537755153972,0.6905774266463007]
[null,null,-0.7959680638722654,-0.714541190713676,0.6995933724482258,-0.714540839315654,0.699589404269069]
[null,null,-0.7834331337325449,-0.7057159310895047,0.7084949009036505,-0.7057156264165368,0.7084914051815456]
[null,null,-0.7708982035928243,-0.6967797876730355,0.7172851089283254,-0.6967795241208883,0.7172820357237165]
[null,null,-0.7583632734531038,-0.6877341645327143,0.7259626153835261,-0.6877339370939926,0.7259599193466448]
[null,null,-0.7458283433133833,-0.6785804829387055,0.7345260568384713,-0.6785802871475767,0.7345236968529752]
[null,null,-0.7332934131736628,{"$f":"SIN(t)","v":-0.6693201811395794},{"$f":"COS(t)","v":0.7429740877845477},{"$f":"t-t^3/6+t^5/120-t^7/5040","v":-0.6693200130208243},{"$f":"1-t^2/2+t^4/24-t^6/720","v":0.7429720266335594}]
[null,null,-0.7207584830339423,-0.6599547141363297,0.7513053808467203,-0.659954570158444,0.751303584900203]
[null,null,{"$f":"C196+B$12","v":-0.7082235528942218},-0.6504855534537616,0.7595186269920926,-0.650485430485848,0.7595170659145316]
[null,null,-0.6956886227545013,-0.6409141869092818,0.7676125357355846,-0.6409140821814834,0.7676111822129799]
[null,null,-0.6831536926147808,-0.6312421183791287,0.7755858353426976,-0.6312420294463703,0.7755846648278997]
[null,null,-0.6706187624750602,-0.6214708675620803,0.7834372730293315,-0.6214707922708897,0.7834362635047908]
{"$rows_left_out":306}
{"sheet":"Sheet3","index":2,"n_rows":0,"n_cols":0,"rows_kept":0}