{"text_format":"3","workbook":"xlsx","n_sheets":3,"sheets":["Sheet1","Sheet2","Sheet3"],"not_rendered":{"charts":1,"images":5,"defined_names":2,"comments":1},"read":"whole","date_system":"1900"}

{"sheet":"Sheet1","index":0,"n_rows":48,"n_cols":17,"rows_kept":48,"merged":[[41,2,41,3]]}
[null,"       The Third Derivative"]
[]
[null,"This DIGMath module lets you investigate "]
[null,"     the properties of the third derivative"]
[null,"      and how it relates to the function "]
[null,null,"and the first two derivatives."]
[]
[]
["This exploration is based on the function f(x) =",{"$nulls":4},"x5-2x4-13x3+14x2+24x"]
[null,"but the results are typical for any function"]
[]
["Now enter the interval for x:  "]
[null,null,"xMin =",-3.5]
[null,null,"xMax =",4]
[]
["Select all the graphs you want to see  "]
[]
[null,true]
[{"$nulls":12},"The graphs of y = f(x) ",null,null,"= x5-2x4-13x3+14x2+24x"]
[null,true,{"$nulls":11},"and its first, second, and third derivatives"]
[]
[null,false,{"$nulls":10},"   Select the point on the curve at x0 =",{"$nulls":3},{"$f":"P24","v":-2}]
[]
[null,true,{"$nulls":12},20,{"$f":"D13+O24*(D14-D13)/100","v":-2}]
[]
[]
["Complete the following statements using your knowledge of derivatives",{"$nulls":11},"The value of the function f(x0) =",{"$nulls":3},{"$f":"LOOKUP(P$24,Sheet2!E$3:E$504,Sheet2!F$3:F$504)","v":48.13141266404287}]
[null,"and your investigations with this DIGMath graphing utility",{"$nulls":10},"The value of derivative f '( x0)  = ",{"$nulls":3},{"$f":"LOOKUP(P24,Sheet2!E3:E504,Sheet2!G3:G504)","v":-43.78327347917167}]
["1.  When f ''' > 0,  f '' is ",{"$nulls":6},"   Item 1",{"$nulls":4},"The value of second derivative f''( x0) = ",{"$nulls":3},{"$f":"LOOKUP(P$24,Sheet2!E$3:E$504,Sheet2!H$3:H$504)","v":-72.77374645810801}]
["2.  When f ''' < 0,  f '' is ",{"$nulls":6},"   Item 2",{"$nulls":4},"The value of third derivative f '''( x0) = ",{"$nulls":3},{"$f":"LOOKUP(P$24,Sheet2!E$3:E$504,Sheet2!I$3:I$504)","v":258.86281329556914}]
{"$rows_left_out":19}
{"sheet":"Sheet2","index":1,"n_rows":504,"n_cols":18,"rows_kept":504}
[{"$nulls":4},"x","f(x)","f '(x)","f ''(x)","f'''(x)",null,"Plotting f",null,"Plotting f'",null,"Plotting f''",null,"Plotting f'''"]
[{"$nulls":5},{"$f":"Sheet1!F11","v":0},{"$nulls":4},"x","y","x","y","x","y","x","y"]
["delta x = ",{"$f":"(Sheet1!D14-Sheet1!D13)/501","v":0.014970059880239521},null,null,{"$f":"Sheet1!D13","v":{"v":-3.5,"d":"-3.50"}},{"$f":"E3^5-2*E3^4-13*E3^3+14*E3^2+24*E3","v":-180.46875},{"$f":"5*E3^4-8*E3^3-39*E3^2+28*E3+24","v":541.5625},{"$f":"20*E3^3-24*E3^2-78*E3+28","v":-850.5},{"$f":"60*E3^2-48*E3-78","v":825},null,{"$f":"IF(Sheet1!$B$18=TRUE,E3,a)","v":-3.5},{"$f":"IF(Sheet1!$B$18=TRUE,F3,0)","v":-180.46875},{"$f":"IF(Sheet1!$B$20=TRUE,$E3,a)","v":-3.5},{"$f":"IF(Sheet1!$B$20=TRUE,G3,0)","v":541.5625},{"$f":"IF(Sheet1!$B$22=TRUE,$E3,a)","v":-3.5},{"$f":"IF(Sheet1!$B$22=TRUE,H3,0)","v":0},{"$f":"IF(Sheet1!$B$24=TRUE,$E3,a)","v":-3.5},{"$f":"IF(Sheet1!$B$24=TRUE,I3,0)","v":825}]
[{"$nulls":4},{"$f":"E3+Sheet2!B$3","v":{"v":-3.4850299401197606,"d":"-3.49"}},{"$f":"E4^5-2*E4^4-13*E4^3+14*E4^2+24*E4","v":-172.45636630558073},{"$f":"5*E4^4-8*E4^3-39*E4^2+28*E4+24","v":528.9226450069568},{"$f":"20*E4^3-24*E4^2-78*E4+28","v":-838.2020735323072},{"$f":"60*E4^2-48*E4-78","v":818.007458137617},null,{"$f":"IF(Sheet1!$B$18=TRUE,E4,a)","v":-3.4850299401197606},{"$f":"IF(Sheet1!$B$18=TRUE,F4,0)","v":-172.45636630558073},{"$f":"IF(Sheet1!$B$20=TRUE,$E4,a)","v":-3.4850299401197606},{"$f":"IF(Sheet1!$B$20=TRUE,G4,0)","v":528.9226450069568},{"$f":"IF(Sheet1!$B$22=TRUE,$E4,a)","v":-3.5},{"$f":"IF(Sheet1!$B$22=TRUE,H4,0)","v":0},{"$f":"IF(Sheet1!$B$24=TRUE,$E4,a)","v":-3.4850299401197606},{"$f":"IF(Sheet1!$B$24=TRUE,I4,0)","v":818.007458137617}]
["Point on f",{"$nulls":3},{"$f":"E4+Sheet2!B$3","v":{"v":-3.4700598802395213,"d":"-3.47"}},-164.6318279041059,516.4661081902477,-826.0086245451658,811.0418085983722,null,{"$f":"IF(Sheet1!$B$18=TRUE,E5,a)","v":-3.4700598802395213},{"$f":"IF(Sheet1!$B$18=TRUE,F5,0)","v":-164.6318279041059},{"$f":"IF(Sheet1!$B$20=TRUE,$E5,a)","v":-3.4700598802395213},{"$f":"IF(Sheet1!$B$20=TRUE,G5,0)","v":516.4661081902477},{"$f":"IF(Sheet1!$B$22=TRUE,$E5,a)","v":-3.5},{"$f":"IF(Sheet1!$B$22=TRUE,H5,0)","v":0},{"$f":"IF(Sheet1!$B$24=TRUE,$E5,a)","v":-3.4700598802395213},{"$f":"IF(Sheet1!$B$24=TRUE,I5,0)","v":811.0418085983722}]
["xl=",{"$f":"Sheet1!P24","v":-2},{"$f":"LOOKUP(Sheet1!P24,Sheet2!E3:E502,Sheet2!F3:F502)","v":48.13141266404287},"\"=yl",{"$f":"E5+Sheet2!B$3","v":{"v":-3.455089820359282,"d":"-3.46"}},-156.99240220330483,504.1913285290535,-813.9192504588875,804.1030513822656,null,{"$f":"IF(Sheet1!$B$18=TRUE,E6,a)","v":-3.455089820359282},{"$f":"IF(Sheet1!$B$18=TRUE,F6,0)","v":-156.99240220330483},{"$f":"IF(Sheet1!$B$20=TRUE,$E6,a)","v":-3.455089820359282},{"$f":"IF(Sheet1!$B$20=TRUE,G6,0)","v":504.1913285290535},{"$f":"IF(Sheet1!$B$22=TRUE,$E6,a)","v":-3.5},{"$f":"IF(Sheet1!$B$22=TRUE,H6,0)","v":0},{"$f":"IF(Sheet1!$B$24=TRUE,$E6,a)","v":-3.455089820359282},{"$f":"IF(Sheet1!$B$24=TRUE,I6,0)","v":804.1030513822656}]
["xr=",{"$f":"B6","v":-2},{"$f":"C6","v":48.13141266404287},"\"=yR",{"$f":"E6+Sheet2!B$3","v":{"v":-3.4401197604790426,"d":"-3.44"}},-149.53537993437183,492.09675102919755,-801.933548693785,797.1911864892971,null,{"$f":"IF(Sheet1!$B$18=TRUE,E7,a)","v":-3.4401197604790426},{"$f":"IF(Sheet1!$B$18=TRUE,F7,0)","v":-149.53537993437183},{"$f":"IF(Sheet1!$B$20=TRUE,$E7,a)","v":-3.4401197604790426},{"$f":"IF(Sheet1!$B$20=TRUE,G7,0)","v":492.09675102919755},{"$f":"IF(Sheet1!$B$22=TRUE,$E7,a)","v":-3.5},{"$f":"IF(Sheet1!$B$22=TRUE,H7,0)","v":0},{"$f":"IF(Sheet1!$B$24=TRUE,$E7,a)","v":-3.4401197604790426},{"$f":"IF(Sheet1!$B$24=TRUE,I7,0)","v":797.1911864892971}]
[{"$nulls":4},{"$f":"E7+Sheet2!B$3","v":{"v":-3.425149700598803,"d":"-3.43"}},-142.25807506174766,480.1808267231446,-790.0511166701706,790.3062139194668,null,{"$f":"IF(Sheet1!$B$18=TRUE,E8,a)","v":-3.425149700598803},{"$f":"IF(Sheet1!$B$18=TRUE,F8,0)","v":-142.25807506174766},{"$f":"IF(Sheet1!$B$20=TRUE,$E8,a)","v":-3.425149700598803},{"$f":"IF(Sheet1!$B$20=TRUE,G8,0)","v":480.1808267231446},{"$f":"IF(Sheet1!$B$22=TRUE,$E8,a)","v":-3.5},{"$f":"IF(Sheet1!$B$22=TRUE,H8,0)","v":0},{"$f":"IF(Sheet1!$B$24=TRUE,$E8,a)","v":-3.425149700598803},{"$f":"IF(Sheet1!$B$24=TRUE,I8,0)","v":790.3062139194668}]
["Point on f'",{"$nulls":3},{"$f":"E8+Sheet2!B$3","v":{"v":-3.410179640718564,"d":"-3.41"}},-135.1578246929002,468.44201267000204,-778.2715518083565,783.4481336727747,null,{"$f":"IF(Sheet1!$B$18=TRUE,E9,a)","v":-3.410179640718564},{"$f":"IF(Sheet1!$B$18=TRUE,F9,0)","v":-135.1578246929002},{"$f":"IF(Sheet1!$B$20=TRUE,$E9,a)","v":-3.410179640718564},{"$f":"IF(Sheet1!$B$20=TRUE,G9,0)","v":468.44201267000204},{"$f":"IF(Sheet1!$B$22=TRUE,$E9,a)","v":-3.5},{"$f":"IF(Sheet1!$B$22=TRUE,H9,0)","v":0},{"$f":"IF(Sheet1!$B$24=TRUE,$E9,a)","v":-3.410179640718564},{"$f":"IF(Sheet1!$B$24=TRUE,I9,0)","v":783.4481336727747}]
["x =",{"$f":"B6","v":-2},{"$f":"LOOKUP(Sheet1!P$24,Sheet2!E3:E503,Sheet2!G$3:G503)","v":-43.78327347917167},"= y",{"$f":"E9+Sheet2!B$3","v":{"v":-3.3952095808383245,"d":"-3.40"}},-128.23198898810602,456.87877195551897,-766.5944515286551,776.6169457492206,null,{"$f":"IF(Sheet1!$B$18=TRUE,E10,a)","v":-3.3952095808383245},{"$f":"IF(Sheet1!$B$18=TRUE,F10,0)","v":-128.23198898810602},{"$f":"IF(Sheet1!$B$20=TRUE,$E10,a)","v":-3.3952095808383245},{"$f":"IF(Sheet1!$B$20=TRUE,G10,0)","v":456.87877195551897},{"$f":"IF(Sheet1!$B$22=TRUE,$E10,a)","v":-3.5},{"$f":"IF(Sheet1!$B$22=TRUE,H10,0)","v":0},{"$f":"IF(Sheet1!$B$24=TRUE,$E10,a)","v":-3.3952095808383245},{"$f":"IF(Sheet1!$B$24=TRUE,I10,0)","v":776.6169457492206}]
[{"$nulls":4},{"$f":"E10+Sheet2!B$3","v":{"v":-3.380239520958085,"d":"-3.38"}},-121.4779510702295,445.4895736920865,-755.0194132513784,769.8126501488048,null,{"$f":"IF(Sheet1!$B$18=TRUE,E11,a)","v":-3.380239520958085},{"$f":"IF(Sheet1!$B$18=TRUE,F11,0)","v":-121.4779510702295},{"$f":"IF(Sheet1!$B$20=TRUE,$E11,a)","v":-3.380239520958085},{"$f":"IF(Sheet1!$B$20=TRUE,G11,0)","v":445.4895736920865},{"$f":"IF(Sheet1!$B$22=TRUE,$E11,a)","v":-3.5},{"$f":"IF(Sheet1!$B$22=TRUE,H11,0)","v":0},{"$f":"IF(Sheet1!$B$24=TRUE,$E11,a)","v":-3.380239520958085},{"$f":"IF(Sheet1!$B$24=TRUE,I11,0)","v":769.8126501488048}]
[{"$nulls":4},{"$f":"E11+Sheet2!B$3","v":{"v":-3.3652694610778457,"d":"-3.37"}},-114.89311693450487,434.27289301873776,-743.5460343968391,763.0352468715271,null,{"$f":"IF(Sheet1!$B$18=TRUE,E12,a)","v":-3.3652694610778457},{"$f":"IF(Sheet1!$B$18=TRUE,F12,0)","v":-114.89311693450487},{"$f":"IF(Sheet1!$B$20=TRUE,$E12,a)","v":-3.3652694610778457},{"$f":"IF(Sheet1!$B$20=TRUE,G12,0)","v":434.27289301873776},{"$f":"IF(Sheet1!$B$22=TRUE,$E12,a)","v":-3.5},{"$f":"IF(Sheet1!$B$22=TRUE,H12,0)","v":0},{"$f":"IF(Sheet1!$B$24=TRUE,$E12,a)","v":-3.3652694610778457},{"$f":"IF(Sheet1!$B$24=TRUE,I12,0)","v":763.0352468715271}]
["Point on f''",{"$nulls":3},{"$f":"E12+Sheet2!B$3","v":{"v":-3.3502994011976064,"d":"-3.35"}},-108.47491535831702,423.22721110114816,-732.1739123853492,756.2847359173875,null,{"$f":"IF(Sheet1!$B$18=TRUE,E13,a)","v":-3.3502994011976064},{"$f":"IF(Sheet1!$B$18=TRUE,F13,0)","v":-108.47491535831702},{"$f":"IF(Sheet1!$B$20=TRUE,$E13,a)","v":-3.3502994011976064},{"$f":"IF(Sheet1!$B$20=TRUE,G13,0)","v":423.22721110114816},{"$f":"IF(Sheet1!$B$22=TRUE,$E13,a)","v":-3.5},{"$f":"IF(Sheet1!$B$22=TRUE,H13,0)","v":0},{"$f":"IF(Sheet1!$B$24=TRUE,$E13,a)","v":-3.3502994011976064},{"$f":"IF(Sheet1!$B$24=TRUE,I13,0)","v":756.2847359173875}]
["x =",{"$f":"B6","v":-2},{"$f":"LOOKUP(Sheet1!P$24,Sheet2!E$3:E$503,Sheet2!H$3:H$503)","v":-72.77374645810801},"= y",{"$f":"E13+Sheet2!B$3","v":{"v":-3.335329341317367,"d":"-3.34"}},-102.22079781098161,412.3510151316349,-720.9026446372212,749.5611172863861,null,{"$f":"IF(Sheet1!$B$18=TRUE,E14,a)","v":-3.335329341317367},{"$f":"IF(Sheet1!$B$18=TRUE,F14,0)","v":-102.22079781098161},{"$f":"IF(Sheet1!$B$20=TRUE,$E14,a)","v":-3.335329341317367},{"$f":"IF(Sheet1!$B$20=TRUE,G14,0)","v":412.3510151316349},{"$f":"IF(Sheet1!$B$22=TRUE,$E14,a)","v":-3.5},{"$f":"IF(Sheet1!$B$22=TRUE,H14,0)","v":0},{"$f":"IF(Sheet1!$B$24=TRUE,$E14,a)","v":-3.335329341317367},{"$f":"IF(Sheet1!$B$24=TRUE,I14,0)","v":749.5611172863861}]
[{"$nulls":4},{"$f":"E14+Sheet2!B$3","v":{"v":-3.3203592814371277,"d":"-3.32"}},-96.12823836352695,401.6427983291576,-709.7318285727674,742.8643909785229,null,{"$f":"IF(Sheet1!$B$18=TRUE,E15,a)","v":-3.3203592814371277},{"$f":"IF(Sheet1!$B$18=TRUE,F15,0)","v":-96.12823836352695},{"$f":"IF(Sheet1!$B$20=TRUE,$E15,a)","v":-3.3203592814371277},{"$f":"IF(Sheet1!$B$20=TRUE,G15,0)","v":401.6427983291576},{"$f":"IF(Sheet1!$B$22=TRUE,$E15,a)","v":-3.5},{"$f":"IF(Sheet1!$B$22=TRUE,H15,0)","v":0},{"$f":"IF(Sheet1!$B$24=TRUE,$E15,a)","v":-3.3203592814371277},{"$f":"IF(Sheet1!$B$24=TRUE,I15,0)","v":742.8643909785229}]
[{"$nulls":4},{"$f":"E15+Sheet2!B$3","v":{"v":-3.3053892215568883,"d":"-3.31"}},-90.19473359847329,391.1010599393169,-698.6610616122999,736.1945569937977,null,{"$f":"IF(Sheet1!$B$18=TRUE,E16,a)","v":-3.3053892215568883},{"$f":"IF(Sheet1!$B$18=TRUE,F16,0)","v":-90.19473359847329},{"$f":"IF(Sheet1!$B$20=TRUE,$E16,a)","v":-3.3053892215568883},{"$f":"IF(Sheet1!$B$20=TRUE,G16,0)","v":391.1010599393169},{"$f":"IF(Sheet1!$B$22=TRUE,$E16,a)","v":-3.5},{"$f":"IF(Sheet1!$B$22=TRUE,H16,0)","v":0},{"$f":"IF(Sheet1!$B$24=TRUE,$E16,a)","v":-3.3053892215568883},{"$f":"IF(Sheet1!$B$24=TRUE,I16,0)","v":736.1945569937977}]
["Point on f'''",{"$nulls":3},{"$f":"E16+Sheet2!B$3","v":{"v":-3.290419161676649,"d":"-3.29"}},-84.41780251961552,380.72430523435685,-687.6899411761312,729.5516153322108,null,{"$f":"IF(Sheet1!$B$18=TRUE,E17,a)","v":-3.290419161676649},{"$f":"IF(Sheet1!$B$18=TRUE,F17,0)","v":-84.41780251961552},{"$f":"IF(Sheet1!$B$20=TRUE,$E17,a)","v":-3.290419161676649},{"$f":"IF(Sheet1!$B$20=TRUE,G17,0)","v":380.72430523435685},{"$f":"IF(Sheet1!$B$22=TRUE,$E17,a)","v":-3.5},{"$f":"IF(Sheet1!$B$22=TRUE,H17,0)","v":0},{"$f":"IF(Sheet1!$B$24=TRUE,$E17,a)","v":-3.290419161676649},{"$f":"IF(Sheet1!$B$24=TRUE,I17,0)","v":729.5516153322108}]
["x =",{"$f":"B6","v":-2},{"$f":"LOOKUP(Sheet1!P$24,Sheet2!E$3:E$503,Sheet2!I$3:I$503)","v":258.86281329556914},"= y",{"$f":"E17+Sheet2!B$3","v":{"v":-3.2754491017964096,"d":"-3.28"}},-78.79498646180174,370.51104551316246,-676.8180646845736,722.935565993762,null,{"$f":"IF(Sheet1!$B$18=TRUE,E18,a)","v":-3.2754491017964096},{"$f":"IF(Sheet1!$B$18=TRUE,F18,0)","v":-78.79498646180174},{"$f":"IF(Sheet1!$B$20=TRUE,$E18,a)","v":-3.2754491017964096},{"$f":"IF(Sheet1!$B$20=TRUE,G18,0)","v":370.51104551316246},{"$f":"IF(Sheet1!$B$22=TRUE,$E18,a)","v":-3.5},{"$f":"IF(Sheet1!$B$22=TRUE,H18,0)","v":0},{"$f":"IF(Sheet1!$B$24=TRUE,$E18,a)","v":-3.2754491017964096},{"$f":"IF(Sheet1!$B$24=TRUE,I18,0)","v":722.935565993762}]
[{"$nulls":4},{"$f":"E18+Sheet2!B$3","v":{"v":-3.26047904191617,"d":"-3.26"}},-73.32384900071645,360.45979810126136,-666.0450295579392,716.3464089784514,null,{"$f":"IF(Sheet1!$B$18=TRUE,E19,a)","v":-3.26047904191617},{"$f":"IF(Sheet1!$B$18=TRUE,F19,0)","v":-73.32384900071645},{"$f":"IF(Sheet1!$B$20=TRUE,$E19,a)","v":-3.26047904191617},{"$f":"IF(Sheet1!$B$20=TRUE,G19,0)","v":360.45979810126136},{"$f":"IF(Sheet1!$B$22=TRUE,$E19,a)","v":-3.5},{"$f":"IF(Sheet1!$B$22=TRUE,H19,0)","v":0},{"$f":"IF(Sheet1!$B$24=TRUE,$E19,a)","v":-3.26047904191617},{"$f":"IF(Sheet1!$B$24=TRUE,I19,0)","v":716.3464089784514}]
[{"$nulls":4},{"$f":"E19+Sheet2!B$3","v":{"v":-3.245508982035931,"d":"-3.25"}},-68.00197586265939,350.569086350823,-655.3704332165406,709.784144286279,null,{"$f":"IF(Sheet1!$B$18=TRUE,E20,a)","v":-3.245508982035931},{"$f":"IF(Sheet1!$B$18=TRUE,F20,0)","v":-68.00197586265939},{"$f":"IF(Sheet1!$B$20=TRUE,$E20,a)","v":-3.245508982035931},{"$f":"IF(Sheet1!$B$20=TRUE,G20,0)","v":350.569086350823},{"$f":"IF(Sheet1!$B$22=TRUE,$E20,a)","v":-3.5},{"$f":"IF(Sheet1!$B$22=TRUE,H20,0)","v":0},{"$f":"IF(Sheet1!$B$24=TRUE,$E20,a)","v":-3.245508982035931},{"$f":"IF(Sheet1!$B$24=TRUE,I20,0)","v":709.784144286279}]
[{"$nulls":4},{"$f":"E20+Sheet2!B$3","v":{"v":-3.2305389221556915,"d":"-3.23"}},-62.82697483432767,340.8374396406588,-644.79387308069,703.2487719172445,null,{"$f":"IF(Sheet1!$B$18=TRUE,E21,a)","v":-3.2305389221556915},{"$f":"IF(Sheet1!$B$18=TRUE,F21,0)","v":-62.82697483432767},{"$f":"IF(Sheet1!$B$20=TRUE,$E21,a)","v":-3.2305389221556915},{"$f":"IF(Sheet1!$B$20=TRUE,G21,0)","v":340.8374396406588},{"$f":"IF(Sheet1!$B$22=TRUE,$E21,a)","v":-3.5},{"$f":"IF(Sheet1!$B$22=TRUE,H21,0)","v":0},{"$f":"IF(Sheet1!$B$24=TRUE,$E21,a)","v":-3.2305389221556915},{"$f":"IF(Sheet1!$B$24=TRUE,I21,0)","v":703.2487719172445}]
[{"$nulls":4},{"$f":"E21+Sheet2!B$3","v":{"v":-3.215568862275452,"d":"-3.22"}},-57.79647567259586,331.2633933762223,-634.3149465706995,696.7402918713484,null,{"$f":"IF(Sheet1!$B$18=TRUE,E22,a)","v":-3.215568862275452},{"$f":"IF(Sheet1!$B$18=TRUE,F22,0)","v":-57.79647567259586},{"$f":"IF(Sheet1!$B$20=TRUE,$E22,a)","v":-3.215568862275452},{"$f":"IF(Sheet1!$B$20=TRUE,G22,0)","v":331.2633933762223},{"$f":"IF(Sheet1!$B$22=TRUE,$E22,a)","v":-3.5},{"$f":"IF(Sheet1!$B$22=TRUE,H22,0)","v":0},{"$f":"IF(Sheet1!$B$24=TRUE,$E22,a)","v":-3.215568862275452},{"$f":"IF(Sheet1!$B$24=TRUE,I22,0)","v":696.7402918713484}]
["vertical lines",{"$nulls":3},{"$f":"E22+Sheet2!B$3","v":{"v":-3.2005988023952128,"d":"-3.20"}},-52.90813001429652,321.8454889896093,-623.9332511068817,690.2587041485905,null,{"$f":"IF(Sheet1!$B$18=TRUE,E23,a)","v":-3.2005988023952128},{"$f":"IF(Sheet1!$B$18=TRUE,F23,0)","v":-52.90813001429652},{"$f":"IF(Sheet1!$B$20=TRUE,$E23,a)","v":-3.2005988023952128},{"$f":"IF(Sheet1!$B$20=TRUE,G23,0)","v":321.8454889896093},{"$f":"IF(Sheet1!$B$22=TRUE,$E23,a)","v":-3.5},{"$f":"IF(Sheet1!$B$22=TRUE,H23,0)","v":0},{"$f":"IF(Sheet1!$B$24=TRUE,$E23,a)","v":-3.2005988023952128},{"$f":"IF(Sheet1!$B$24=TRUE,I23,0)","v":690.2587041485905}]
["vertical",{"$f":"Sheet1!P24","v":-2},{"$f":"MIN(LOOKUP(Sheet1!P24,Sheet2!E3:E504:'Sheet2'!F3:F504),LOOKUP(Sheet1!P24,Sheet2!E3:E504:'Sheet2'!G3:G504),LOOKUP(Sheet1!P24,Sheet2!E3:E504,Sheet2!H3:H504), LOOKUP(Sheet1!P24,Sheet2!E3:E504,Sheet2!I3:I504))","v":-72.77374645810801},"= ymin",{"$f":"E23+Sheet2!B$3","v":{"v":-3.1856287425149734,"d":"-3.19"}},-48.15961128600226,312.5822739395569,-613.6483841095485,683.8040087489705,null,{"$f":"IF(Sheet1!$B$18=TRUE,E24,a)","v":-3.1856287425149734},{"$f":"IF(Sheet1!$B$18=TRUE,F24,0)","v":-48.15961128600226},{"$f":"IF(Sheet1!$B$20=TRUE,$E24,a)","v":-3.1856287425149734},{"$f":"IF(Sheet1!$B$20=TRUE,G24,0)","v":312.5822739395569},{"$f":"IF(Sheet1!$B$22=TRUE,$E24,a)","v":-3.5},{"$f":"IF(Sheet1!$B$22=TRUE,H24,0)","v":0},{"$f":"IF(Sheet1!$B$24=TRUE,$E24,a)","v":-3.1856287425149734},{"$f":"IF(Sheet1!$B$24=TRUE,I24,0)","v":683.8040087489705}]
[null,{"$f":"Sheet1!P24","v":-2},{"$f":"MAX(LOOKUP(Sheet1!P24,Sheet2!E3:E505:'Sheet2'!F3:F505),LOOKUP(Sheet1!P24,Sheet2!E3:E505:'Sheet2'!G3:G505),LOOKUP(Sheet1!P24,Sheet2!E3:E505,Sheet2!H3:H505), LOOKUP(Sheet1!P24,Sheet2!E3:E505,Sheet2!I3:I505))","v":258.86281329556914},"= ymax",{"$f":"E24+Sheet2!B$3","v":{"v":-3.170658682634734,"d":"-3.17"}},-43.54861461380568,303.4723017114453,-603.4599429990128,677.3762056724888,null,{"$f":"IF(Sheet1!$B$18=TRUE,E25,a)","v":-3.170658682634734},{"$f":"IF(Sheet1!$B$18=TRUE,F25,0)","v":-43.54861461380568},{"$f":"IF(Sheet1!$B$20=TRUE,$E25,a)","v":-3.170658682634734},{"$f":"IF(Sheet1!$B$20=TRUE,G25,0)","v":303.4723017114453},{"$f":"IF(Sheet1!$B$22=TRUE,$E25,a)","v":-3.5},{"$f":"IF(Sheet1!$B$22=TRUE,H25,0)","v":0},{"$f":"IF(Sheet1!$B$24=TRUE,$E25,a)","v":-3.170658682634734},{"$f":"IF(Sheet1!$B$24=TRUE,I25,0)","v":677.3762056724888}]
[{"$nulls":4},{"$f":"E25+Sheet2!B$3","v":{"v":-3.1556886227544947,"d":"-3.16"}},-39.07285673309964,294.5141318172958,-593.3675251955864,670.9752949191453,null,{"$f":"IF(Sheet1!$B$18=TRUE,E26,a)","v":-3.1556886227544947},{"$f":"IF(Sheet1!$B$18=TRUE,F26,0)","v":-39.07285673309964},{"$f":"IF(Sheet1!$B$20=TRUE,$E26,a)","v":-3.1556886227544947},{"$f":"IF(Sheet1!$B$20=TRUE,G26,0)","v":294.5141318172958},{"$f":"IF(Sheet1!$B$22=TRUE,$E26,a)","v":-3.5},{"$f":"IF(Sheet1!$B$22=TRUE,H26,0)","v":0},{"$f":"IF(Sheet1!$B$24=TRUE,$E26,a)","v":-3.1556886227544947},{"$f":"IF(Sheet1!$B$24=TRUE,I26,0)","v":670.9752949191453}]
[{"$nulls":4},{"$f":"E26+Sheet2!B$3","v":{"v":-3.1407185628742553,"d":"-3.14"}},-34.73007589835905,285.70632979577215,-583.3707281195817,664.6012764889399,null,{"$f":"IF(Sheet1!$B$18=TRUE,E27,a)","v":-3.1407185628742553},{"$f":"IF(Sheet1!$B$18=TRUE,F27,0)","v":-34.73007589835905},{"$f":"IF(Sheet1!$B$20=TRUE,$E27,a)","v":-3.1407185628742553},{"$f":"IF(Sheet1!$B$20=TRUE,G27,0)","v":285.70632979577215},{"$f":"IF(Sheet1!$B$22=TRUE,$E27,a)","v":-3.5},{"$f":"IF(Sheet1!$B$22=TRUE,H27,0)","v":0},{"$f":"IF(Sheet1!$B$24=TRUE,$E27,a)","v":-3.1407185628742553},{"$f":"IF(Sheet1!$B$24=TRUE,I27,0)","v":664.6012764889399}]
[{"$nulls":4},{"$f":"E27+Sheet2!B$3","v":{"v":-3.125748502994016,"d":"-3.13"}},-30.518031792921576,277.0474672121799,-573.4691491913111,658.2541503818727,null,{"$f":"IF(Sheet1!$B$18=TRUE,E28,a)","v":-3.125748502994016},{"$f":"IF(Sheet1!$B$18=TRUE,F28,0)","v":-30.518031792921576},{"$f":"IF(Sheet1!$B$20=TRUE,$E28,a)","v":-3.125748502994016},{"$f":"IF(Sheet1!$B$20=TRUE,G28,0)","v":277.0474672121799},{"$f":"IF(Sheet1!$B$22=TRUE,$E28,a)","v":-3.5},{"$f":"IF(Sheet1!$B$22=TRUE,H28,0)","v":0},{"$f":"IF(Sheet1!$B$24=TRUE,$E28,a)","v":-3.125748502994016},{"$f":"IF(Sheet1!$B$24=TRUE,I28,0)","v":658.2541503818727}]
[{"$nulls":4},{"$f":"E28+Sheet2!B$3","v":{"v":-3.1107784431137766,"d":"-3.11"}},-26.434505438768014,268.5361216584674,-563.6623858310872,651.9339165979436,null,{"$f":"IF(Sheet1!$B$18=TRUE,E29,a)","v":-3.1107784431137766},{"$f":"IF(Sheet1!$B$18=TRUE,F29,0)","v":-26.434505438768014},{"$f":"IF(Sheet1!$B$20=TRUE,$E29,a)","v":-3.1107784431137766},{"$f":"IF(Sheet1!$B$20=TRUE,G29,0)","v":268.5361216584674},{"$f":"IF(Sheet1!$B$22=TRUE,$E29,a)","v":-3.5},{"$f":"IF(Sheet1!$B$22=TRUE,H29,0)","v":0},{"$f":"IF(Sheet1!$B$24=TRUE,$E29,a)","v":-3.1107784431137766},{"$f":"IF(Sheet1!$B$24=TRUE,I29,0)","v":651.9339165979436}]
[{"$nulls":4},{"$f":"E29+Sheet2!B$3","v":{"v":-3.0958083832335372,"d":"-3.10"}},-22.477299106303107,260.17087675322375,-553.9500354592217,645.6405751371526,null,{"$f":"IF(Sheet1!$B$18=TRUE,E30,a)","v":-3.0958083832335372},{"$f":"IF(Sheet1!$B$18=TRUE,F30,0)","v":-22.477299106303107},{"$f":"IF(Sheet1!$B$20=TRUE,$E30,a)","v":-3.0958083832335372},{"$f":"IF(Sheet1!$B$20=TRUE,G30,0)","v":260.17087675322375},{"$f":"IF(Sheet1!$B$22=TRUE,$E30,a)","v":-3.5},{"$f":"IF(Sheet1!$B$22=TRUE,H30,0)","v":0},{"$f":"IF(Sheet1!$B$24=TRUE,$E30,a)","v":-3.0958083832335372},{"$f":"IF(Sheet1!$B$24=TRUE,I30,0)","v":645.6405751371526}]
{"$rows_left_out":475}
{"sheet":"Sheet3","index":2,"n_rows":0,"n_cols":0,"rows_kept":0}