{"text_format":"3","workbook":"xlsx","n_sheets":3,"sheets":["Cars","Sheet2","Sheet1"],"not_rendered":{"charts":4,"images":6,"macros":1,"defined_names":27,"comments":1},"read":"whole","date_system":"1900"}

{"sheet":"Cars","index":0,"n_rows":38,"n_cols":18,"rows_kept":38,"merged":[[31,2,31,3]]}
[null," Two Car Related Rate Problem"]
[]
[null,"   This DIGMath module lets you investigate "]
[null,"  the related rates calculus problem of finding"]
[null,"the rate ds/dt at which the distance s between"]
[null,"       two cars approaching an intersection"]
[null,"             at different speeds changes."]
[]
[]
["How fast, dx/dt, is the east-bound car going (20-60 mph)?"]
[{"$nulls":3},3,{"$f":"#REF!+D11*(#REF!-#REF!)/100","v":{"$error":"#REF!"}},{"$f":"5*D11","v":15},"mph"]
[]
["How fast, dy/dt, is the north-bound car going (20-60 mph)?"]
[{"$nulls":3},5,{"$f":"#REF!+D14*(#REF!-#REF!)/100","v":{"$error":"#REF!"}},{"$f":"5*D14","v":25},"mph"]
[]
["How far is the east-bound car from the intersection (0.5 - 10 miles)?"]
[{"$nulls":3},10,{"$f":"#REF!+D17*(#REF!-#REF!)/100","v":{"$error":"#REF!"}},{"$f":"D17/2","v":5},"miles"]
[]
["How far is the north-bound car from the intersection (0.5 - 10 miles)?"]
[{"$nulls":3},10,{"$f":"#REF!+D20*(#REF!-#REF!)/100","v":{"$error":"#REF!"}},{"$f":"D20/2","v":5},"miles"]
[]
[]
["Click each item below for suggestions and investigations",{"$nulls":10},"    Select the time t since the start:  t =",{"$nulls":3},{"$f":"O24/2","v":8.5},"minutes "]
[null,null,"   Item 1",{"$nulls":11},17,{"$f":"Sheet2!#REF!+O24*(Sheet2!#REF!-Sheet2!#REF!)/100","v":{"$error":"#REF!"}}]
[null,null,"   Item 2"]
[null,null,"   Item 3",{"$nulls":9},"       The east-bound car is",null,{"$f":"LOOKUP(t00+0.01,Sheet2!B3:B123,Sheet2!C3:C123)","v":2.8749999999999902},"miles from the intersection"]
[null,null,"   Item 4",{"$nulls":10},"        traveling at",{"$f":"Area","v":15},"mph"]
[]
[{"$nulls":12},"     The north-bound car is",null,{"$f":"LOOKUP(t00+0.01,Sheet2!B6:B123,Sheet2!D6:D123)","v":1.4583333333333328},"miles from the intersection"]
[{"$nulls":13},"        traveling at",{"$f":"H","v":25},"mph"]
["To access/download all the DIGMath Apps for Calculus"]
["     Click this link:",null,"DIGMath for Calculus",{"$nulls":9},"   The distance between them is",null,null,{"$f":"LOOKUP(t00,Sheet2!B3:B123,Sheet2!E3:E123)","v":{"v":3.2237185223141074,"d":"3.22"}},"miles."]
[]
["Created by:  Sheldon P. Gordon   ",{"$nulls":8},"    The distance between them is decreasing at a rate of",{"$nulls":6},{"$f":"-LOOKUP(t00,Sheet2!B3:B123, Sheet2!F3:F123)","v":0.4103970652945632},"miles per hour"]
["                      Farmingdale State College    "]
["Development of this module was supported by the "]
["NSF's Division of Undergraduate Education  "]
["under grants DUE-0310123 and DUE-0442160."]

{"sheet":"Sheet2","index":1,"n_rows":1004,"n_cols":17,"rows_kept":1004}
[null,"t","x","y","Distance s","ds/dt",null,null,"East car",{"$f":"-xx","v":-5},0,{"$nulls":3},"Horizontal car"]
[{"$nulls":8},"North Car",0,{"$f":"-yy","v":-5},{"$nulls":3},"rate =",{"$f":"Area","v":15},{"$f":"P2/120","v":0.125}]
[0,{"$f":"0","v":{"v":0,"d":"0.00"}},{"$f":"xx","v":{"v":5,"d":"5.0"}},{"$f":"yy","v":5},{"$f":"SQRT(C3^2+D3^2)","v":{"v":7.0710678118654755,"d":"7.07"}},{"$f":"(E4-E3)/dt","v":{"v":-0.4713056524628012,"d":"-0.471"}}]
[1,{"$f":"B3+dt","v":{"v":0.1,"d":"0.10"}},{"$f":"IF(B4<=time,C3-Area/60*dt,0)","v":{"v":4.975,"d":"5.0"}},{"$f":"D3-H/60*dt","v":{"v":4.958333333333333,"d":"4.96"}},{"$f":"SQRT(C4^2+D4^2)","v":{"v":7.023937246619195,"d":"7.02"}},{"v":-0.4711052445451891,"d":"-0.471"},null,null,"intersection",0,0]
[2,{"v":0.2,"d":"0.20"},{"v":4.949999999999999,"d":"5.0"},{"v":4.916666666666666,"d":"4.92"},{"v":6.9768267221646765,"d":"6.98"},{"v":-0.47090074931970705,"d":"-0.471"},{"$nulls":3},0,0,{"$nulls":3},"Vertical car"]
[3,{"v":0.30000000000000004,"d":"0.30"},{"v":4.924999999999999,"d":"4.9"},{"v":4.874999999999999,"d":"4.88"},{"v":6.929736647232706,"d":"6.93"},{"v":-0.47069205672632286,"d":"-0.471"},{"$nulls":8},"rate =",{"$f":"rateNorth","v":25},{"$f":"P6/120","v":0.20833333333333334}]
[4,{"v":0.4,"d":"0.40"},{"v":4.899999999999999,"d":"4.9"},{"v":4.833333333333332,"d":"4.83"},{"v":6.8826674415600735,"d":"6.88"},{"v":-0.47047905304093973,"d":"-0.470"},null,null,"East car",{"$f":"J1","v":-5},{"$f":"K1","v":0}]
[5,{"v":0.5,"d":"0.50"},{"v":4.874999999999998,"d":"4.9"},{"v":4.791666666666665,"d":"4.79"},{"v":6.8356195362559795,"d":"6.84"},{"v":-0.4702616207308008,"d":"-0.470"},null,null,"North car",{"$f":"J2","v":0},{"$f":"K2","v":-5}]
[6,{"v":0.6,"d":"0.60"},{"v":4.849999999999998,"d":"4.9"},{"v":4.749999999999998,"d":"4.75"},{"v":6.788593374182899,"d":"6.79"},{"v":-0.47003963830342776,"d":"-0.470"},{"$nulls":6},"Hor. car time",{"$f":"xx/Area","v":0.3333333333333333},"hrs = ",{"$f":"N9*60","v":20},"min"]
[7,{"v":0.7,"d":"0.70"},{"v":4.8249999999999975,"d":"4.8"},{"v":4.708333333333331,"d":"4.71"},{"v":6.741589410352557,"d":"6.74"},{"v":-0.46981298014856954,"d":"-0.470"},{"$nulls":6},"Vert car time",{"$f":"yy/H","v":0.2},"hrs = ",{"$f":"N10*60","v":12},"min"]
[8,{"v":0.7999999999999999,"d":"0.80"},{"v":4.799999999999997,"d":"4.8"},{"v":4.666666666666664,"d":"4.67"},{"v":6.6946081123377,"d":"6.69"},{"v":-0.4695815163730632,"d":"-0.470"},null,null,"First Chart"]
[9,{"v":0.8999999999999999,"d":"0.90"},{"v":4.774999999999997,"d":"4.8"},{"v":4.624999999999997,"d":"4.63"},{"v":6.647649960700393,"d":"6.65"},{"v":-0.4693451126278081,"d":"-0.469"},null,null,"Vertical Line",{"$nulls":3},"total time =",{"$f":"MIN(P9:P10)","v":12},"mins"]
[10,{"v":0.9999999999999999,"d":"1.00"},{"v":4.7499999999999964,"d":"4.8"},{"v":4.58333333333333,"d":"4.58"},{"v":6.600715449437613,"d":"6.60"},{"v":-0.46910362992712784,"d":"-0.469"},{"$nulls":3},{"$f":"I17","v":8.5},0,null,"dt = ",{"$f":"time/120","v":0.1}]
[11,{"v":1.0999999999999999,"d":"1.10"},{"v":4.724999999999996,"d":"4.7"},{"v":4.541666666666663,"d":"4.54"},{"v":6.5538050864449,"d":"6.55"},{"v":-0.4688569244592866,"d":"-0.469"},{"$nulls":3},{"$f":"I17","v":8.5},{"$f":"K3","v":{"v":0,"d":"0.00"}},null,"dx =",{"$f":"-Area/120","v":-0.125},null,{"$f":"H","v":25}]
[12,{"v":1.2,"d":"1.20"},{"v":4.699999999999996,"d":"4.7"},{"v":4.4999999999999964,"d":"4.50"},{"v":6.506919393998971,"d":"6.51"},{"v":-0.4686048473885229,"d":"-0.469"},{"$nulls":6},"dy =",{"$f":"Area/120","v":0.125}]
[13,{"v":1.3,"d":"1.30"},{"v":4.674999999999995,"d":"4.7"},{"v":4.4583333333333295,"d":"4.46"},{"v":6.460058909260119,"d":"6.46"},{"v":-0.4683472446473935,"d":"-0.468"},null,null,"Point"]
[14,{"v":1.4000000000000001,"d":"1.40"},{"v":4.649999999999995,"d":"4.7"},{"v":4.4166666666666625,"d":"4.42"},{"v":6.4132241847953795,"d":"6.41"},{"v":-0.4680839567196493,"d":"-0.468"},null,null,{"$f":"x0","v":8.5},0,null,null,"Horiz speed = ",{"$f":"Area","v":15},"mph =",{"$f":"N17/120","v":0.125},"miles/half minute"]
[15,{"v":1.5000000000000002,"d":"1.50"},{"v":4.624999999999995,"d":"4.6"},{"v":4.374999999999996,"d":"4.38"},{"v":6.3664157891234145,"d":"6.37"},{"v":-0.46781481841253303,"d":"-0.468"},{"$nulls":8},"="]
[16,{"v":1.6000000000000003,"d":"1.60"},{"v":4.599999999999994,"d":"4.6"},{"v":4.333333333333329,"d":"4.33"},{"v":6.319634307282161,"d":"6.32"},{"v":-0.46753965861827673,"d":"-0.468"},{"$nulls":3},0,{"$f":"-Cars!$O$29","v":-1.4583333333333328}]
[17,{"v":1.7000000000000004,"d":"1.70"},{"v":4.574999999999994,"d":"4.6"},{"v":4.291666666666662,"d":"4.29"},{"v":6.272880341420334,"d":"6.27"},{"v":-0.4672583000641506,"d":"-0.467"},{"$nulls":3},{"$f":"-Cars!$O$26","v":-2.8749999999999902},0]
[18,{"v":1.8000000000000005,"d":"1.80"},{"v":4.549999999999994,"d":"4.5"},{"v":4.249999999999995,"d":"4.25"},{"v":6.2261545114139185,"d":"6.23"},{"v":-0.4669705590503437,"d":"-0.467"}]
[19,{"v":1.9000000000000006,"d":"1.90"},{"v":4.524999999999993,"d":"4.5"},{"v":4.208333333333328,"d":"4.21"},{"v":6.179457455508884,"d":"6.18"},{"v":-0.4666762451752682,"d":"-0.467"},null,null,"Second Chart"]
[20,{"v":2.0000000000000004,"d":"2.00"},{"v":4.499999999999993,"d":"4.5"},{"v":4.166666666666661,"d":"4.17"},{"v":6.132789830991357,"d":"6.13"},{"v":-0.4663751610472744,"d":"-0.466"},null,null,"Vertical Line",{"$nulls":3},"rate =",{"$f":"LOOKUP(t00, B3:B122,F3:F122)","v":-0.4103970652945632}]
[21,{"v":2.1000000000000005,"d":"2.10"},{"v":4.4749999999999925,"d":"4.5"},{"v":4.124999999999994,"d":"4.12"},{"v":6.08615231488663,"d":"6.09"},{"v":-0.4660671019822882,"d":"-0.466"},{"$nulls":3},{"$f":"t00","v":8.5},0,0]
[22,{"v":2.2000000000000006,"d":"2.20"},{"v":4.449999999999992,"d":"4.4"},{"v":4.083333333333327,"d":"4.08"},{"v":6.039545604688401,"d":"6.04"},{"v":-0.46575185568654476,"d":"-0.466"},{"$nulls":3},{"$f":"I38","v":8.5},{"$f":"LOOKUP(t00,B3:B123,C3:C1233)","v":2.8749999999999902},{"$f":"LOOKUP(t00,B3:B123,D3:D1233)","v":1.4583333333333328}]
[23,{"v":2.3000000000000007,"d":"2.30"},{"v":4.424999999999992,"d":"4.4"},{"v":4.04166666666666,"d":"4.04"},{"v":5.992970419119747,"d":"5.99"},{"v":-0.4654292019235484,"d":"-0.465"},{"$nulls":8},{"$f":"LOOKUP(t00,Sheet2!C3:C123,Sheet2!E3:E123)","v":{"v":1.9999999999999933,"d":"2.0"}}]
[24,{"v":2.400000000000001,"d":"2.40"},{"v":4.3999999999999915,"d":"4.4"},{"v":3.9999999999999933,"d":"4.00"},{"v":5.946427498927392,"d":"5.95"},{"v":-0.46509891216445887,"d":"-0.465"},null,null,"Third Chart"]
[25,{"v":2.500000000000001,"d":"2.50"},{"v":4.374999999999991,"d":"4.4"},{"v":3.958333333333327,"d":"3.96"},{"v":5.899917607710946,"d":"5.90"},{"v":-0.4647607492208117,"d":"-0.465"},null,null,"Vertical Line"]
[26,{"v":2.600000000000001,"d":"2.60"},{"v":4.349999999999991,"d":"4.3"},{"v":3.9166666666666603,"d":"3.92"},{"v":5.853441532788865,"d":"5.85"},{"v":-0.4644144668589778,"d":"-0.464"},{"$nulls":3},{"$f":"t00","v":8.5},0]
[27,{"v":2.700000000000001,"d":"2.70"},{"v":4.32499999999999,"d":"4.3"},{"v":3.874999999999994,"d":"3.87"},{"v":5.807000086102967,"d":"5.81"},{"v":-0.46405980939480784,"d":"-0.464"},{"$nulls":3},{"$f":"J29","v":8.5},{"$f":"LOOKUP(t00,B3:B123,E3:E123)","v":3.2237185223141074}]
[28,{"v":2.800000000000001,"d":"2.80"},{"v":4.29999999999999,"d":"4.3"},{"v":3.8333333333333273,"d":"3.83"},{"v":5.760594105163486,"d":"5.76"},{"v":-0.46369651126790146,"d":"-0.464"}]
[29,{"v":2.9000000000000012,"d":"2.90"},{"v":4.27499999999999,"d":"4.3"},{"v":3.7916666666666607,"d":"3.79"},{"v":5.714224454036696,"d":"5.71"},{"v":-0.46332429659391217,"d":"-0.463"},null,null,"Fourth Chart"]
[30,{"v":3.0000000000000013,"d":"3.00"},{"v":4.249999999999989,"d":"4.2"},{"v":3.7499999999999942,"d":"3.75"},{"v":5.667892024377305,"d":"5.67"},{"v":-0.46294287869383943,"d":"-0.463"},null,null,"Vertical Line"]
[31,{"v":3.1000000000000014,"d":"3.10"},{"v":4.224999999999989,"d":"4.2"},{"v":3.7083333333333277,"d":"3.71"},{"v":5.621597736507921,"d":"5.62"},{"v":-0.46255195959913564,"d":"-0.463"},{"$nulls":3},{"$f":"LOOKUP(t00,B3:B123,B3:B122)","v":8.499999999999986},0]
[32,{"v":3.2000000000000015,"d":"3.20"},{"v":4.199999999999989,"d":"4.2"},{"v":3.666666666666661,"d":"3.67"},{"v":5.575342540548007,"d":"5.58"},{"v":-0.4621512295308783,"d":"-0.462"},{"$nulls":3},{"$f":"J34","v":8.499999999999986},{"$f":"N23","v":-0.4103970652945632}]
[33,{"$f":"B35+dt","v":{"v":3.3000000000000016,"d":"3.30"}},{"$f":"IF(B36<=time,C35-Area/60*dt,0)","v":{"v":4.174999999999988,"d":"4.2"}},{"$f":"D35-H/60*dt","v":{"v":3.6249999999999947,"d":"3.62"}},{"v":5.529127417594919,"d":"5.53"},{"v":-0.461740366351977,"d":"-0.462"}]
[34,{"v":3.4000000000000017,"d":"3.40"},{"v":4.149999999999988,"d":"4.1"},{"v":3.583333333333328,"d":"3.58"},{"v":5.482953380959722,"d":"5.48"},{"v":-0.4613190349905061,"d":"-0.461"},null,null,"Point"]
[35,{"v":3.5000000000000018,"d":"3.50"},{"v":4.124999999999988,"d":"4.1"},{"v":3.5416666666666616,"d":"3.54"},{"v":5.436821477460671,"d":"5.44"},{"v":-0.46088688683262546,"d":"-0.461"},null,null,{"$f":"x0","v":8.5},0]
[36,{"v":3.600000000000002,"d":"3.60"},{"v":4.099999999999987,"d":"4.1"},{"v":3.499999999999995,"d":"3.50"},{"v":5.390732788777409,"d":"5.39"},{"v":-0.46044355908350987,"d":"-0.460"}]
[37,{"v":3.700000000000002,"d":"3.70"},{"v":4.074999999999987,"d":"4.1"},{"v":3.4583333333333286,"d":"3.46"},{"v":5.344688432869058,"d":"5.34"},{"v":-0.45998867409408284,"d":"-0.460"},null,null,"Point on curve"]
[38,{"v":3.800000000000002,"d":"3.80"},{"v":4.0499999999999865,"d":"4.0"},{"v":3.416666666666662,"d":"3.42"},{"v":5.298689565459649,"d":"5.30"},{"v":-0.4595218386518596,"d":"-0.460"},null,null,"x=",{"$f":"I17*J11","v":0}]
[39,{"v":3.900000000000002,"d":"3.90"},{"v":4.024999999999986,"d":"4.0"},{"v":3.3749999999999956,"d":"3.38"},{"v":5.252737381594463,"d":"5.25"},{"v":-0.4590426432337402,"d":"-0.459"},null,null,{"$f":"x0","v":8.5},{"$f":"LOOKUP(x0,C3:C84,D3:D84)","v":1.6249999999999998}]
[40,{"v":4.000000000000002,"d":"4.00"},{"v":3.9999999999999862,"d":"4.0"},{"v":3.333333333333329,"d":"3.33"},{"v":5.206833117271089,"d":"5.21"},{"v":-0.45855066121839094,"d":"-0.459"}]
[41,{"v":4.100000000000001,"d":"4.10"},{"v":3.9749999999999863,"d":"4.0"},{"v":3.2916666666666625,"d":"3.29"},{"v":5.16097805114925,"d":"5.16"},{"v":-0.4580454480561258,"d":"-0.458"}]
[42,{"v":4.200000000000001,"d":"4.20"},{"v":3.9499999999999864,"d":"3.9"},{"v":3.249999999999996,"d":"3.25"},{"v":5.115173506343638,"d":"5.12"},{"v":-0.4575265403933848,"d":"-0.458"}]
[43,{"v":4.300000000000001,"d":"4.30"},{"v":3.9249999999999865,"d":"3.9"},{"v":3.2083333333333295,"d":"3.21"},{"v":5.069420852304299,"d":"5.07"},{"v":-0.4569934551496946,"d":"-0.457"}]
[44,{"v":4.4,"d":"4.40"},{"v":3.8999999999999866,"d":"3.9"},{"v":3.166666666666663,"d":"3.17"},{"v":5.02372150678933,"d":"5.02"},{"v":-0.45644568854372736,"d":"-0.456"}]
[45,{"v":4.5,"d":"4.50"},{"v":3.8749999999999867,"d":"3.9"},{"v":3.1249999999999964,"d":"3.13"},{"v":4.978076937934957,"d":"4.98"},{"v":-0.45588271506587397,"d":"-0.456"}]
[46,{"v":4.6,"d":"4.60"},{"v":3.8499999999999868,"d":"3.8"},{"v":3.08333333333333,"d":"3.08"},{"v":4.93248866642837,"d":"4.93"},{"v":-0.4553039863939734,"d":"-0.455"}]
[47,{"v":4.699999999999999,"d":"4.70"},{"v":3.824999999999987,"d":"3.8"},{"v":3.0416666666666634,"d":"3.04"},{"v":4.886958267788972,"d":"4.89"},{"v":-0.45470893024902814,"d":"-0.455"}]
[48,{"v":4.799999999999999,"d":"4.80"},{"v":3.799999999999987,"d":"3.8"},{"v":2.999999999999997,"d":"3.00"},{"v":4.841487374764069,"d":"4.84"},{"v":-0.454096949186944,"d":"-0.454"}]
[49,{"v":4.899999999999999,"d":"4.90"},{"v":3.774999999999987,"d":"3.8"},{"v":2.9583333333333304,"d":"2.96"},{"v":4.796077679845375,"d":"4.80"},{"v":-0.45346741932311474,"d":"-0.453"}]
[50,{"v":4.999999999999998,"d":"5.00"},{"v":3.749999999999987,"d":"3.7"},{"v":2.916666666666664,"d":"2.92"},{"v":4.750730937913064,"d":"4.75"},{"v":-0.45281968898534863,"d":"-0.453"}]
[51,{"v":5.099999999999998,"d":"5.10"},{"v":3.724999999999987,"d":"3.7"},{"v":2.8749999999999973,"d":"2.88"},{"v":4.705448969014529,"d":"4.71"},{"v":-0.45215307729113086,"d":"-0.452"}]
[52,{"v":5.1999999999999975,"d":"5.20"},{"v":3.6999999999999873,"d":"3.7"},{"v":2.833333333333331,"d":"2.83"},{"v":4.660233661285416,"d":"4.66"},{"v":-0.4514668726448434,"d":"-0.451"}]
[53,{"v":5.299999999999997,"d":"5.30"},{"v":3.6749999999999874,"d":"3.7"},{"v":2.7916666666666643,"d":"2.79"},{"v":4.615086974020931,"d":"4.62"},{"v":-0.4507603311500219,"d":"-0.451"}]
[54,{"v":5.399999999999997,"d":"5.40"},{"v":3.6499999999999875,"d":"3.6"},{"v":2.749999999999998,"d":"2.75"},{"v":4.570010940905929,"d":"4.57"},{"v":-0.45003267493171073,"d":"-0.450"}]
[55,{"v":5.4999999999999964,"d":"5.50"},{"v":3.6249999999999876,"d":"3.6"},{"v":2.7083333333333313,"d":"2.71"},{"v":4.525007673412758,"d":"4.53"},{"v":-0.4492830903638456,"d":"-0.449"}]
[56,{"v":5.599999999999996,"d":"5.60"},{"v":3.5999999999999877,"d":"3.6"},{"v":2.6666666666666647,"d":"2.67"},{"v":4.480079364376373,"d":"4.48"},{"v":-0.44851072619578325,"d":"-0.449"}]
[57,{"v":5.699999999999996,"d":"5.70"},{"v":3.5749999999999877,"d":"3.6"},{"v":2.6249999999999982,"d":"2.63"},{"v":4.435228291756795,"d":"4.44"},{"v":-0.4477146915723562,"d":"-0.448"}]
[58,{"v":5.799999999999995,"d":"5.80"},{"v":3.549999999999988,"d":"3.5"},{"v":2.5833333333333317,"d":"2.58"},{"v":4.3904568225995595,"d":"4.39"},{"v":-0.446894053941298,"d":"-0.447"}]
[59,{"v":5.899999999999995,"d":"5.90"},{"v":3.524999999999988,"d":"3.5"},{"v":2.541666666666665,"d":"2.54"},{"v":4.34576741720543,"d":"4.35"},{"v":-0.44604783684127014,"d":"-0.446"}]
[60,{"v":5.999999999999995,"d":"6.00"},{"v":3.499999999999988,"d":"3.5"},{"v":2.4999999999999987,"d":"2.50"},{"v":4.301162633521303,"d":"4.30"},{"v":-0.44517501756418554,"d":"-0.445"}]
[61,{"v":6.099999999999994,"d":"6.10"},{"v":3.474999999999988,"d":"3.5"},{"v":2.458333333333332,"d":"2.46"},{"v":4.256645131764884,"d":"4.26"},{"v":-0.44427452468419837,"d":"-0.444"}]
[62,{"v":6.199999999999994,"d":"6.20"},{"v":3.449999999999988,"d":"3.4"},{"v":2.4166666666666656,"d":"2.42"},{"v":4.212217679296464,"d":"4.21"},{"v":-0.4433452354462464,"d":"-0.443"}]
[63,{"v":6.299999999999994,"d":"6.30"},{"v":3.4249999999999883,"d":"3.4"},{"v":2.374999999999999,"d":"2.38"},{"v":4.16788315575184,"d":"4.17"},{"v":-0.4423859730061963,"d":"-0.442"}]
[64,{"v":6.399999999999993,"d":"6.40"},{"v":3.3999999999999884,"d":"3.4"},{"v":2.3333333333333326,"d":"2.33"},{"v":4.12364455845122,"d":"4.12"},{"$f":"(E68-E67)/dt","v":{"v":-0.44139550351459,"d":"-0.441"}}]
[65,{"$f":"B67+dt","v":{"v":6.499999999999993,"d":"6.50"}},{"$f":"IF(B68<=time,C67-Area/60*dt,0)","v":{"v":3.3749999999999885,"d":"3.4"}},{"$f":"D67-H/60*dt","v":{"v":2.291666666666666,"d":"2.29"}},{"$f":"SQRT(C68^2+D68^2)","v":{"v":4.079505008099761,"d":"4.08"}},{"v":-0.44037253303556234,"d":"-0.440"}]
[66,{"v":6.5999999999999925,"d":"6.60"},{"v":3.3499999999999885,"d":"3.3"},{"v":2.2499999999999996,"d":"2.25"},{"v":4.035467754796205,"d":"4.04"},{"v":-0.4393157042920892,"d":"-0.439"}]
[67,{"v":6.699999999999992,"d":"6.70"},{"v":3.3249999999999886,"d":"3.3"},{"v":2.208333333333333,"d":"2.21"},{"v":3.991536184366996,"d":"3.99"},{"v":-0.4382235932288969,"d":"-0.438"}]
[68,{"v":6.799999999999992,"d":"6.80"},{"v":3.2999999999999887,"d":"3.3"},{"v":2.1666666666666665,"d":"2.17"},{"v":3.947713825044106,"d":"3.95"},{"v":-0.43709470538347617,"d":"-0.437"}]
[69,{"v":6.8999999999999915,"d":"6.90"},{"v":3.274999999999989,"d":"3.3"},{"v":2.125,"d":"2.13"},{"v":3.9040043545057586,"d":"3.90"},{"v":-0.4359274720561146,"d":"-0.436"}]
[70,{"v":6.999999999999991,"d":"7.00"},{"v":3.249999999999989,"d":"3.2"},{"v":2.0833333333333335,"d":"2.08"},{"v":3.860411607300147,"d":"3.86"},{"v":-0.4347202462691513,"d":"-0.435"}]
[71,{"v":7.099999999999991,"d":"7.10"},{"v":3.224999999999989,"d":"3.2"},{"v":2.041666666666667,"d":"2.04"},{"v":3.816939582673232,"d":"3.82"},{"v":-0.4334712985059941,"d":"-0.433"}]
[72,{"v":7.19999999999999,"d":"7.20"},{"v":3.199999999999989,"d":"3.2"},{"v":2.0000000000000004,"d":"2.00"},{"v":3.7735924528226326,"d":"3.77"},{"v":-0.43217881222030297,"d":"-0.432"}]
[73,{"v":7.29999999999999,"d":"7.30"},{"v":3.174999999999989,"d":"3.2"},{"v":1.9583333333333337,"d":"1.96"},{"v":3.7303745716006023,"d":"3.73"},{"v":-0.4308408791057383,"d":"-0.431"}]
[74,{"v":7.39999999999999,"d":"7.40"},{"v":3.1499999999999893,"d":"3.1"},{"v":1.916666666666667,"d":"1.92"},{"v":3.6872904836900284,"d":"3.69"},{"v":-0.42945549411725015,"d":"-0.429"}]
[75,{"v":7.499999999999989,"d":"7.50"},{"v":3.1249999999999893,"d":"3.1"},{"v":1.8750000000000002,"d":"1.88"},{"v":3.6443449342783034,"d":"3.64"},{"v":-0.4280205502349066,"d":"-0.428"}]
[76,{"v":7.599999999999989,"d":"7.60"},{"v":3.0999999999999894,"d":"3.1"},{"v":1.8333333333333335,"d":"1.83"},{"v":3.6015428792548128,"d":"3.60"},{"v":-0.426533832962237,"d":"-0.427"}]
[77,{"v":7.699999999999989,"d":"7.70"},{"v":3.0749999999999895,"d":"3.1"},{"v":1.7916666666666667,"d":"1.79"},{"v":3.558889495958589,"d":"3.56"},{"v":-0.42499301455149574,"d":"-0.425"}]
{"$rows_left_out":762}
{"sheet":"Sheet1","index":2,"n_rows":0,"n_cols":0,"rows_kept":0}