{"text_format":"3","workbook":"xlsx","n_sheets":3,"sheets":["Sheet1","Sheet2","Sheet3"],"not_rendered":{"charts":3,"images":3,"macros":1,"defined_names":7,"comments":1},"read":"whole","date_system":"1900"}

{"sheet":"Sheet1","index":0,"n_rows":40,"n_cols":16,"rows_kept":40,"merged":[[33,2,33,3]]}
[null,"     Viewing Angle Problem"]
[]
[null,"This DIGMath module lets you investigate "]
[null,"         the calculus problem of finding"]
[null,"         the maximum viewing angle a"]
[null," for viewing a painting hanging on a wall"]
[null,null,"    as a function of the"]
[null,"            distance x from the wall."]
[]
["How high H above eye level"]
[null,"   is the painting (1 - 10 feet)?",{"$nulls":3},{"$f":"D12","v":5}]
[{"$nulls":3},5,{"$f":"#REF!+D12*(#REF!-#REF!)/100","v":{"$error":"#REF!"}}]
[]
[{"$nulls":9},"      The graph of the function a =",{"$nulls":3},{"$f":"\"Arctan (\" & TEXT(RR + s,\"0\") & \"/x) - Arctan (\" & TEXT(s,\"0\") & \"/x)\"","v":"Arctan (7/x) - Arctan (2/x)"}]
["How tall T is the painting (1 - 6 feet)?",{"$nulls":4},{"$f":"D16","v":2}]
[{"$nulls":3},2,{"$f":"#REF!+D16*(#REF!-#REF!)/100","v":{"$error":"#REF!"}},{"$nulls":5},"  Select a distance from the wall: x0 =",{"$nulls":3},{"$f":"N18/20","v":8.25},"feet"]
[]
[{"$nulls":13},165,{"$f":"Sheet2!G7+N18*(Sheet2!G8-Sheet2!G7)/100","v":1650}]
[]
[{"$nulls":11},"The value of the derivative there is a' = ",{"$nulls":3},{"$f":"Sheet2!H28","v":-0.03204343088829303}]
[{"$f":"\"At a distance of \"&TEXT(x0,\"0\") &\" feet from the wall, \"","v":"At a distance of 8 feet from the wall, "}]
[]
[{"$f":"\"   the viewing angle = \"&TEXT(Sheet2!J10,\"0.00\") &\" radians = \" &TEXT(Sheet2!J11,\"0.00\") & \" degrees \"","v":"   the viewing angle = 0.47 radians = 26.69 degrees "}]
[]
[]
["Click each item below for suggestions and investigations"]
[null,"   Item 1"]
[null,"   Item 2"]
[null,"   Item 3"]
[]
[]
[]
["To access/download all the DIGMath Apps for Calculus"]
["     Click this link:",null,"DIGMath for Calculus"]
[]
["Created by:  Sheldon P. Gordon   "]
["                      Farmingdale State College    "]
["Development of this module was supported by the "]
["NSF's Division of Undergraduate Education  "]
["under grants DUE-0310123 and DUE-0442160."]

{"sheet":"Sheet2","index":1,"n_rows":1003,"n_cols":11,"rows_kept":1003}
[null,"x","f(x)",null,null,"xl=",{"$f":"IF(Sheet1!$O$18<Sheet2!G7+80*Sheet2!G5,Sheet2!G7,Sheet1!O18-80*Sheet2!G5)","v":1570},{"$f":"LOOKUP(Sheet1!O18,Sheet2!B3:B1002,Sheet2!C3:C1002)+LOOKUP(Sheet1!O18,Sheet2!B3:B1002,Sheet2!D3:D1002)*(G1-Sheet1!O18)","v":0.2553147455457464},"\"=yl"]
[{"$nulls":5},"xr=",{"$f":"IF(Sheet1!$O$18>Sheet2!G8-80*Sheet2!G5,Sheet2!G8,Sheet1!O18+80*Sheet2!G5)","v":1000},{"$f":"LOOKUP(Sheet1!O18,Sheet2!B3:B1003,Sheet2!C3:C1003)+LOOKUP(Sheet1!O18,Sheet2!B3:B1003,Sheet2!D3:D1003)*(G2-Sheet1!O18)","v":1.3649616561601878},"\"=yR"]
[0,{"v":1E-3,"d":"0.0"},{"$f":"ATAN((RR+s)/x)-ATAN(s/x)","v":3.5714281644794177E-4},{"$f":"s/(x^2+s^2)-(RR+s)/(x^2+(RR+s)^2)","v":0.3571427350583402}]
[1,{"v":0.05,"d":"0.1"},0.017852057949506728,0.35683784059125073]
[2,{"$f":"B4+0.05","v":0.1},0.03567365313454607,0.35592512292010237,null,"delta x = ",{"$f":"(xMax-xMin)/1000","v":1}]
[3,{"$f":"B5+0.05","v":{"v":0.15000000000000002,"d":"0.2"}},0.053434555262232175,0.35441165652394935]
[4,0.2,0.07110499465240183,0.3523088850483743,null,"xMin =",0]
[5,{"v":0.25,"d":"0.3"},0.08865588186743745,0.3496325330720236,null,"xMax =",1000]
[6,0.3,0.10605901494076986,0.3464023217671649]
[7,{"v":0.35,"d":"0.4"},0.12328727073042223,0.34264161998192605,{"$nulls":4},"alpha =",{"$f":"LOOKUP(x0,B3:B1003:C3:C1003)","v":0.46577785532200217},"radians"]
[8,{"v":0.39999999999999997,"d":"0.4"},0.1403147774436162,0.3383770419978719,null,"Point",{"$nulls":3},{"$f":"180/PI()*J10","v":26.687105300605793},"degrees"]
[9,{"v":0.44999999999999996,"d":"0.5"},0.15711706597465835,0.3336380044578366,null,{"$f":"1000-x0","v":991.75},0]
[10,{"v":0.49999999999999994,"d":"0.5"},0.17367119834157374,0.3284562555986862]
[11,{"v":0.5499999999999999,"d":"0.6"},0.18995587216726517,0.322865389970448,null,"Horizontal Line"]
[12,0.6,0.2059515007996624,0.3169003613221715,null,0,0]
[13,{"v":0.65,"d":"0.7"},0.22164026927678737,0.31059700536104384,null,{"$f":"F12","v":991.75},0]
[14,{"v":0.7000000000000001,"d":"0.7"},0.23700616689556497,0.3039915827408385]
[15,{"v":0.7500000000000001,"d":"0.8"},0.25203499762143666,0.2971203510166007,null,"Diagnonal Line"]
[16,{"v":0.8000000000000002,"d":"0.8"},0.26671436996865694,0.29001917252493814,null,0,200]
[17,{"v":0.8500000000000002,"d":"0.9"},0.2810336682833843,0.2827231633181947,null,997,0]
[18,{"v":0.9000000000000002,"d":"0.9"},0.29498400757294085,0.2752663864890325]
[19,{"v":0.9500000000000003,"d":"1.0"},0.30855817414893894,0.26768159154614624]
[20,{"v":1.0000000000000002,"d":"1.0"},0.32175055439664235,0.26,null,"Point on curve"]
[21,{"v":1.0500000000000003,"d":"1.1"},0.33455705395770186,0.2522511360285642,null,"x=",{"$f":"F12*G5","v":991.75}]
[22,{"v":1.1000000000000003,"d":"1.1"},0.3469750095295383,0.2444627000379595,null,{"$f":"x0","v":8.25},{"$f":"LOOKUP(20*F25,A3:A1003,C3:C1003)","v":0.46577785532200217}]
[23,{"v":1.1500000000000004,"d":"1.2"},0.35900309535399333,0.2366604821167443]
[24,{"v":1.2000000000000004,"d":"1.2"},0.37064122630224583,0.2288683117973596,null,{"$f":"x0","v":8.25},0,0]
[25,{"v":1.2500000000000004,"d":"1.3"},0.3818904592735257,0.22110804016610874,null,{"$f":"x0","v":8.25},{"$f":"LOOKUP(20*F25,A3:A1003,C3:C1003)","v":0.46577785532200217},{"$f":"LOOKUP(20*F25,A3:A1003,D3:D1003)","v":-0.03204343088829303}]
[26,{"v":1.3000000000000005,"d":"1.3"},0.39275289442190364,0.2133995501794046]
[27,{"v":1.3500000000000005,"d":"1.4"},0.40323157751712213,0.2057607910203472]
[28,{"v":1.4000000000000006,"d":"1.4"},0.4133304045393281,0.19820783243602028]
[29,{"v":1.4500000000000006,"d":"1.5"},0.42305402940938197,0.19075493520274497]
[30,{"v":1.5000000000000007,"d":"1.5"},0.432407775570538,0.18341463414634135]
[31,{"v":1.5500000000000007,"d":"1.6"},0.44139755196668573,0.17619783047258097]
[32,{"v":1.6000000000000008,"d":"1.6"},0.45002977380891007,0.16911389051826892]
[33,{"v":1.6500000000000008,"d":"1.7"},0.4583112883867655,0.16217074839823123]
[34,{"v":1.7000000000000008,"d":"1.7"},0.4662493060634729,0.15537501038397333]
[35,{"v":1.7500000000000009,"d":"1.8"},0.4738513364947604,0.14873205919535945]
[36,{"v":1.800000000000001,"d":"1.8"},0.4811251300283199,0.14224615670978807]
[37,{"v":1.850000000000001,"d":"1.9"},0.4880786241735845,0.13592054388905997]
[38,{"v":1.900000000000001,"d":"1.9"},0.4947198949783165,0.12975753698964]
[39,{"v":1.950000000000001,"d":"2.0"},0.501057113107763,0.12375861935624541]
[40,{"v":2.000000000000001,"d":"2.0"},0.5070985043923371,0.11792452830188668]
[41,{"v":2.0500000000000007,"d":"2.1"},0.5128523145894007,0.11225533675090049]
[42,{"v":2.1000000000000005,"d":"2.1"},0.5183267780923,0.10675052946704208]
[43,{"v":2.1500000000000004,"d":"2.2"},0.5235300903140024,0.1014090738087059]
[44,2.2,0.5284703834723192,0.09622948505039233]
[45,{"v":2.25,"d":"2.3"},0.53315570550763,0.09120988638628663]
[46,2.3,0.5375940018713854,0.08634806379089616]
[47,{"v":2.3499999999999996,"d":"2.4"},0.5417930999335524,0.08164151595558963]
[48,{"v":2.3999999999999995,"d":"2.4"},0.5457606957689397,0.07708749955094663]
[49,{"v":2.4499999999999993,"d":"2.5"},0.5495043430953888,0.07268307008516728]
[50,{"v":2.499999999999999,"d":"2.5"},0.5530314441506405,0.06842511864032672]
[51,{"v":2.549999999999999,"d":"2.6"},0.556349242308923,0.06431040477266844]
[52,{"v":2.5999999999999988,"d":"2.6"},0.5594648162526005,0.060335585861872265]
[53,{"v":2.6499999999999986,"d":"2.7"},0.5623850755283446,0.05649724318857777]
[54,{"v":2.6999999999999984,"d":"2.7"},0.5651167573310402,0.052791905010447546]
[55,{"v":2.7499999999999982,"d":"2.8"},0.5676664243718796,0.049216066895625035]
[56,{"v":2.799999999999998,"d":"2.8"},0.5700404636997101,0.04576620955931314]
[57,{"v":2.849999999999998,"d":"2.9"},0.5722450863566437,0.042438814434984304]
[58,{"v":2.8999999999999977,"d":"2.9"},0.5742863277601385,0.0392303771969188]
[59,{"v":2.9499999999999975,"d":"3.0"},0.5761700487142236,0.03613741943574633]
[60,{"v":2.9999999999999973,"d":"3.0"},0.5779019369622455,0.03315649867374022]
[61,{"v":3.049999999999997,"d":"3.1"},0.5794875092024929,0.030284216892015756]
[62,{"v":3.099999999999997,"d":"3.1"},0.5809321134962965,0.02751722772768768]
[63,{"v":3.149999999999997,"d":"3.2"},0.5822409320057781,0.024852242485569997]
[64,{"v":3.1999999999999966,"d":"3.2"},{"$f":"ATAN((RR+s)/x)-ATAN(s/x)","v":0.5834189840053177},{"$f":"s/(x^2+s^2)-(RR+s)/(x^2+(RR+s)^2)","v":0.022286035096237902}]
[65,{"v":3.2499999999999964,"d":"3.3"},0.5844711291171049,0.01981544614026652]
[66,{"v":3.2999999999999963,"d":"3.3"},0.5854020707268397,0.017437386047243042]
[67,{"$f":"B69+0.05","v":{"v":3.349999999999996,"d":"3.4"}},0.5862163595408204,0.01514883756772109]
[68,{"v":3.399999999999996,"d":"3.4"},0.5869183972503155,0.012946857606639856]
[69,{"v":3.4499999999999957,"d":"3.5"},0.587512440273319,0.010828578497846741]
[70,{"v":3.4999999999999956,"d":"3.5"},0.5880026035475676,8.791208791208982E-3]
[71,{"v":3.5499999999999954,"d":"3.6"},0.5883928643520725,0.006832033616343269]
[72,{"v":3.599999999999995,"d":"3.6"},0.5886870661374628,0.004948414680195551]
[73,{"v":3.649999999999995,"d":"3.7"},0.5888889223481277,0.003137789949521186]
[74,{"v":3.699999999999995,"d":"3.7"},0.5890020202215631,1.3976730637112605E-3]
[75,{"v":3.7499999999999947,"d":"3.7"},0.5890298245524699,-2.7434748166142719E-4]
[76,{"v":3.7999999999999945,"d":"3.8"},0.5889756814110509,-1.8806093447818611E-3]
[77,{"v":3.8499999999999943,"d":"3.8"},0.5888428218066442,-0.003423377509349207]
[78,{"v":3.899999999999994,"d":"3.9"},0.5886343652893091,-0.004904845590190984]
[79,{"v":3.949999999999994,"d":"3.9"},0.5883533234833074,-0.006327137248108031]
[80,{"v":3.999999999999994,"d":"4.0"},0.5880026035475676,-0.007692307692307526]
[81,{"v":4.049999999999994,"d":"4.0"},0.5875850115592376,-0.009002345251453117]
[82,{"v":4.099999999999993,"d":"4.1"},0.5871032558173199,-0.010259172996746613]
[83,{"v":4.149999999999993,"d":"4.1"},0.5865599500641578,-0.011464650402584958]
[84,{"v":4.199999999999993,"d":"4.2"},0.5859576166232137,-0.012620575032230838]
[85,{"v":4.249999999999993,"d":"4.2"},0.5852986894521688,-0.013728684237622232]
[86,{"v":4.299999999999993,"d":"4.3"},0.584585517110878,-0.01479065686394182]
[87,{"v":4.3499999999999925,"d":"4.3"},0.5838203656441461,-0.0158081149508955]
[88,{"v":4.399999999999992,"d":"4.4"},0.5830054213796685,-0.016782625423823777]
[89,{"v":4.449999999999992,"d":"4.4"},0.5821427936417949,-0.017715701768808115]
[90,{"v":4.499999999999992,"d":"4.5"},0.5812345173820408,-0.018608805686850874]
[91,{"v":4.549999999999992,"d":"4.5"},0.5802825557275013,-0.01946334872301489]
[92,{"v":4.599999999999992,"d":"4.6"},0.5792888024485061,-0.020280693867118033]
[93,{"v":4.6499999999999915,"d":"4.6"},0.5782550843470091,-0.021062157123201558]
[94,{"v":4.699999999999991,"d":"4.7"},0.5771831635673348,-0.021809009045535746]
[95,{"v":4.749999999999991,"d":"4.7"},0.5760747398309964,-0.022522476239403927]
[96,{"v":4.799999999999991,"d":"4.8"},0.574931452597386,-0.023203742825320464]
[97,{"v":4.849999999999991,"d":"4.8"},0.5737548831521873,-0.02385395186569972]
[98,{"v":4.899999999999991,"d":"4.9"},0.5725465566254093,-0.0244742067533064]
[99,{"v":4.94999999999999,"d":"4.9"},0.5713079439409625,-0.025065572561086935]
[100,{"v":4.99999999999999,"d":"5.0"},0.5700404636997105,-0.02562907735321518]
[101,{"v":5.04999999999999,"d":"5.0"},0.5687454839979413,-0.02616571345738375]
[102,{"v":5.09999999999999,"d":"5.1"},0.5674243241831874,-0.026676438698543303]
[103,{"v":5.14999999999999,"d":"5.1"},0.5660782565493164,-0.02716217759443476]
[104,{"v":5.1999999999999895,"d":"5.2"},0.5647085079727906,-0.027623822513381358]
[105,{"v":5.249999999999989,"d":"5.2"},0.5633162614919686,-0.028062234794907978]
[106,{"v":5.299999999999989,"d":"5.3"},0.5619026578312918,-0.028478245833838713]
[107,{"v":5.349999999999989,"d":"5.3"},0.5604687968721658,-0.02887265812859193]
[108,{"v":5.399999999999989,"d":"5.4"},0.5590157390723032,-0.029246246294446505]
[109,{"v":5.449999999999989,"d":"5.4"},0.5575445068352638,-0.029599758042595486]
[110,{"v":5.4999999999999885,"d":"5.5"},0.5560560858318802,-0.0299339151258375]
[111,{"v":5.549999999999988,"d":"5.5"},0.5545514262752129,-0.030249414251778094]
[112,{"v":5.599999999999988,"d":"5.6"},0.553031444150641,-0.030546927964431488]
[113,{"v":5.649999999999988,"d":"5.6"},0.5514970224026423,-0.03082710549512155]
[114,{"v":5.699999999999988,"d":"5.7"},0.5499490120797792,-0.03109057358358553]
[115,{"v":5.749999999999988,"d":"5.7"},0.5483882334393528,-0.03133793727018305]
[116,{"v":5.799999999999987,"d":"5.8"},0.5468154770131528,-0.031569780660107995]
[117,{"v":5.849999999999987,"d":"5.8"},0.5452315046356765,-0.031786667660492804]
[118,{"v":5.899999999999987,"d":"5.9"},0.5436370504361528,-0.03198914269128326]
[119,{"v":5.949999999999987,"d":"5.9"},0.5420328217956604,-0.03217773137074777]
[120,{"v":5.999999999999987,"d":"6.0"},0.5404195002705845,-0.03235294117647054]
[121,{"v":6.0499999999999865,"d":"6.0"},0.5387977424836241,-0.03251526208265975]
[122,{"v":6.099999999999986,"d":"6.1"},0.5371681809835042,-0.03266516717458346]
[123,{"v":6.149999999999986,"d":"6.1"},0.5355314250745238,-0.03280311324092706]
[124,{"v":6.199999999999986,"d":"6.2"},0.5338880616170227,-0.03292954134484459]
[125,{"v":6.249999999999986,"d":"6.2"},0.53223865579981,-0.03304487737445672]
[126,{"v":6.299999999999986,"d":"6.3"},0.5305837518855689,-0.033149532573525535]
[127,{"v":6.349999999999985,"d":"6.3"},0.5289238739302073,-0.03324390405301582]
[128,{"v":6.399999999999985,"d":"6.4"},{"$f":"ATAN((RR+s)/x)-ATAN(s/x)","v":0.527259526477093},{"$f":"s/(x^2+s^2)-(RR+s)/(x^2+(RR+s)^2)","v":-0.03332837528423069}]
[129,{"v":6.449999999999985,"d":"6.4"},0.5255911952270808,-0.033403316574187596]
[130,{"v":6.499999999999985,"d":"6.5"},0.5239193476851995,-0.03346908552388003]
[131,{"$f":"B133+0.05","v":{"v":6.549999999999985,"d":"6.5"}},0.5222444337848422,-0.03352602747004836]
[132,{"v":6.5999999999999845,"d":"6.6"},0.5205668864902662,-0.03357447591106314]
[133,{"v":6.649999999999984,"d":"6.6"},0.5188871223781844,-0.03361475291750312]
[134,{"v":6.699999999999984,"d":"6.7"},0.5172055421991992,-0.03364716952799044]
[135,{"v":6.749999999999984,"d":"6.7"},0.5155225314198013,-0.03367202613082582]
[136,{"v":6.799999999999984,"d":"6.8"},0.5138384607456306,-0.033689612831947185]
[137,{"v":6.849999999999984,"d":"6.8"},0.5121536866266714,-0.033700209809716504]
[138,{"v":6.8999999999999835,"d":"6.9"},0.5104685517450256,-0.0337040876570216]
[139,{"v":6.949999999999983,"d":"6.9"},0.5087833854858907,-0.03370150771116151]
[140,{"v":6.999999999999983,"d":"7.0"},0.5070985043923375,-0.03369272237196765]
[141,{"v":7.049999999999983,"d":"7.0"},0.5054142126044672,-0.033677975408595164]
[142,{"v":7.099999999999983,"d":"7.1"},0.5037308022835038,-0.03365750225540393]
[143,{"v":7.149999999999983,"d":"7.1"},0.5020485540213565,-0.03363153029733235]
[144,{"v":7.199999999999982,"d":"7.2"},0.5003677372361681,-0.03360027914515208]
[145,{"v":7.249999999999982,"d":"7.2"},0.498688610554346,-0.03356396090097749]
[146,{"v":7.299999999999982,"d":"7.3"},0.49701142217955263,-0.033522780414389365]
[147,{"v":7.349999999999982,"d":"7.3"},0.49533641024911945,-0.033476935529518886]
[148,{"v":7.399999999999982,"d":"7.4"},0.49366380317832326,-0.03342661732342481]
[149,{"v":7.4499999999999815,"d":"7.4"},0.49199381999295644,-0.033372010336084154]
[150,{"v":7.499999999999981,"d":"7.5"},0.4903266706505999,-0.03331329279230446]
[151,{"v":7.549999999999981,"d":"7.5"},0.48866255635099637,-0.03325063681585417]
[152,{"v":7.599999999999981,"d":"7.6"},0.48700166983590626,-0.0331842086360963]
[153,{"v":7.649999999999981,"d":"7.6"},0.4853441956788125,-0.033114168787399506]
[154,{"v":7.699999999999981,"d":"7.7"},0.48369031056483147,-0.03304067230159079]
[155,{"v":7.7499999999999805,"d":"7.7"},0.4820401835611678,-0.0329638688937033]
[156,{"v":7.79999999999998,"d":"7.8"},0.4803939763784461,-0.03288390314126366]
[157,{"v":7.84999999999998,"d":"7.8"},0.4787518436232343,-0.032800914657353755]
[158,{"v":7.89999999999998,"d":"7.9"},0.477113933042065,-0.03271503825767265]
[159,{"v":7.94999999999998,"d":"7.9"},0.47548038575724794,-0.03262640412181646]
[160,{"v":7.99999999999998,"d":"8.0"},0.47385133649476097,-0.03253513794898494]
[161,{"v":8.04999999999998,"d":"8.0"},0.47222691380448883,-0.03244136110831629]
[162,{"v":8.09999999999998,"d":"8.1"},0.470607240273076,-0.032345190784043576]
[163,{"v":8.14999999999998,"d":"8.1"},0.4689924327296481,-0.03224674011565929]
[164,{"v":8.199999999999982,"d":"8.2"},0.4673826024446446,-0.03214611833326703]
[165,{"v":8.249999999999982,"d":"8.2"},0.46577785532200217,-0.03204343088829303]
[166,{"v":8.299999999999983,"d":"8.3"},0.464178292084914,-0.0319387795797234]
[167,{"v":8.349999999999984,"d":"8.3"},0.4625840084553861,-0.03183226267602701]
[168,{"v":8.399999999999984,"d":"8.4"},0.4609950953278023,-0.03172397503291759]
[169,{"v":8.449999999999985,"d":"8.4"},0.4594116389367012,-0.03161400820710313]
[170,{"v":8.499999999999986,"d":"8.5"},0.4578337210189648,-0.03150245056616532]
[171,{"v":8.549999999999986,"d":"8.5"},0.45626141897060446,-0.03138938739470572]
[172,{"v":8.599999999999987,"d":"8.6"},0.45469480599833284,-0.031274900996891154]
[173,{"v":8.649999999999988,"d":"8.6"},0.4531339512660939,-0.031159070795525295]
[174,{"v":8.699999999999989,"d":"8.7"},0.4515789200367242,-0.031041973427768856]
[175,{"v":8.74999999999999,"d":"8.7"},0.45002977380891024,-0.030923682837626365]
[176,{"v":8.79999999999999,"d":"8.8"},0.44848657044959916,-0.030804270365313035]
[177,{"v":8.84999999999999,"d":"8.8"},0.44694936432201676,-0.03068380483361113]
[178,{"v":8.899999999999991,"d":"8.9"},0.44541820640944063,-0.030562352631321094]
[179,{"v":8.949999999999992,"d":"8.9"},0.4438931444348727,-0.03043997779390901]
[180,{"v":8.999999999999993,"d":"9.0"},0.4423742229767451,-0.030316742081447974]
[181,{"v":9.049999999999994,"d":"9.0"},0.4408614835807968,-0.030192705053947867]
[182,{"v":9.099999999999994,"d":"9.1"},0.4393549648682459,-0.030067924144163816]
[183,{"v":9.149999999999995,"d":"9.2"},0.43785470264038245,-0.02994245472797124]
[184,{"v":9.199999999999996,"d":"9.2"},0.43636072997970354,-0.02981635019239144]
[185,{"v":9.249999999999996,"d":"9.3"},0.43487307734770136,-0.029689662001349003]
[186,{"v":9.299999999999997,"d":"9.3"},0.43339177267942086,-0.02956243975923932]
[187,{"v":9.349999999999998,"d":"9.4"},0.43191684147489084,-0.02943473127238162]
[188,{"v":9.399999999999999,"d":"9.4"},0.43044830688753366,-0.02930658260843027]
[189,{"v":9.45,"d":"9.5"},0.42898618980965575,-0.029178038153814326]
[190,9.5,0.4275305089551111,-0.029049140669273155]
[191,{"v":9.55,"d":"9.6"},0.42608128093923703,-0.028919931343552932]
[192,{"v":9.600000000000001,"d":"9.6"},{"$f":"ATAN((RR+s)/x)-ATAN(s/x)","v":0.4246385203561477},{"$f":"s/(x^2+s^2)-(RR+s)/(x^2+(RR+s)^2)","v":-0.028790449845327207}]
[193,{"v":9.650000000000002,"d":"9.7"},0.4232022398534763,-0.028660734373401872]
[194,{"v":9.700000000000003,"d":"9.7"},0.4217724502046476,-0.028530821705263085]
[195,{"$f":"B197+0.05","v":{"v":9.750000000000004,"d":"9.8"}},0.42034916037876346,-0.028400747244024437]
[196,{"v":9.800000000000004,"d":"9.8"},0.4189323776081806,-0.02827054506382774]
[197,{"v":9.850000000000005,"d":"9.9"},0.41752210745385515,-0.02814024795374992]
{"$rows_left_out":804}
{"sheet":"Sheet3","index":2,"n_rows":1003,"n_cols":2,"rows_kept":1003}
[{"$f":"xMin","v":0},{"$f":"9","v":9}]
[{"$f":"A1+dx","v":1},{"$f":"9","v":9}]
[2,{"$f":"9","v":9}]
[3,{"$f":"9","v":9}]
[4,{"$f":"9","v":9}]
[5,{"$f":"9","v":9}]
[6,{"$f":"9","v":9}]
[7,{"$f":"9","v":9}]
[8,{"$f":"9","v":9}]
[9,{"$f":"9","v":9}]
[10,{"$f":"9","v":9}]
[11,{"$f":"9","v":9}]
[12,{"$f":"9","v":9}]
[13,{"$f":"9","v":9}]
[14,{"$f":"9","v":9}]
[15,{"$f":"9","v":9}]
[16,{"$f":"9","v":9}]
[17,{"$f":"9","v":9}]
[18,{"$f":"9","v":9}]
[19,{"$f":"9","v":9}]
[20,{"$f":"9","v":9}]
[21,{"$f":"9","v":9}]
[22,{"$f":"9","v":9}]
[23,{"$f":"9","v":9}]
[24,{"$f":"9","v":9}]
[25,{"$f":"9","v":9}]
[26,{"$f":"9","v":9}]
[27,{"$f":"9","v":9}]
[28,{"$f":"9","v":9}]
[29,{"$f":"9","v":9}]
[30,{"$f":"9","v":9}]
[31,{"$f":"9","v":9}]
[32,{"$f":"9","v":9}]
[33,{"$f":"9","v":9}]
[34,{"$f":"9","v":9}]
[35,{"$f":"9","v":9}]
[36,{"$f":"9","v":9}]
[37,{"$f":"9","v":9}]
[38,{"$f":"9","v":9}]
[39,{"$f":"9","v":9}]
[40,{"$f":"9","v":9}]
[41,{"$f":"9","v":9}]
[42,{"$f":"9","v":9}]
[43,{"$f":"9","v":9}]
[44,{"$f":"9","v":9}]
[45,{"$f":"9","v":9}]
[46,{"$f":"9","v":9}]
[47,{"$f":"9","v":9}]
[48,{"$f":"9","v":9}]
[49,{"$f":"9","v":9}]
[50,{"$f":"9","v":9}]
[51,{"$f":"9","v":9}]
[52,{"$f":"9","v":9}]
[53,{"$f":"9","v":9}]
[54,{"$f":"9","v":9}]
[55,{"$f":"9","v":9}]
[56,{"$f":"9","v":9}]
[57,{"$f":"9","v":9}]
[58,{"$f":"9","v":9}]
[59,{"$f":"9","v":9}]
[60,{"$f":"9","v":9}]
[61,{"$f":"9","v":9}]
[62,{"$f":"9","v":9}]
[63,{"$f":"9","v":9}]
[64,{"$f":"9","v":9}]
[{"$f":"A65+dx","v":65},{"$f":"9","v":9}]
[66,{"$f":"9","v":9}]
[67,{"$f":"9","v":9}]
[68,{"$f":"9","v":9}]
[69,{"$f":"9","v":9}]
[70,{"$f":"9","v":9}]
[71,{"$f":"9","v":9}]
[72,{"$f":"9","v":9}]
[73,{"$f":"9","v":9}]
[74,{"$f":"9","v":9}]
[75,{"$f":"9","v":9}]
[76,{"$f":"9","v":9}]
[77,{"$f":"9","v":9}]
[78,{"$f":"9","v":9}]
[79,{"$f":"9","v":9}]
[80,{"$f":"9","v":9}]
[81,{"$f":"9","v":9}]
[82,{"$f":"9","v":9}]
[83,{"$f":"9","v":9}]
[84,{"$f":"9","v":9}]
[85,{"$f":"9","v":9}]
[86,{"$f":"9","v":9}]
[87,{"$f":"9","v":9}]
[88,{"$f":"9","v":9}]
[89,{"$f":"9","v":9}]
[90,{"$f":"9","v":9}]
[91,{"$f":"9","v":9}]
[92,{"$f":"9","v":9}]
[93,{"$f":"9","v":9}]
[94,{"$f":"9","v":9}]
[95,{"$f":"9","v":9}]
[96,{"$f":"9","v":9}]
[97,{"$f":"9","v":9}]
[98,{"$f":"9","v":9}]
[99,{"$f":"9","v":9}]
[100,{"$f":"9","v":9}]
[101,{"$f":"9","v":9}]
[102,{"$f":"9","v":9}]
[103,{"$f":"9","v":9}]
[104,{"$f":"9","v":9}]
[105,{"$f":"9","v":9}]
[106,{"$f":"9","v":9}]
[107,{"$f":"9","v":9}]
[108,{"$f":"9","v":9}]
[109,{"$f":"9","v":9}]
[110,{"$f":"9","v":9}]
[111,{"$f":"9","v":9}]
[112,{"$f":"9","v":9}]
[113,{"$f":"9","v":9}]
[114,{"$f":"9","v":9}]
[115,{"$f":"9","v":9}]
[116,{"$f":"9","v":9}]
[117,{"$f":"9","v":9}]
[118,{"$f":"9","v":9}]
[119,{"$f":"9","v":9}]
[120,{"$f":"9","v":9}]
[121,{"$f":"9","v":9}]
[122,{"$f":"9","v":9}]
[123,{"$f":"9","v":9}]
[124,{"$f":"9","v":9}]
[125,{"$f":"9","v":9}]
[126,{"$f":"9","v":9}]
[127,{"$f":"9","v":9}]
[128,{"$f":"9","v":9}]
[{"$f":"A129+dx","v":129},{"$f":"9","v":9}]
[130,{"$f":"9","v":9}]
[131,{"$f":"9","v":9}]
[132,{"$f":"9","v":9}]
[133,{"$f":"9","v":9}]
[134,{"$f":"9","v":9}]
[135,{"$f":"9","v":9}]
[136,{"$f":"9","v":9}]
[137,{"$f":"9","v":9}]
[138,{"$f":"9","v":9}]
[139,{"$f":"9","v":9}]
[140,{"$f":"9","v":9}]
[141,{"$f":"9","v":9}]
[142,{"$f":"9","v":9}]
[143,{"$f":"9","v":9}]
[144,{"$f":"9","v":9}]
[145,{"$f":"9","v":9}]
[146,{"$f":"9","v":9}]
[147,{"$f":"9","v":9}]
[148,{"$f":"9","v":9}]
[149,{"$f":"9","v":9}]
[150,{"$f":"9","v":9}]
[151,{"$f":"9","v":9}]
[152,{"$f":"9","v":9}]
[153,{"$f":"9","v":9}]
[154,{"$f":"9","v":9}]
[155,{"$f":"9","v":9}]
[156,{"$f":"9","v":9}]
[157,{"$f":"9","v":9}]
[158,{"$f":"9","v":9}]
[159,{"$f":"9","v":9}]
[160,{"$f":"9","v":9}]
[161,{"$f":"9","v":9}]
[162,{"$f":"9","v":9}]
[163,{"$f":"9","v":9}]
[164,{"$f":"9","v":9}]
[165,{"$f":"9","v":9}]
[166,{"$f":"9","v":9}]
[167,{"$f":"9","v":9}]
[168,{"$f":"9","v":9}]
[169,{"$f":"9","v":9}]
[170,{"$f":"9","v":9}]
[171,{"$f":"9","v":9}]
[172,{"$f":"9","v":9}]
[173,{"$f":"9","v":9}]
[174,{"$f":"9","v":9}]
[175,{"$f":"9","v":9}]
[176,{"$f":"9","v":9}]
[177,{"$f":"9","v":9}]
[178,{"$f":"9","v":9}]
[179,{"$f":"9","v":9}]
[180,{"$f":"9","v":9}]
[181,{"$f":"9","v":9}]
[182,{"$f":"9","v":9}]
[183,{"$f":"9","v":9}]
[184,{"$f":"9","v":9}]
[185,{"$f":"9","v":9}]
[186,{"$f":"9","v":9}]
[187,{"$f":"9","v":9}]
[188,{"$f":"9","v":9}]
[189,{"$f":"9","v":9}]
[190,{"$f":"9","v":9}]
[191,{"$f":"9","v":9}]
[192,{"$f":"9","v":9}]
[{"$f":"A193+dx","v":193},{"$f":"9","v":9}]
[194,{"$f":"9","v":9}]
[195,{"$f":"9","v":9}]
[196,{"$f":"9","v":9}]
[197,{"$f":"9","v":9}]
[198,{"$f":"9","v":9}]
[199,{"$f":"9","v":9}]
{"$rows_left_out":803}