{"text_format":"3","workbook":"xlsx","n_sheets":3,"sheets":["Sheet1","Sheet2","Sheet3"],"not_rendered":{"charts":3,"images":2,"macros":1,"defined_names":14,"comments":1},"read":"whole","date_system":"1900"}

{"sheet":"Sheet1","index":0,"n_rows":38,"n_cols":18,"rows_kept":38,"merged":[[31,2,31,3]]}
["The Area of a Circle + a Square Problem"]
[]
[null,"This DIGMath module lets you investigate "]
[null,"         the calculus problem of finding"]
[null,"          where to cut a length of wire"]
[null,"          to form a circle and a square  "]
[null,"  that have the greatest or the least area."]
[]
[]
[]
["What is the total length Lof the wire?"]
[null,"    (10 - 100 square inches)",null,null,"     Length =",{"$f":"D13","v":70}]
[{"$nulls":3},70,{"$f":"#REF!+D13*(#REF!-#REF!)/100","v":{"$error":"#REF!"}}]
[{"$nulls":11},"    The total area function =",null,null,"x2/16 + (L - x)2/4p"]
[]
[{"$f":"\"When x = \"&TEXT(x0,\"0.0\") &\" inches are used for the square, \"","v":"When x = 58.3 inches are used for the square, "},{"$nulls":9},"How many inches (10 to 100) to be used for the square: x0 =",{"$nulls":5},{"$f":"10+O18/10","v":58.3},"inches"]
[{"$f":"\"   so that L - x = \"&TEXT(L - x0,\"0.0\") &\" inches are used for the circle, \"","v":"   so that L - x = 11.7 inches are used for the circle, "}]
[{"$f":"\"    then the total area is \"&TEXT(P19,\"0.00\") &\" square inches \"","v":"    then the total area is 223.32 square inches "},{"$nulls":13},483,{"$f":"Sheet2!H7+O18*(Sheet2!H8-Sheet2!H7)/100","v":444.7}]
[{"$nulls":13},"           The total area is then",null,{"$f":"x0^2/16+(L-x0)^2/4/PI()","v":{"v":223.32398507992477,"d":"223.32"}},"square inches"]
[]
[{"$nulls":13},"        The value of the derivative is y' = ",null,null,{"$f":"Sheet2!I29","v":5.254894199969669}]
[]
[]
["Click each item below for suggestions and investigations"]
[null,null,"   Item 1"]
[null,null,"   Item 2"]
[null,null,"   Item 3"]
[]
[]
[]
["To access/download all the DIGMath Apps for Calculus"]
["     Click this link:",null,"DIGMath for Calculus"]
[]
["Created by:  Sheldon P. Gordon   "]
["                      Farmingdale State College    "]
["Development of this module was supported by the "]
["NSF's Division of Undergraduate Education  "]
["under grants DUE-0310123 and DUE-0442160."]

{"sheet":"Sheet2","index":1,"n_rows":103,"n_cols":12,"rows_kept":103}
[null,"x","f(x)","f'(x)",null,null,"xl=",{"$f":"IF(x0<Sheet2!H7+80*Sheet2!H5,Sheet2!H7,x0-80*Sheet2!H5)","v":51.099999999999994},{"$f":"LOOKUP(Sheet1!P18,Sheet2!B3:B1002,Sheet2!C3:C1002)+LOOKUP(Sheet1!P18,Sheet2!B3:B1002,Sheet2!D3:D1002)*(H1-Sheet1!P18)","v":-6102.6818436377625},"\"=yl"]
[{"$nulls":6},"xr=",{"$f":"IF(Sheet1!$P$18>Sheet2!H8-80*Sheet2!H5,Sheet2!H8,Sheet1!P18+80*Sheet2!H5)","v":100},{"$f":"LOOKUP(Sheet1!P18,Sheet2!B3:B1003,Sheet2!C3:C1003)+LOOKUP(Sheet1!P18,Sheet2!B3:B1003,Sheet2!D3:D1003)*(H2-Sheet1!P18)","v":-5257.9515421219485},"\"=yR"]
[0,{"$f":"10","v":{"v":10,"d":"10.0"}},{"$f":"x^2/16+(L-x)^2/4/PI()","v":292.7288975654116},{"$f":"x/8-(L-x)/2/PI()","v":-8.299296585513721},{"$nulls":7},"x2/16 + (L - x)/4p"]
[1,{"$f":"B3+dd","v":10.9},285.3746133904015,-8.043557136731014,null,null,"dd =",{"$f":"0.9","v":0.9}]
[2,11.8,278.2504947192958,-7.78781768794831,null,null,"delta x = ",{"$f":"(xMax-xMin)/1000","v":0.09}]
[3,{"v":12.700000000000001,"d":"12.7"},271.3565415520945,-7.532078239165603]
[4,{"v":13.600000000000001,"d":"13.6"},264.6927538887977,-7.276338790382897,null,null,"xMin =",10,{"$f":"C3","v":292.7288975654116}]
[5,{"v":14.500000000000002,"d":"14.5"},258.25913172940534,-7.020599341600191,null,null,"xMax =",100,{"$f":"C103","v":696.6197243913556}]
[6,{"v":15.400000000000002,"d":"15.4"},252.0556750739173,-6.7648598928174835]
[7,16.3,246.0823839223339,-6.50912044403478]
[8,17.2,240.33925827465475,-6.253380995252073,null,null,"Point"]
[9,{"v":18.099999999999998,"d":"18.1"},234.82629813088016,-5.997641546469369,null,null,{"$f":"x0","v":58.3},0]
[10,{"v":18.999999999999996,"d":"19.0"},229.5435034910099,-5.741902097686662]
[11,{"v":19.899999999999995,"d":"19.9"},224.49087435504416,-5.486162648903958,null,null,"Horizontal Line"]
[12,{"v":20.799999999999994,"d":"20.8"},219.6684107229828,-5.230423200121253,null,null,0,0]
[13,{"v":21.699999999999992,"d":"21.7"},215.07611259482593,-4.974683751338548,null,null,{"$f":"G12","v":58.3},0]
[14,{"v":22.59999999999999,"d":"22.6"},210.71397997057343,-4.71894430255584]
[15,{"v":23.49999999999999,"d":"23.5"},206.58201285022542,-4.463204853773137,null,null,"Diagnonal Line"]
[16,{"v":24.399999999999988,"d":"24.4"},202.68021123378173,-4.20746540499043,null,null,0,200]
[17,{"v":25.299999999999986,"d":"25.3"},199.00857512124264,-3.9517259562077265,null,null,997,0]
[18,{"v":26.199999999999985,"d":"26.2"},195.56710451260787,-3.6959865074250193]
[19,{"v":27.099999999999984,"d":"27.1"},192.3557994078776,-3.4402470586423157]
[20,{"v":27.999999999999982,"d":"28.0"},189.37465980705173,-3.1845076098596086,null,null,"Point on curve"]
[21,{"v":28.89999999999998,"d":"28.9"},186.62368571013036,-2.928768161076905,null,null,"x=",{"$f":"G12*H5","v":5.247}]
[22,{"v":29.79999999999998,"d":"29.8"},184.10287711711328,-2.673028712294198,null,"x0 =",{"$f":"x0","v":58.3},{"$f":"LOOKUP(x0+0.001,B3:B104,C3:C104)","v":220.11990067018613}]
[23,{"v":30.699999999999978,"d":"30.7"},181.8122340280008,-2.417289263511494,null,"y0 =",{"$f":"Area/x0+2*k","v":1.2006861063464838}]
[24,{"v":31.599999999999977,"d":"31.6"},179.7517564427926,-2.161549814728787]
[25,{"v":32.49999999999998,"d":"32.5"},177.92144436148897,-1.9058103659460812,null,null,{"$f":"x0","v":58.3},0,0]
[26,{"v":33.39999999999998,"d":"33.4"},176.32129778408972,-1.6500709171633758,null,null,{"$f":"x0","v":58.3},{"$f":"LOOKUP(x0+0.001,B3:B104,C3:C104)","v":220.11990067018613},{"$f":"LOOKUP(x0+0.001,B3:B104,D3:D104)","v":5.254894199969669}]
[27,{"v":34.299999999999976,"d":"34.3"},174.95131671059488,-1.3943314683806705]
[28,{"v":35.199999999999974,"d":"35.2"},173.8115011410045,-1.138592019597965]
[29,{"v":36.09999999999997,"d":"36.1"},172.90185107531855,-0.8828525708152597]
[30,{"v":36.99999999999997,"d":"37.0"},172.22236651353703,-0.6271131220325543]
[31,{"v":37.89999999999997,"d":"37.9"},171.77304745565993,-0.37137367324984893]
[32,{"v":38.79999999999997,"d":"38.8"},{"$f":"x^2/16+(L-x)^2/4/PI()","v":171.5538939016873},{"$f":"x/8-(L-x)/2/PI()","v":-0.11563422446714355}]
[33,{"$f":"B35+dd","v":{"v":39.69999999999997,"d":"39.7"}},171.56490585161907,0.14010522431556183]
[34,{"v":40.599999999999966,"d":"40.6"},171.80608330545533,0.3958446730982672]
[35,{"v":41.499999999999964,"d":"41.5"},172.277426263196,0.6515841218809726]
[36,{"v":42.39999999999996,"d":"42.4"},172.97893472484105,0.907323570663678]
[37,{"v":43.29999999999996,"d":"43.3"},173.91060869039057,1.1630630194463834]
[38,{"v":44.19999999999996,"d":"44.2"},175.07244815984455,1.4188024682290887]
[39,{"v":45.09999999999996,"d":"45.1"},176.46445313320294,1.6745419170117941]
[40,{"v":45.99999999999996,"d":"46.0"},178.08662361046578,1.9302813657944995]
[41,{"v":46.899999999999956,"d":"46.9"},179.93895959163305,2.186020814577205]
[42,{"v":47.799999999999955,"d":"47.8"},182.02146107670472,2.4417602633599107]
[43,{"v":48.69999999999995,"d":"48.7"},184.3341280656809,2.697499712142616]
[44,{"v":49.59999999999995,"d":"49.6"},186.87696055856145,2.9532391609253215]
[45,{"v":50.49999999999995,"d":"50.5"},189.64995855534644,3.208978609708027]
[46,{"v":51.39999999999995,"d":"51.4"},192.65312205603587,3.4647180584907322]
[47,{"v":52.29999999999995,"d":"52.3"},195.88645106062975,3.7204575072734376]
[48,{"v":53.199999999999946,"d":"53.2"},199.34994556912807,3.976196956056143]
[49,{"v":54.099999999999945,"d":"54.1"},203.0436055815308,4.231936404838848]
[50,{"v":54.99999999999994,"d":"55.0"},206.96743109783796,4.487675853621553]
[51,{"v":55.89999999999994,"d":"55.9"},211.1214221180496,4.743415302404259]
[52,{"v":56.79999999999994,"d":"56.8"},215.50557864216563,4.999154751186964]
[53,{"v":57.69999999999994,"d":"57.7"},220.11990067018613,5.254894199969669]
[54,{"v":58.59999999999994,"d":"58.6"},224.96438820211102,5.510633648752375]
[55,{"v":59.499999999999936,"d":"59.5"},230.03904123794035,5.76637309753508]
[56,{"v":60.399999999999935,"d":"60.4"},235.34385977767414,6.0221125463177865]
[57,{"v":61.29999999999993,"d":"61.3"},240.87884382131236,6.277851995100492]
[58,{"v":62.19999999999993,"d":"62.2"},246.643993368855,6.533591443883197]
[59,{"v":63.09999999999993,"d":"63.1"},252.6393084203021,6.789330892665903]
[60,{"v":63.99999999999993,"d":"64.0"},258.8647889756536,7.045070341448608]
[61,{"v":64.89999999999993,"d":"64.9"},265.3204350349096,7.300809790231315]
[62,{"v":65.79999999999994,"d":"65.8"},272.00624659807005,7.556549239014022]
[63,{"v":66.69999999999995,"d":"66.7"},278.92222366513494,7.81228868779673]
[64,{"v":67.59999999999995,"d":"67.6"},{"$f":"x^2/16+(L-x)^2/4/PI()","v":286.0683662361043},{"$f":"x/8-(L-x)/2/PI()","v":8.068028136579438}]
[65,{"$f":"B67+dd","v":{"v":68.49999999999996,"d":"68.5"}},293.44467431097803,8.323767585362145]
[66,{"v":69.39999999999996,"d":"69.4"},301.05114788975624,8.579507034144852]
[67,{"v":70.29999999999997,"d":"70.3"},308.88778697243885,8.835246482927559]
[68,{"v":71.19999999999997,"d":"71.2"},316.9545915590259,9.090985931710268]
[69,{"v":72.09999999999998,"d":"72.1"},325.25156164951744,9.346725380492975]
[70,{"v":72.99999999999999,"d":"73.0"},333.7786972439134,9.602464829275682]
[71,{"v":73.89999999999999,"d":"73.9"},342.5359983422138,9.85820427805839]
[72,74.8,351.5234649444186,10.113943726841097]
[73,75.7,360.7410970505279,10.369683175623804]
[74,{"v":76.60000000000001,"d":"76.6"},370.18889466054156,10.62542262440651]
[75,{"v":77.50000000000001,"d":"77.5"},379.8668577744597,10.88116207318922]
[76,{"v":78.40000000000002,"d":"78.4"},389.7749863922823,11.136901521971927]
[77,{"v":79.30000000000003,"d":"79.3"},399.91328051400933,11.392640970754634]
[78,{"v":80.20000000000003,"d":"80.2"},410.28174013964076,11.648380419537341]
[79,{"v":81.10000000000004,"d":"81.1"},420.88036526917665,11.904119868320048]
[80,{"v":82.00000000000004,"d":"82.0"},431.709155902617,12.159859317102756]
[81,{"v":82.90000000000005,"d":"82.9"},442.76811203996175,12.415598765885463]
[82,{"v":83.80000000000005,"d":"83.8"},454.05723368121096,12.671338214668172]
[83,{"v":84.70000000000006,"d":"84.7"},465.57652082636463,12.927077663450879]
[84,{"v":85.60000000000007,"d":"85.6"},477.3259734754227,13.182817112233586]
[85,{"v":86.50000000000007,"d":"86.5"},489.30559162838523,13.438556561016293]
[86,{"v":87.40000000000008,"d":"87.4"},501.5153752852522,13.694296009799]
[87,{"v":88.30000000000008,"d":"88.3"},513.9553244460236,13.95003545858171]
[88,{"v":89.20000000000009,"d":"89.2"},526.6254391106994,14.205774907364415]
[89,{"v":90.1000000000001,"d":"90.1"},539.5257192792797,14.461514356147124]
[90,{"v":91.0000000000001,"d":"91.0"},552.6561649517644,14.71725380492983]
[91,{"v":91.9000000000001,"d":"91.9"},566.0167761281535,14.972993253712538]
[92,{"v":92.80000000000011,"d":"92.8"},579.607552808447,15.228732702495245]
[93,{"v":93.70000000000012,"d":"93.7"},593.4284949926451,15.484472151277952]
[94,{"v":94.60000000000012,"d":"94.6"},607.4796026807477,15.740211600060661]
[95,{"v":95.50000000000013,"d":"95.5"},621.7608758727545,15.995951048843366]
[96,{"v":96.40000000000013,"d":"96.4"},636.2723145686659,16.251690497626075]
[97,{"v":97.30000000000014,"d":"97.3"},651.0139187684816,16.507429946408784]
[98,{"v":98.20000000000014,"d":"98.2"},665.9856884722019,16.76316939519149]
[99,{"v":99.10000000000015,"d":"99.1"},681.1876236798265,17.018908843974195]
[100,{"v":100.00000000000016,"d":"100.0"},696.6197243913556,17.274648292756904]

{"sheet":"Sheet3","index":2,"n_rows":1003,"n_cols":2,"rows_kept":1003}
[{"$f":"xMin","v":10},{"$f":"9","v":9}]
[{"$f":"A1+dx","v":10.09},{"$f":"9","v":9}]
[10.18,{"$f":"9","v":9}]
[10.27,{"$f":"9","v":9}]
[10.36,{"$f":"9","v":9}]
[10.45,{"$f":"9","v":9}]
[10.54,{"$f":"9","v":9}]
[10.629999999999999,{"$f":"9","v":9}]
[10.719999999999999,{"$f":"9","v":9}]
[10.809999999999999,{"$f":"9","v":9}]
[10.899999999999999,{"$f":"9","v":9}]
[10.989999999999998,{"$f":"9","v":9}]
[11.079999999999998,{"$f":"9","v":9}]
[11.169999999999998,{"$f":"9","v":9}]
[11.259999999999998,{"$f":"9","v":9}]
[11.349999999999998,{"$f":"9","v":9}]
[11.439999999999998,{"$f":"9","v":9}]
[11.529999999999998,{"$f":"9","v":9}]
[11.619999999999997,{"$f":"9","v":9}]
[11.709999999999997,{"$f":"9","v":9}]
[11.799999999999997,{"$f":"9","v":9}]
[11.889999999999997,{"$f":"9","v":9}]
[11.979999999999997,{"$f":"9","v":9}]
[12.069999999999997,{"$f":"9","v":9}]
[12.159999999999997,{"$f":"9","v":9}]
[12.249999999999996,{"$f":"9","v":9}]
[12.339999999999996,{"$f":"9","v":9}]
[12.429999999999996,{"$f":"9","v":9}]
[12.519999999999996,{"$f":"9","v":9}]
[12.609999999999996,{"$f":"9","v":9}]
[12.699999999999996,{"$f":"9","v":9}]
[12.789999999999996,{"$f":"9","v":9}]
[12.879999999999995,{"$f":"9","v":9}]
[12.969999999999995,{"$f":"9","v":9}]
[13.059999999999995,{"$f":"9","v":9}]
[13.149999999999995,{"$f":"9","v":9}]
[13.239999999999995,{"$f":"9","v":9}]
[13.329999999999995,{"$f":"9","v":9}]
[13.419999999999995,{"$f":"9","v":9}]
[13.509999999999994,{"$f":"9","v":9}]
[13.599999999999994,{"$f":"9","v":9}]
[13.689999999999994,{"$f":"9","v":9}]
[13.779999999999994,{"$f":"9","v":9}]
[13.869999999999994,{"$f":"9","v":9}]
[13.959999999999994,{"$f":"9","v":9}]
[14.049999999999994,{"$f":"9","v":9}]
[14.139999999999993,{"$f":"9","v":9}]
[14.229999999999993,{"$f":"9","v":9}]
[14.319999999999993,{"$f":"9","v":9}]
[14.409999999999993,{"$f":"9","v":9}]
[14.499999999999993,{"$f":"9","v":9}]
[14.589999999999993,{"$f":"9","v":9}]
[14.679999999999993,{"$f":"9","v":9}]
[14.769999999999992,{"$f":"9","v":9}]
[14.859999999999992,{"$f":"9","v":9}]
[14.949999999999992,{"$f":"9","v":9}]
[15.039999999999992,{"$f":"9","v":9}]
[15.129999999999992,{"$f":"9","v":9}]
[15.219999999999992,{"$f":"9","v":9}]
[15.309999999999992,{"$f":"9","v":9}]
[15.399999999999991,{"$f":"9","v":9}]
[15.489999999999991,{"$f":"9","v":9}]
[15.579999999999991,{"$f":"9","v":9}]
[15.669999999999991,{"$f":"9","v":9}]
[15.759999999999991,{"$f":"9","v":9}]
[{"$f":"A65+dx","v":15.84999999999999},{"$f":"9","v":9}]
[15.93999999999999,{"$f":"9","v":9}]
[16.02999999999999,{"$f":"9","v":9}]
[16.11999999999999,{"$f":"9","v":9}]
[16.20999999999999,{"$f":"9","v":9}]
[16.29999999999999,{"$f":"9","v":9}]
[16.38999999999999,{"$f":"9","v":9}]
[16.47999999999999,{"$f":"9","v":9}]
[16.56999999999999,{"$f":"9","v":9}]
[16.65999999999999,{"$f":"9","v":9}]
[16.74999999999999,{"$f":"9","v":9}]
[16.83999999999999,{"$f":"9","v":9}]
[16.92999999999999,{"$f":"9","v":9}]
[17.01999999999999,{"$f":"9","v":9}]
[17.10999999999999,{"$f":"9","v":9}]
[17.19999999999999,{"$f":"9","v":9}]
[17.28999999999999,{"$f":"9","v":9}]
[17.37999999999999,{"$f":"9","v":9}]
[17.469999999999988,{"$f":"9","v":9}]
[17.559999999999988,{"$f":"9","v":9}]
[17.649999999999988,{"$f":"9","v":9}]
[17.739999999999988,{"$f":"9","v":9}]
[17.829999999999988,{"$f":"9","v":9}]
[17.919999999999987,{"$f":"9","v":9}]
[18.009999999999987,{"$f":"9","v":9}]
[18.099999999999987,{"$f":"9","v":9}]
[18.189999999999987,{"$f":"9","v":9}]
[18.279999999999987,{"$f":"9","v":9}]
[18.369999999999987,{"$f":"9","v":9}]
[18.459999999999987,{"$f":"9","v":9}]
[18.549999999999986,{"$f":"9","v":9}]
[18.639999999999986,{"$f":"9","v":9}]
[18.729999999999986,{"$f":"9","v":9}]
[18.819999999999986,{"$f":"9","v":9}]
[18.909999999999986,{"$f":"9","v":9}]
[18.999999999999986,{"$f":"9","v":9}]
[19.089999999999986,{"$f":"9","v":9}]
[19.179999999999986,{"$f":"9","v":9}]
[19.269999999999985,{"$f":"9","v":9}]
[19.359999999999985,{"$f":"9","v":9}]
[19.449999999999985,{"$f":"9","v":9}]
[19.539999999999985,{"$f":"9","v":9}]
[19.629999999999985,{"$f":"9","v":9}]
[19.719999999999985,{"$f":"9","v":9}]
[19.809999999999985,{"$f":"9","v":9}]
[19.899999999999984,{"$f":"9","v":9}]
[19.989999999999984,{"$f":"9","v":9}]
[20.079999999999984,{"$f":"9","v":9}]
[20.169999999999984,{"$f":"9","v":9}]
[20.259999999999984,{"$f":"9","v":9}]
[20.349999999999984,{"$f":"9","v":9}]
[20.439999999999984,{"$f":"9","v":9}]
[20.529999999999983,{"$f":"9","v":9}]
[20.619999999999983,{"$f":"9","v":9}]
[20.709999999999983,{"$f":"9","v":9}]
[20.799999999999983,{"$f":"9","v":9}]
[20.889999999999983,{"$f":"9","v":9}]
[20.979999999999983,{"$f":"9","v":9}]
[21.069999999999983,{"$f":"9","v":9}]
[21.159999999999982,{"$f":"9","v":9}]
[21.249999999999982,{"$f":"9","v":9}]
[21.339999999999982,{"$f":"9","v":9}]
[21.429999999999982,{"$f":"9","v":9}]
[21.519999999999982,{"$f":"9","v":9}]
[{"$f":"A129+dx","v":21.60999999999998},{"$f":"9","v":9}]
[21.69999999999998,{"$f":"9","v":9}]
[21.78999999999998,{"$f":"9","v":9}]
[21.87999999999998,{"$f":"9","v":9}]
[21.96999999999998,{"$f":"9","v":9}]
[22.05999999999998,{"$f":"9","v":9}]
[22.14999999999998,{"$f":"9","v":9}]
[22.23999999999998,{"$f":"9","v":9}]
[22.32999999999998,{"$f":"9","v":9}]
[22.41999999999998,{"$f":"9","v":9}]
[22.50999999999998,{"$f":"9","v":9}]
[22.59999999999998,{"$f":"9","v":9}]
[22.68999999999998,{"$f":"9","v":9}]
[22.77999999999998,{"$f":"9","v":9}]
[22.86999999999998,{"$f":"9","v":9}]
[22.95999999999998,{"$f":"9","v":9}]
[23.04999999999998,{"$f":"9","v":9}]
[23.13999999999998,{"$f":"9","v":9}]
[23.22999999999998,{"$f":"9","v":9}]
[23.31999999999998,{"$f":"9","v":9}]
[23.40999999999998,{"$f":"9","v":9}]
[23.49999999999998,{"$f":"9","v":9}]
[23.58999999999998,{"$f":"9","v":9}]
[23.67999999999998,{"$f":"9","v":9}]
[23.76999999999998,{"$f":"9","v":9}]
[23.859999999999978,{"$f":"9","v":9}]
[23.949999999999978,{"$f":"9","v":9}]
[24.039999999999978,{"$f":"9","v":9}]
[24.129999999999978,{"$f":"9","v":9}]
[24.219999999999978,{"$f":"9","v":9}]
[24.309999999999977,{"$f":"9","v":9}]
[24.399999999999977,{"$f":"9","v":9}]
[24.489999999999977,{"$f":"9","v":9}]
[24.579999999999977,{"$f":"9","v":9}]
[24.669999999999977,{"$f":"9","v":9}]
[24.759999999999977,{"$f":"9","v":9}]
[24.849999999999977,{"$f":"9","v":9}]
[24.939999999999976,{"$f":"9","v":9}]
[25.029999999999976,{"$f":"9","v":9}]
[25.119999999999976,{"$f":"9","v":9}]
[25.209999999999976,{"$f":"9","v":9}]
[25.299999999999976,{"$f":"9","v":9}]
[25.389999999999976,{"$f":"9","v":9}]
[25.479999999999976,{"$f":"9","v":9}]
[25.569999999999975,{"$f":"9","v":9}]
[25.659999999999975,{"$f":"9","v":9}]
[25.749999999999975,{"$f":"9","v":9}]
[25.839999999999975,{"$f":"9","v":9}]
[25.929999999999975,{"$f":"9","v":9}]
[26.019999999999975,{"$f":"9","v":9}]
[26.109999999999975,{"$f":"9","v":9}]
[26.199999999999974,{"$f":"9","v":9}]
[26.289999999999974,{"$f":"9","v":9}]
[26.379999999999974,{"$f":"9","v":9}]
[26.469999999999974,{"$f":"9","v":9}]
[26.559999999999974,{"$f":"9","v":9}]
[26.649999999999974,{"$f":"9","v":9}]
[26.739999999999974,{"$f":"9","v":9}]
[26.829999999999973,{"$f":"9","v":9}]
[26.919999999999973,{"$f":"9","v":9}]
[27.009999999999973,{"$f":"9","v":9}]
[27.099999999999973,{"$f":"9","v":9}]
[27.189999999999973,{"$f":"9","v":9}]
[27.279999999999973,{"$f":"9","v":9}]
[{"$f":"A193+dx","v":27.369999999999973},{"$f":"9","v":9}]
[27.459999999999972,{"$f":"9","v":9}]
[27.549999999999972,{"$f":"9","v":9}]
[27.639999999999972,{"$f":"9","v":9}]
[27.729999999999972,{"$f":"9","v":9}]
[27.819999999999972,{"$f":"9","v":9}]
[27.90999999999997,{"$f":"9","v":9}]
{"$rows_left_out":803}