{"text_format":"3","workbook":"xlsx","n_sheets":3,"sheets":["Sheet1","Sheet2","Sheet3"],"not_rendered":{"charts":3,"images":3,"macros":1,"defined_names":11,"comments":1},"read":"whole","date_system":"1900"}

{"sheet":"Sheet1","index":0,"n_rows":38,"n_cols":18,"rows_kept":38,"merged":[[31,2,31,3]]}
[" Area of a Square + a Triangle Problem"]
[]
[null,"This DIGMath module lets you investigate "]
[null,"         the calculus problem of finding"]
[null,"          where to cut a length of wire"]
[null,"to form a square and an equilateral triangle  "]
[null,"  that have the greatest or the least area."]
[]
[]
[]
["What is the total length Lof the wire?"]
[null,"    (0 - 100  inches)",null,null,"       Length =",{"$f":"D13","v":60}]
[{"$nulls":3},60,{"$f":"#REF!+D13*(#REF!-#REF!)/100","v":{"$error":"#REF!"}}]
[{"$nulls":11},"    The total area function is"]
[]
[{"$f":"\"When x = \"&TEXT(x0,\"0.0\") &\" inches are used for the square, \"","v":"When x = 6.6 inches are used for the square, "},{"$nulls":9},"How many inches (0 to 100) to be used for the square: 4x0 =",{"$nulls":5},{"$f":"O18*dd","v":6.6},"inches"]
[{"$f":"\"   so that L - x = \"&TEXT(L - x0,\"0.0\") &\" inches are used for the triangle, \"","v":"   so that L - x = 53.4 inches are used for the triangle, "}]
[{"$f":"\"    then the total area is \"&TEXT(Area,\"0.00\") &\" square inches \"","v":"    then the total area is 152.19 square inches "},{"$nulls":13},22,{"$f":"Sheet2!H7+O18*(Sheet2!H8-Sheet2!H7)/100","v":22}]
[{"$nulls":13},"           The total area is then",null,{"$f":"LOOKUP(x0,Sheet2!B3:B204,Sheet2!C3:C204)","v":{"v":152.19422665072,"d":"152.19"}},"square inches"]
[]
[{"$nulls":13},"        The value of the derivative is y' = ",null,null,{"$f":"LOOKUP(x0,Sheet2!B3:B204,Sheet2!D3:D204)","v":0.26735397015237616}]
[]
[]
["Click each item below for suggestions and investigations"]
[null,null,"   Item 1"]
[null,null,"   Item 2"]
[null,null,"   Item 3"]
[]
[]
[]
["To access/download all the DIGMath Apps for Calculus"]
["     Click this link:",null,"DIGMath for Calculus"]
[]
["Created by:  Sheldon P. Gordon   "]
["                      Farmingdale State College    "]
["Development of this module was supported by the "]
["NSF's Division of Undergraduate Education  "]
["under grants DUE-0310123 and DUE-0442160.",{"$nulls":8},0]

{"sheet":"Sheet2","index":1,"n_rows":203,"n_cols":10,"rows_kept":203}
[null,"x","f(x)","f'(x)",null,null,"xl=",{"$f":"IF(x0<Sheet2!H7+80*Sheet2!H5,Sheet2!H7,x0-80*Sheet2!H5)","v":0},{"$f":"LOOKUP(Sheet1!P18,Sheet2!B3:B1002,Sheet2!C3:C1002)+LOOKUP(Sheet1!P18,Sheet2!B3:B1002,Sheet2!D3:D1002)*(H1-Sheet1!P18)","v":-644.4009987916462},"\"=yl"]
[{"$nulls":6},"xr=",{"$f":"IF(Sheet1!$P$18>Sheet2!H8-80*Sheet2!H5,Sheet2!H8,Sheet1!P18+80*Sheet2!H5)","v":30},{"$f":"LOOKUP(Sheet1!P18,Sheet2!B3:B1003,Sheet2!C3:C1003)+LOOKUP(Sheet1!P18,Sheet2!B3:B1003,Sheet2!D3:D1003)*(H2-Sheet1!P18)","v":988.2963498010306},"\"=yR"]
[0,{"$f":"0","v":{"v":0,"d":"0.0"}},{"$f":"x^2+SQRT(3)/18*(L-4*x)^2","v":346.41016151377545},{"$f":"2*x-2*SQRT(3)/9*(L-4*x)","v":-23.09401076758503}]
[1,{"$f":"B3+dd","v":0.3},332.78231911782984,-22.032130552233326,null,null,"dL=",{"$f":"L/200","v":0.3}]
[2,0.6,319.6116048510955,-20.970250336881627,null,null,"delta x = ",{"$f":"(xMax-xMin)/1000","v":0.1}]
[3,{"v":0.8999999999999999,"d":"0.9"},306.89801871357196,-19.908370121529924]
[4,1.2,294.64156070525956,-18.846489906178228,null,null,"xMin =",0,{"$f":"C3","v":346.41016151377545}]
[5,1.5,282.8422308261581,-17.784609690826525,null,null,"xMax =",100,{"$f":"C203","v":6717.691453623924}]
[6,1.8,271.50002907626765,-16.72272947547482]
[7,2.1,260.6149554555883,-15.660849260123126]
[8,2.4,250.1870099641199,-14.598969044771422,null,null,"Point"]
[9,{"v":2.6999999999999997,"d":"2.7"},240.21619260186262,-13.537088829419726,null,null,{"$f":"x0","v":6.6},0]
[10,{"v":2.9999999999999996,"d":"3.0"},230.70250336881628,-12.475208614068023]
[11,{"v":3.2999999999999994,"d":"3.3"},221.645942264981,-11.413328398716327,null,null,"Horizontal Line"]
[12,{"v":3.599999999999999,"d":"3.6"},213.0465092903567,-10.351448183364624,null,null,0,0]
[13,{"v":3.899999999999999,"d":"3.9"},204.90420444494345,-9.289567968012925,null,null,{"$f":"G12","v":6.6},0]
[14,{"v":4.199999999999999,"d":"4.2"},197.2190277287412,-8.227687752661222]
[15,{"v":4.499999999999999,"d":"4.5"},189.99097914174996,-7.1658075373095205,null,null,"Diagnonal Line"]
[16,{"v":4.799999999999999,"d":"4.8"},183.22005868396977,-6.103927321957823,null,null,0,200]
[17,{"v":5.099999999999999,"d":"5.1"},176.90626635540065,-5.042047106606125,null,null,997,0]
[18,{"v":5.399999999999999,"d":"5.4"},171.04960215604245,-3.9801668912544237]
[19,{"v":5.699999999999998,"d":"5.7"},165.65006608589528,-2.9182866759027224]
[20,{"v":5.999999999999998,"d":"6.0"},160.70765814495917,-1.8564064605510229,null,null,"Point on curve"]
[21,{"v":6.299999999999998,"d":"6.3"},156.2223783332341,-0.7945262451993251,null,null,"x=",{"$f":"G12*H5","v":0.66}]
[22,{"v":6.599999999999998,"d":"6.6"},152.19422665072,0.26735397015237616,null,"x0 =",{"$f":"x0","v":6.6},{"$f":"LOOKUP(x0+0.001,B3:B204,C3:C204)","v":152.19422665072}]
[23,{"v":6.899999999999998,"d":"6.9"},148.62320309741693,1.3292341855040775,null,"y0 =",{"$f":"Area","v":152.19422665072}]
[24,{"v":7.1999999999999975,"d":"7.2"},145.50930767332488,2.391114400855777]
[25,{"v":7.499999999999997,"d":"7.5"},142.85254037844388,3.4529946162074765,null,null,{"$f":"x0","v":6.6},0,0]
[26,{"v":7.799999999999997,"d":"7.8"},140.65290121277388,4.514874831559176,null,null,{"$f":"x0","v":6.6},{"$f":"LOOKUP(x0+0.001,B3:B204,C3:C204)","v":152.19422665072},{"$f":"LOOKUP(x0+0.001,B3:B204,D3:D204)","v":0.26735397015237616}]
[27,{"v":8.099999999999998,"d":"8.1"},138.91039017631488,5.576755046910879]
[28,{"v":8.399999999999999,"d":"8.4"},137.62500726906694,6.638635262262582]
[29,8.7,136.79675249103,7.700515477614285]
[30,{"v":9,"d":"9.0"},136.42562584220406,8.762395692965988]
[31,9.3,136.51162732258916,9.824275908317691]
[32,{"v":9.600000000000001,"d":"9.6"},137.05475693218528,10.886156123669394]
[33,{"$f":"B35+dd","v":{"v":9.900000000000002,"d":"9.9"}},138.05501467099245,11.948036339021098]
[34,{"v":10.200000000000003,"d":"10.2"},139.51240053901063,13.0099165543728]
[35,{"v":10.500000000000004,"d":"10.5"},141.42691453623982,14.071796769724504]
[36,{"v":10.800000000000004,"d":"10.8"},143.79855666268003,15.133676985076207]
[37,{"v":11.100000000000005,"d":"11.1"},146.62732691833128,16.19555720042791]
[38,{"v":11.400000000000006,"d":"11.4"},149.9132253031935,17.257437415779613]
[39,{"v":11.700000000000006,"d":"11.7"},153.65625181726682,18.319317631131316]
[40,{"v":12.000000000000007,"d":"12.0"},157.8564064605511,19.38119784648302]
[41,{"v":12.300000000000008,"d":"12.3"},162.51368923304645,20.443078061834722]
[42,{"v":12.600000000000009,"d":"12.6"},167.6281001347528,21.504958277186425]
[43,{"v":12.90000000000001,"d":"12.9"},173.1996391656702,22.56683849253813]
[44,{"v":13.20000000000001,"d":"13.2"},179.22830632579857,23.62871870788983]
[45,{"v":13.50000000000001,"d":"13.5"},185.714101615138,24.690598923241534]
[46,{"v":13.800000000000011,"d":"13.8"},192.65702503368843,25.752479138593237]
[47,{"v":14.100000000000012,"d":"14.1"},200.0570765814499,26.81435935394494]
[48,{"v":14.400000000000013,"d":"14.4"},207.91425625842237,27.876239569296644]
[49,{"v":14.700000000000014,"d":"14.7"},216.2285640646059,28.938119784648347]
[50,{"v":15.000000000000014,"d":"15.0"},225.00000000000043,30.00000000000005]
[51,{"v":15.300000000000015,"d":"15.3"},234.228564064606,31.061880215351753]
[52,{"v":15.600000000000016,"d":"15.6"},243.91425625842257,32.123760430703456]
[53,{"v":15.900000000000016,"d":"15.9"},254.05707658145016,33.18564064605516]
[54,{"v":16.200000000000017,"d":"16.2"},264.6570250336888,34.24752086140686]
[55,{"v":16.500000000000018,"d":"16.5"},275.7141016151384,35.30940107675857]
[56,{"v":16.80000000000002,"d":"16.8"},287.2283063257991,36.37128129211027]
[57,{"v":17.10000000000002,"d":"17.1"},299.19963916567076,37.433161507461975]
[58,{"v":17.40000000000002,"d":"17.4"},311.6281001347535,38.495041722813674]
[59,{"v":17.70000000000002,"d":"17.7"},324.5136892330472,39.55692193816538]
[60,{"v":18.00000000000002,"d":"18.0"},337.856406460552,40.61880215351708]
[61,{"v":18.300000000000022,"d":"18.3"},351.65625181726773,41.68068236886879]
[62,{"v":18.600000000000023,"d":"18.6"},365.91322530319457,42.74256258422049]
[63,{"v":18.900000000000023,"d":"18.9"},380.6273269183324,43.80444279957219]
[64,{"v":19.200000000000024,"d":"19.2"},{"$f":"x^2+SQRT(3)/18*(L-4*x)^2","v":395.7985566626813},{"$f":"2*x-2*SQRT(3)/9*(L-4*x)","v":44.86632301492389}]
[65,{"$f":"B67+dd","v":{"v":19.500000000000025,"d":"19.5"}},411.4269145362411,45.9282032302756]
[66,{"v":19.800000000000026,"d":"19.8"},427.512400539012,46.9900834456273]
[67,{"v":20.100000000000026,"d":"20.1"},444.0550146709939,48.051963660979006]
[68,{"v":20.400000000000027,"d":"20.4"},461.0547569321868,49.113843876330705]
[69,{"v":20.700000000000028,"d":"20.7"},478.5116273225908,50.17572409168241]
[70,{"v":21.00000000000003,"d":"21.0"},496.4256258422058,51.23760430703411]
[71,{"v":21.30000000000003,"d":"21.3"},514.7967524910318,52.29948452238581]
[72,{"v":21.60000000000003,"d":"21.6"},533.6250072690689,53.36136473773752]
[73,{"v":21.90000000000003,"d":"21.9"},552.9103901763168,54.423244953089224]
[74,{"v":22.20000000000003,"d":"22.2"},572.652901212776,55.48512516844092]
[75,{"v":22.500000000000032,"d":"22.5"},592.8525403784461,56.54700538379262]
[76,{"v":22.800000000000033,"d":"22.8"},613.5093076733272,57.60888559914433]
[77,{"v":23.100000000000033,"d":"23.1"},634.6232030974193,58.670765814496036]
[78,{"v":23.400000000000034,"d":"23.4"},656.1942266507225,59.732646029847736]
[79,{"v":23.700000000000035,"d":"23.7"},678.2223783332366,60.794526245199435]
[80,{"v":24.000000000000036,"d":"24.0"},700.7076581449619,61.85640646055114]
[81,{"v":24.300000000000036,"d":"24.3"},723.6500660858981,62.91828667590285]
[82,{"v":24.600000000000037,"d":"24.6"},747.0496021560452,63.98016689125455]
[83,{"v":24.900000000000038,"d":"24.9"},770.9062663554037,65.04204710660625]
[84,{"v":25.20000000000004,"d":"25.2"},795.2200586839729,66.10392732195795]
[85,{"v":25.50000000000004,"d":"25.5"},819.9909791417533,67.16580753730966]
[86,{"v":25.80000000000004,"d":"25.8"},845.2190277287445,68.22768775266135]
[87,{"v":26.10000000000004,"d":"26.1"},870.9042044449469,69.28956796801306]
[88,{"v":26.40000000000004,"d":"26.4"},897.0465092903603,70.35144818336477]
[89,{"v":26.700000000000042,"d":"26.7"},923.6459422649848,71.41332839871647]
[90,{"v":27.000000000000043,"d":"27.0"},950.7025033688201,72.47520861406818]
[91,{"v":27.300000000000043,"d":"27.3"},978.2161926018666,73.53708882941987]
[92,{"v":27.600000000000044,"d":"27.6"},1006.187009964124,74.59896904477158]
[93,{"v":27.900000000000045,"d":"27.9"},1034.6149554555925,75.66084926012329]
[94,{"v":28.200000000000045,"d":"28.2"},1063.500029076272,76.72272947547498]
[95,{"v":28.500000000000046,"d":"28.5"},1092.8422308261627,77.78460969082668]
[96,{"v":28.800000000000047,"d":"28.8"},1122.641560705264,78.84648990617839]
[97,{"v":29.100000000000048,"d":"29.1"},1152.8980187135767,79.9083701215301]
[98,{"v":29.40000000000005,"d":"29.4"},1183.6116048511003,80.9702503368818]
[99,{"v":29.70000000000005,"d":"29.7"},1214.782319117835,82.0321305522335]
[100,{"v":30.00000000000005,"d":"30.0"},1246.4101615137806,83.0940107675852]
[101,{"v":30.30000000000005,"d":"30.3"},1278.4951320389373,84.15589098293691]
[102,{"v":30.60000000000005,"d":"30.6"},1311.037230693305,85.2177711982886]
[103,{"v":30.900000000000052,"d":"30.9"},1344.036457476884,86.27965141364031]
[104,{"v":31.200000000000053,"d":"31.2"},1377.4928123896734,87.34153162899202]
[105,{"v":31.500000000000053,"d":"31.5"},1411.4062954316744,88.40341184434372]
[106,{"v":31.800000000000054,"d":"31.8"},1445.7769066028861,89.46529205969543]
[107,{"v":32.10000000000005,"d":"32.1"},1480.6046459033084,90.52717227504712]
[108,{"v":32.40000000000005,"d":"32.4"},1515.889513332942,91.5890524903988]
[109,{"v":32.700000000000045,"d":"32.7"},1551.6315088917863,92.65093270575049]
[110,{"v":33.00000000000004,"d":"33.0"},1587.8306325798417,93.71281292110218]
[111,{"v":33.30000000000004,"d":"33.3"},1624.486884397108,94.77469313645388]
[112,{"v":33.60000000000004,"d":"33.6"},1661.6002643435859,95.83657335180557]
[113,{"v":33.900000000000034,"d":"33.9"},1699.1707724192743,96.89845356715725]
[114,{"v":34.20000000000003,"d":"34.2"},1737.1984086241737,97.96033378250894]
[115,{"v":34.50000000000003,"d":"34.5"},1775.683172958284,99.02221399786063]
[116,{"v":34.800000000000026,"d":"34.8"},1814.6250654216055,100.08409421321232]
[117,{"v":35.10000000000002,"d":"35.1"},1854.024086014138,101.14597442856402]
{"$rows_left_out":84}
{"sheet":"Sheet3","index":2,"n_rows":1003,"n_cols":2,"rows_kept":1003}
[{"$f":"xMin","v":0},{"$f":"9","v":9}]
[{"$f":"A1+dx","v":0.1},{"$f":"9","v":9}]
[0.2,{"$f":"9","v":9}]
[0.30000000000000004,{"$f":"9","v":9}]
[0.4,{"$f":"9","v":9}]
[0.5,{"$f":"9","v":9}]
[0.6,{"$f":"9","v":9}]
[0.7,{"$f":"9","v":9}]
[0.7999999999999999,{"$f":"9","v":9}]
[0.8999999999999999,{"$f":"9","v":9}]
[0.9999999999999999,{"$f":"9","v":9}]
[1.0999999999999999,{"$f":"9","v":9}]
[1.2,{"$f":"9","v":9}]
[1.3,{"$f":"9","v":9}]
[1.4000000000000001,{"$f":"9","v":9}]
[1.5000000000000002,{"$f":"9","v":9}]
[1.6000000000000003,{"$f":"9","v":9}]
[1.7000000000000004,{"$f":"9","v":9}]
[1.8000000000000005,{"$f":"9","v":9}]
[1.9000000000000006,{"$f":"9","v":9}]
[2.0000000000000004,{"$f":"9","v":9}]
[2.1000000000000005,{"$f":"9","v":9}]
[2.2000000000000006,{"$f":"9","v":9}]
[2.3000000000000007,{"$f":"9","v":9}]
[2.400000000000001,{"$f":"9","v":9}]
[2.500000000000001,{"$f":"9","v":9}]
[2.600000000000001,{"$f":"9","v":9}]
[2.700000000000001,{"$f":"9","v":9}]
[2.800000000000001,{"$f":"9","v":9}]
[2.9000000000000012,{"$f":"9","v":9}]
[3.0000000000000013,{"$f":"9","v":9}]
[3.1000000000000014,{"$f":"9","v":9}]
[3.2000000000000015,{"$f":"9","v":9}]
[3.3000000000000016,{"$f":"9","v":9}]
[3.4000000000000017,{"$f":"9","v":9}]
[3.5000000000000018,{"$f":"9","v":9}]
[3.600000000000002,{"$f":"9","v":9}]
[3.700000000000002,{"$f":"9","v":9}]
[3.800000000000002,{"$f":"9","v":9}]
[3.900000000000002,{"$f":"9","v":9}]
[4.000000000000002,{"$f":"9","v":9}]
[4.100000000000001,{"$f":"9","v":9}]
[4.200000000000001,{"$f":"9","v":9}]
[4.300000000000001,{"$f":"9","v":9}]
[4.4,{"$f":"9","v":9}]
[4.5,{"$f":"9","v":9}]
[4.6,{"$f":"9","v":9}]
[4.699999999999999,{"$f":"9","v":9}]
[4.799999999999999,{"$f":"9","v":9}]
[4.899999999999999,{"$f":"9","v":9}]
[4.999999999999998,{"$f":"9","v":9}]
[5.099999999999998,{"$f":"9","v":9}]
[5.1999999999999975,{"$f":"9","v":9}]
[5.299999999999997,{"$f":"9","v":9}]
[5.399999999999997,{"$f":"9","v":9}]
[5.4999999999999964,{"$f":"9","v":9}]
[5.599999999999996,{"$f":"9","v":9}]
[5.699999999999996,{"$f":"9","v":9}]
[5.799999999999995,{"$f":"9","v":9}]
[5.899999999999995,{"$f":"9","v":9}]
[5.999999999999995,{"$f":"9","v":9}]
[6.099999999999994,{"$f":"9","v":9}]
[6.199999999999994,{"$f":"9","v":9}]
[6.299999999999994,{"$f":"9","v":9}]
[6.399999999999993,{"$f":"9","v":9}]
[{"$f":"A65+dx","v":6.499999999999993},{"$f":"9","v":9}]
[6.5999999999999925,{"$f":"9","v":9}]
[6.699999999999992,{"$f":"9","v":9}]
[6.799999999999992,{"$f":"9","v":9}]
[6.8999999999999915,{"$f":"9","v":9}]
[6.999999999999991,{"$f":"9","v":9}]
[7.099999999999991,{"$f":"9","v":9}]
[7.19999999999999,{"$f":"9","v":9}]
[7.29999999999999,{"$f":"9","v":9}]
[7.39999999999999,{"$f":"9","v":9}]
[7.499999999999989,{"$f":"9","v":9}]
[7.599999999999989,{"$f":"9","v":9}]
[7.699999999999989,{"$f":"9","v":9}]
[7.799999999999988,{"$f":"9","v":9}]
[7.899999999999988,{"$f":"9","v":9}]
[7.999999999999988,{"$f":"9","v":9}]
[8.099999999999987,{"$f":"9","v":9}]
[8.199999999999987,{"$f":"9","v":9}]
[8.299999999999986,{"$f":"9","v":9}]
[8.399999999999986,{"$f":"9","v":9}]
[8.499999999999986,{"$f":"9","v":9}]
[8.599999999999985,{"$f":"9","v":9}]
[8.699999999999985,{"$f":"9","v":9}]
[8.799999999999985,{"$f":"9","v":9}]
[8.899999999999984,{"$f":"9","v":9}]
[8.999999999999984,{"$f":"9","v":9}]
[9.099999999999984,{"$f":"9","v":9}]
[9.199999999999983,{"$f":"9","v":9}]
[9.299999999999983,{"$f":"9","v":9}]
[9.399999999999983,{"$f":"9","v":9}]
[9.499999999999982,{"$f":"9","v":9}]
[9.599999999999982,{"$f":"9","v":9}]
[9.699999999999982,{"$f":"9","v":9}]
[9.799999999999981,{"$f":"9","v":9}]
[9.89999999999998,{"$f":"9","v":9}]
[9.99999999999998,{"$f":"9","v":9}]
[10.09999999999998,{"$f":"9","v":9}]
[10.19999999999998,{"$f":"9","v":9}]
[10.29999999999998,{"$f":"9","v":9}]
[10.399999999999979,{"$f":"9","v":9}]
[10.499999999999979,{"$f":"9","v":9}]
[10.599999999999978,{"$f":"9","v":9}]
[10.699999999999978,{"$f":"9","v":9}]
[10.799999999999978,{"$f":"9","v":9}]
[10.899999999999977,{"$f":"9","v":9}]
[10.999999999999977,{"$f":"9","v":9}]
[11.099999999999977,{"$f":"9","v":9}]
[11.199999999999976,{"$f":"9","v":9}]
[11.299999999999976,{"$f":"9","v":9}]
[11.399999999999975,{"$f":"9","v":9}]
[11.499999999999975,{"$f":"9","v":9}]
[11.599999999999975,{"$f":"9","v":9}]
[11.699999999999974,{"$f":"9","v":9}]
[11.799999999999974,{"$f":"9","v":9}]
[11.899999999999974,{"$f":"9","v":9}]
{"$rows_left_out":883}