{"text_format":"3","workbook":"xlsx","n_sheets":3,"sheets":["Sheet1","Sheet2","Sheet3"],"not_rendered":{"charts":1,"images":2,"macros":1,"defined_names":7,"comments":1},"read":"whole","date_system":"1900"}

{"sheet":"Sheet1","index":0,"n_rows":40,"n_cols":14,"rows_kept":40}
["       Approximating Polar Coordinate"]
["     Curves With Newton Interpolation"]
[]
[null,"   This graphing utility produces the graph "]
[null,"         of any polar coordinate function"]
[null,null,"               r = f(Q)"]
[null,"  and its Newton Interpolating Polynomials"]
[null,"  on any interval from Q = a  to  Q = b."]
[]
["Enter the function  in terms of Q:  r = f(Q) =",{"$nulls":4},"(sin(Q))^4+(cos(Q))^2"]
[]
[]
["Now enter the interval for Q (in radians):  "]
[null,"   Starting angle a =",null,-3]
[null,"    Ending angle b =",null,3]
[]
[]
["Select the degree n (1 to 6) for the interpolating polynomial:  ",{"$nulls":7},"The graph of the polar function r =",{"$nulls":4},{"$f":"F10","v":"(sin(Q))^4+(cos(Q))^2"}]
[null,6,null,null,"n =",{"$f":"B19","v":6},{"$nulls":3},"and the Newton Interpolating Polynomial"]
[]
[{"$nulls":8},"Now trace along the two curves:"]
[{"$nulls":8},"Q =",{"$f":"Sheet1!D14+K22*Sheet2!B12","v":-1.4477611940298507},52]
[{"$nulls":8},"r =",{"$f":"LOOKUP(J22,Sheet2!C3:C204,Sheet2!D3:D204)","v":0.9914167393082937}]
["Click each item below for suggestions and investigations",{"$nulls":7},"r =",{"$f":"LOOKUP(J22,Sheet2!C3:C204,Sheet2!Y3:Y204)","v":{"v":0.7253580610829317,"d":"0.725"}}]
[null,null,"   Item 1"]
[null,null,"   Item 2"]
[null,null,"   Item 3"]
[null,null,"   Item 4"]
[null,null,"   Item 5"]
[]
[]
[]
["To access/download all the DIGMath Apps for Numerical Analysis"]
["      Click this link:",null,"DIGMath Modules for Numerical Analysis"]
[]
["Created by:  Sheldon P. Gordon   "]
["                      Farmingdale State College    "]
["Development of this module was supported by the "]
["NSF's Division of Undergraduate Education  "]
["under grants DUE-0310123 and DUE-0442160."]

{"sheet":"Sheet2","index":1,"n_rows":211,"n_cols":27,"rows_kept":211}
[null,null,"Q","r = f(Q)","x","y",null,"Tracing point",null,null,"r","Dr","D^2 r","D^3 r","D^4 r","D^5 r","D^6 r",null,"linear","quad","cubic","quartic","quintic","6th","interpol","x","y"]
[{"$nulls":10},{"$f":"D205","v":0.9804817448415615},{"$f":"K3-K2","v":-0.12366924906763799},{"$f":"L3-L2","v":0.06015130068576302},{"$f":"M3-M2","v":0.21007210030406342},{"$f":"N3-N2","v":-0.8937064065097928},{"$f":"O3-O2","v":2.2609750189212514},-4.521950037842503]
[null,null,{"$f":"Sheet1!D14","v":-3},{"$f":"(SIN(Q))^4+(COS(Q))^2","v":0.9804817448415615},{"$f":"D3*COS($C3)","v":-0.9706695704468583},{"$f":"D3*SIN($C3)","v":-0.1383655917345938},null,0,0,null,{"$f":"D206","v":0.8568124957739235},{"$f":"K4-K3","v":-0.06351794838187497},0.27022340098982645,-0.6836343062057294,1.3672686124114588,-2.2609750189212514,null,null,{"$f":"c00+$L$2*(Q-B$16)/dQQ","v":0.9804817448415615},{"$f":"S3+$M$2*(Q-B$16)*(Q-B$17)/2/dQQ^2","v":0.9804817448415615},{"$f":"T3+$N$2*(Q-B$16)*(Q-B$17)*(Q-B$18)/6/dQQ^3","v":0.9804817448415615},{"$f":"U3+$O$2*(Q-$B$16)*(Q-$B$17)*(Q-$B$18)*(Q-$B$19)/24/dQQ^4","v":0.9804817448415615},{"$f":"V3+$P$2*(Q-$B$16)*(Q-$B$17)*(Q-$B$18)*(Q-$B$19)*(Q-$B$20)/120/dQQ^5","v":0.9804817448415615},{"$f":"W3+$Q$2*(Q-$B$16)*(Q-$B$17)*(Q-$B$18)*(Q-$B$19)*(Q-$B$20)*(Q-$B$21)/720/dQQ^6","v":0.9804817448415615},{"$f":"IF(n=1,S3,IF(n=2,T3,IF(n=3,U3,IF(n=4,V3,IF(n=5,W3,X3)))))","v":0.9804817448415615},{"$f":"Y3*COS($C3)","v":-0.9706695704468583},{"$f":"Y3*SIN($C3)","v":-0.1383655917345938}]
[null,null,{"$f":"C3+Sheet2!B$12","v":-2.970149253731343},0.971741172491173,{"$f":"D4*COS(C4)","v":-0.9574950023606328},{"$f":"D4*SIN(C4)","v":-0.16578367461523877},null,{"$f":"LOOKUP(Sheet1!$J$22,Sheet2!C3:C204,E3:E204)","v":0.09225091771512245},{"$f":"LOOKUP(Sheet1!J22,Sheet2!C3:C204,F3:F204)","v":-0.9871154538155134},null,0.7932945473920485,0.20670545260795148,-0.41341090521590296,{"$f":"M5-M4","v":0.6836343062057294},{"$f":"N5-N4","v":-0.8937064065097928},{"$nulls":3},0.9767901254664081,0.9759191442802698,0.9779167510566008,0.9842271203928896,0.9969034201649933,1.017904454115792,1.017904454115792,{"$f":"Y4*COS($C4)","v":-1.0029815091583476},{"$f":"Y4*SIN($C4)","v":-0.1736593504399111}]
[null,null,{"$f":"C4+Sheet2!B$12","v":-2.9402985074626864},0.961622992086428,-0.9422065257365054,-0.1922645099044499,{"$nulls":4},1,-0.20670545260795148,0.27022340098982645,{"$f":"M6-M5","v":-0.21007210030406342},{"$nulls":4},0.9730985060912547,0.9714101425612021,0.9752237554978339,0.9871497481630815,1.0109266108935127,1.0500815440466105,1.0500815440466105,-1.0288789801182896,-0.20995069282586784]
[null,null,{"$f":"C5+Sheet2!B$12","v":-2.9104477611940296},0.9502712879552515,-0.9249985828223873,-0.21769966120485276,{"$nulls":4},0.7932945473920485,0.06351794838187497,0.06015130068576302,{"$nulls":5},0.9694068867161013,0.9669547396843582,0.9724083458765233,0.9892898090255902,1.022691423736096,1.0773637184612526,1.0773637184612526,-1.048710958009966,-0.24681553518058064]
[null,null,{"$f":"C6+Sheet2!B$12","v":-2.880597014925373},0.9378477099788577,-0.9060861278821631,-0.24200466105448462,null,"Start line:",null,null,0.8568124957739235,0.12366924906763799,{"$nulls":6},0.9657152673409479,0.9625529356497383,0.9694761099039314,0.990686774250542,1.0323337725448687,1.100087844396833,1.100087844396833,-1.062831763253154,-0.2838695270892284]
[null,null,{"$f":"C7+Sheet2!B$12","v":-2.850746268656716},0.9245291716744545,-0.8857003394146412,-0.26512091210963024,null,0,0,null,0.9804817448415615,{"$nulls":7},0.9620236479657945,0.9582047304573422,0.9664326352913207,0.991379405504736,1.0399854319036175,1.118577265633152,1.118577265633152,-1.0715987057914471,-0.3207667578435065]
[null,null,{"$f":"C8+Sheet2!B$12","v":-2.820895522388059},0.9105053309215976,-0.8640840299565891,-0.28701698000402065,null,{"$f":"1.2*D3*COS(C3)","v":-1.16480348453623},{"$f":"1.2*D3*SIN(C3)","v":-0.16603871008151258},{"$nulls":9},0.9583320285906411,0.95391012410717,0.9632835097499537,0.9914057548516445,1.0457740907163082,1.1331421130261907,1.1331421130261907,-1.0753698746015439,-0.35719837781395386]
[null,null,{"$f":"C9+Sheet2!B$12","v":-2.7910447761194024},0.895975889207013,-0.8414868519874543,-0.3076892457862992,{"$nulls":12},0.9546404092154878,0.9496691165992217,0.9600343209910928,0.9908031647514126,1.0498234057956017,1.1440796116422918,1.1440796116422918,-1.0745020735725017,-0.39289114480218484]
[null,null,{"$f":"C10+Sheet2!B$12","v":-2.7611940298507456},0.8811477478470268,-0.8181604026500707,-0.32716190039697696,{"$nulls":12},0.9509487898403344,0.9454817079334974,0.9566906567260005,0.9896082680608588,1.0522530554513685,1.151674384693023,1.151674384693023,-1.0693489038637343,-0.4276059052018378]
["delta Q = ",{"$f":"(Sheet1!D15-Sheet1!D14)/201","v":0.029850746268656716},{"$f":"C11+Sheet2!B$12","v":-2.7313432835820888},0.8662320616833948,-0.7943533319447204,-0.3454862786227345,null,"End line",{"$nulls":10},0.947257170465181,0.9413478981099969,0.9532581046659392,0.9878569880334739,1.0531787930792051,1.1561987542707315,1.1561987542707315,-1.0602589923310572,-0.4611360195845932]
[null,null,{"$f":"C12+Sheet2!B$12","v":-2.701492537313432},0.8514412322083269,-0.7703065587025576,-0.3627395450240534,null,0,0,{"$nulls":9},0.9435655510900276,0.9372676871287202,0.9497422525221715,0.9855845383194225,1.0527125007489502,1.1579130388847771,1.1579130388847771,-1.0475743651112206,-0.49330574209226724]
["dQQ =",{"$f":"(Sheet1!D15-Sheet1!D14)/n","v":1},{"$f":"C13+Sheet2!B$12","v":-2.671641791044775},0.836985882937031,-0.7462486960084861,-0.3790227591339542,null,{"$f":"1.2*D204*COS(C204)","v":-1.164803484536235},{"$f":"1.2*D204*SIN(C204)+1","v":1.166038710081501},{"$nulls":9},0.9398739317148742,0.9332410749896676,0.9461486880059597,0.9828254229655419,1.0509622427932002,1.157065847798459,1.157065847798459,-1.031628964978032,-0.5239685627591806]
[null,null,{"$f":"C14+Sheet2!B$12","v":-2.6417910447761184},0.823071860098904,-0.7223917828835706,-0.3944583614387783,{"$nulls":12},0.9361823123397208,0.9292680616928387,0.9424829988285665,0.979613436415342,1.048032319395824,1.1538943721666197,1.1538943721666197,-1.012747310628015,-0.5530055216121448]
["Q00 =",{"$f":"QMin","v":-3},{"$f":"C15+Sheet2!B$12","v":-2.6119402985074616},0.8098973013579482,-0.6989274120625705,-0.4091871349571063,{"$nulls":12},0.9324906929645675,0.925348647238234,0.9387507727012543,0.9759816635090068,1.0440233201804812,1.1486246729739418,1.1486246729739418,-0.9912432956213539,-0.5803235030999623]
["Q01 =",{"$f":"B16+dQQ","v":-2},{"$f":"C16+Sheet2!B$12","v":-2.5820895522388048},0.7976498143042597,-0.6760233347695084,-0.4233647093307769,null,"Approx Point",{"$nulls":10},0.9287990735894142,0.9214828316258529,0.9349575973352852,0.9719624794833917,1.0390321777991343,1.1414719657739252,1.1414719657739252,-0.9674191242951238,-0.6058535190917396]
["Q02 =",{"$f":"B17+dQQ","v":-1},{"$f":"C17+Sheet2!B$12","v":-2.552238805970148},0.7865038048952644,-0.6538206127028698,-0.4371576849599835,null,0,0,{"$nulls":9},0.9251074542142608,0.9176706148556957,0.931109060441922,0.9675875499720265,1.0331522215205682,1.1326409022285544,1.1326409022285544,-0.9415643815811164,-0.6295489883550633]
["Q03 =",{"$f":"B18+dQQ","v":0},{"$f":"C18+Sheet2!B$12","v":-2.522388059701491},0.7766179938900795,-0.6324313752303955,-0.450739463612897,null,{"$f":"Sheet1!J24*COS(Sheet1!J22)","v":0.08901953706398393},{"$f":"Sheet1!J24*SIN(Sheet1!J22)","v":-0.7198748771827671},{"$nulls":9},0.9214158348391074,0.9139119969277625,0.9272107497324271,0.9628878310051134,1.026473230818904,1.1223258484486478,1.1223258484486478,-0.9139552333002745,-0.6513840200826374]
["Q04 =",{"$f":"B19+dQQ","v":1},{"$f":"C19+Sheet2!B$12","v":-2.4925373134328344},0.7681331566433337,-0.6119372263333043,-0.46428587891767137,{"$nulls":12},0.917724215463954,0.9102069778420531,0.923268252918063,0.9578935690095279,1.0190814889621145,1.1107111601348931,1.1107111601348931,-0.8848537531702861,-0.6713517086808216]
["Q05 =",{"$f":"B20+dQQ","v":2},{"$f":"C20+Sheet2!B$12","v":-2.4626865671641776},0.7611701184440948,-0.5923883314303403,-0.4779707250422085,{"$nulls":12},0.9140325960888006,0.9065555575985677,0.9192871577100922,0.9526343008088183,1.0110598366005408,1.097971454519571,1.097971454519571,-0.8545073724524617,-0.6894624466671206]
["Q06 =",{"$f":"B21+dQQ","v":3},{"$f":"C21+Sheet2!B$12","v":-2.4328358208955208},0.7558280339465709,-0.5738031991733802,-0.4919612845722039,{"$nulls":12},0.9103409767136472,0.9029577361973061,0.9152730518197771,0.9471388536232058,1.0024877253554085,1.0842718791089618,1.0842718791089618,-0.8231484478788662,-0.7057422621475157]
[null,null,{"$f":"C22+Sheet2!B$12","v":-2.402985074626864},0.7521829751937334,-0.5561691579720507,-0.5064139570469566,{"$nulls":12},0.9066493573384938,0.8994135136382684,0.9112315229583801,0.9414353450695848,0.9934412714073421,1.0697683772264384,1.0697683772264384,-0.7909939432408893,-0.7202311869600734]
[null,null,{"$f":"C23+Sheet2!B$12","v":-2.373134328358207},0.7502868483406062,-0.5394435117149069,-0.521470087791782,{"$nulls":12},0.9029577379633404,0.8959228899214546,0.9071681588371637,0.9355511831615227,0.9839933090848816,1.0546079503562453,1.0546079503562453,-0.7582452197860866,-0.7329816611799712]
[null,null,{"$f":"C24+Sheet2!B$12","v":-2.3432835820895503},0.7501666545032359,-0.5235553442477944,-0.5372520926326401,{"$nulls":12},0.8992661185881871,0.8924858650468647,0.9030885471673904,0.92951306630926,0.9742134444529985,1.0389289172879632,1.0389289172879632,-0.725087930361135,-0.7440569792843458]
[null,null,{"$f":"C25+Sheet2!B$12","v":-2.3134328358208935},0.7518241052589606,-0.5084079279759128,-0.553859967879676,{"$nulls":12},0.8955744992130337,0.8891024390144987,0.8989982756603226,0.9233469833197099,0.9641681089016112,1.0228611700616583,1.0228611700616583,-0.6916920120550598,-0.753529782874657]
[null,null,{"$f":"C26+Sheet2!B$12","v":-2.2835820895522367},0.7552355982733033,-0.4938816787884897,-0.5713682667564742,{"$nulls":12},0.8918828798378803,0.8857726118243566,0.894902932027223,0.917078213396459,0.9539206127341009,1.0065264267137188,1.0065264267137188,-0.6582117719382975,-0.7614806044509169]
[null,null,{"$f":"C27+Sheet2!B$12","v":-2.25373134328358},0.7603525534005733,-0.4798375876544603,-0.5898236134105855,{"$nulls":12},0.8881912604627269,0.8824963834764383,0.8908081039793537,0.9107313261397665,0.9435311987558271,0.9900384808233758,0.9900384808233758,-0.6247860603594273,-0.7679964663275501]
[null,null,{"$f":"C28+Sheet2!B$12","v":-2.223880597014923},0.7671021044720485,-0.46612104896517076,-0.6092428139888517,{"$nulls":12},0.8844996410875735,0.879273753970744,0.8867193792279775,0.904330181546565,0.9330570958626441,0.9735034478599096,0.9735034478599096,-0.5915385261522326,-0.7731695383761419]
[null,null,{"$f":"C29+Sheet2!B$12","v":-2.1940298507462663},0.775388136920581,-0.4525659972316186,-0.6296116112548436,{"$nulls":12},0.8808080217124201,0.8761047233072736,0.8826423454843566,0.8978979300104599,0.9225525726294159,0.9570200083305435,0.9570200083305435,-0.5585779480207421,-0.7770958578772188]
[null,null,{"$f":"C30+Sheet2!B$12","v":-2.1641791044776095},0.7850926564657026,-0.43899925726451455,-0.6508841151522891,{"$nulls":12},0.8771164023372667,0.8729892914860271,0.8785825904597536,0.8914570123217296,0.9120689908985327,0.9406796477290205,0.9406796477290205,-0.5259986363086375,-0.779874114362727]
[null,null,{"$f":"C31+Sheet2!B$12","v":-2.1343283582089527},0.7960774693689593,-0.42524500861647296,-0.6729829268886858,{"$nulls":12},0.8734247829621133,0.8699274585070045,0.874545701865431,0.8850291596673258,0.9016548593684263,0.9245668932848682,0.9245668932848682,-0.49388089932137935,-0.7816045019342829]
[null,null,{"$f":"C32+Sheet2!B$12","v":-2.104477611940296},0.8081861503323985,-0.4111292629403796,-0.6957999588554187,{"$nulls":12},0.86973316358696,0.8669192243702056,0.8705372674126511,0.8786353936308725,0.8913558871820857,0.9087595475133474,0.9087595475133474,-0.462291568354061,-0.7823876411507319]
[null,null,{"$f":"C33+Sheet2!B$12","v":-2.074626865671639},0.8212462700170615,-0.3964842530603038,-0.7191979373525409,{"$nulls":12},0.8660415442118066,0.8639645890756308,0.8665628748126766,0.8722960261926677,0.8812150375155737,0.8933289185660879,0.8933289185660879,-0.43128457558472194,-0.7823235721932212]
[null,null,{"$f":"C34+Sheet2!B$12","v":-2.0447761194029823},0.8350718504612881,-0.3811526349545533,-0.7430125599880805,{"$nulls":12},0.8623499248366532,0.8610635526232798,0.8626281117767697,0.8660306597296814,0.8712725811665416,0.8783400473824078,0.8783400473824078,-0.4009015790209918,-0.7815108206379524]
[null,null,{"$f":"C35+Sheet2!B$12","v":-2.0149253731343255},0.8494660134333426,-0.3649914084576189,-0.767055265108362,{"$nulls":12},0.8586583054614998,0.8582161150131528,0.858738566016193,0.8598581870155575,0.861566150142746,0.8638519316413215,0.8638519316413215,-0.371172628736773,-0.7800455367971001]
[null,null,{"$f":"C36+Sheet2!B$12","v":-1.9850746268656687},0.8642237840054318,-0.3478754691927134,-0.7911165570095323,{"$nulls":12},0.8549666860863464,0.8554222762452496,0.8548998252422091,0.8537967912206125,0.8521307912505637,0.8499177465142302,0.8499177465142302,-0.34211686870445257,-0.7780207092280306]
[null,null,{"$f":"C37+Sheet2!B$12","v":-1.955223880597012},0.8791350094258272,-0.32970071289666064,-0.8149698182838326,{"$nulls":12},0.851275066711193,0.8526820363195703,0.8511174771660802,0.8478639459118357,0.8429990196835082,0.8365850622183004,0.8365850622183004,-0.3137432686160613,-0.7755254526609089]
[null,null,{"$f":"C38+Sheet2!B$12","v":-1.925373134328355},0.8939873517239367,-0.31038662369802394,-0.8383755297429184,{"$nulls":12},0.8475834473360397,0.849995395236115,0.8473971094990691,0.84207641505289,0.8342008726107453,0.823896058370526,0.823896058370526,-0.286051380193023,-0.7726443702559127]
[null,null,{"$f":"C39+Sheet2!B$12","v":-1.8955223880596983},0.9085693114332042,-0.2898782898227403,-0.8610858091779531,{"$nulls":12},0.8438918279608862,0.8473623529948834,0.8437443099524378,0.8364502530041104,0.8257639627656077,0.8118877351424774,0.8118877351424774,-0.2590321126078024,-0.7694569897744254]
[null,null,{"$f":"C40+Sheet2!B$12","v":-1.8656716417910415},0.9226732393735909,-0.26814780336068395,-0.8828491729672718,{"$nulls":12},0.840200208585733,0.8447829095958759,0.8401646662374491,0.8310008045225058,0.8177135320341132,0.8005921212157368,0.8005921212157368,-0.23266852178092418,-0.7660372729345437]
[null,null,{"$f":"C41+Sheet2!B$12","v":-1.8358208955223847},0.9360982936054298,-0.2451950148354647,-0.9034154193895706,{"$nulls":12},0.8365085892105795,0.842257065039092,0.8366637660653653,0.8257427047617577,0.8100725050434785,0.7900364785380171,0.7900364785380171,-0.206936608472591,-0.7624531969207109]
[null,null,{"$f":"C42+Sheet2!B$12","v":-1.805970149253728},0.9486532994472112,-0.2210476280612993,-0.922540529559842,{"$nulls":12},0.8328169698354262,0.8397848193245323,0.8332471971474491,0.8206898792722209,0.8028615427506358,0.7802435038799681,0.7802435038799681,-0.18180612025848064,-0.7587664067309838]
[null,null,{"$f":"C43+Sheet2!B$12","v":-1.776119402985071},0.9601594718302326,-0.19576063581399952,-0.9399914812438515,{"$nulls":12},0.8291253504602727,0.8373661724521962,0.8299205471949627,0.8158555440009226,0.7960990960307478,0.771231527192667,0.771231527192667,-0.15724135266327174,-0.7550319367739077]
[null,null,{"$f":"C44+Sheet2!B$12","v":-1.7462686567164143},0.9704529612234054,-0.16941511185048083,-0.9555508724416327,{"$nulls":12},0.8254337310851194,0.8350011244220843,0.8266894039191688,0.8112522052915639,0.789801459265725,0.7630147067657969,0.7630147067657969,-0.13320194492201798,-0.7512979998708147]
[null,null,{"$f":"C45+Sheet2!B$12","v":-1.7164179104477575},0.9793871868738786,-0.14211638944617447,-0.969021255527201,{"$nulls":12},0.821742111709966,0.8326896752341962,0.8235593550313297,0.8068916598845182,0.7839828239327399,0.7556032211865071,0.7556032211865071,-0.10964366604762817,-0.7476058415790113]
[null,null,{"$f":"C46+Sheet2!B$12","v":-1.6865671641791007},0.986834924137805,-0.11399167055430304,-0.9802290888064416,{"$nulls":12},0.8180504923348126,0.830431824888532,0.8205359882427078,0.8027849949168318,0.7786553321927433,0.7490034580989631,0.7490034580989631,-0.08651918710137577,-0.7439896575272551]
[null,null,{"$f":"C47+Sheet2!B$12","v":-1.6567164179104439},0.992690116177364,-0.08518712261293797,-0.9890282204756126,{"$nulls":12},0.8143588729596593,0.8282275733850916,0.8176248912645657,0.7989425879222246,0.7738291304789809,0.7432181997645795,0.7432181997645795,-0.06377883579149103,-0.740476571247453]
[null,null,{"$f":"C48+Sheet2!B$12","v":-1.626865671641787},0.9968693842252129,-0.05586453164565279,-0.9953028299515514,{"$nulls":12},0.8106672535845059,0.8260769207238751,0.8148316518081659,0.7953741068310893,0.7695124230855079,0.7382468054229394,0.7382468054229394,-0.04137132976142692,-0.7370866697959926]
[null,null,{"$f":"C49+Sheet2!B$12","v":-1.5970149253731303},0.9993132149099956,-0.0261975903592122,-0.9989697631826111,{"$nulls":12},0.8069756342093525,0.8239798669048825,0.8121618575847707,0.7920885099704916,0.7657115257557054,0.7340853904533997,0.7340853904533997,-0.019244485173262316,-0.7338330942847539]
[null,null,{"$f":"C50+Sheet2!B$12","v":-1.5671641791044735},0.9999868077352091,0.003632091788096851,-0.9999802115810577,{"$nulls":12},0.8032840148341991,0.8219364119281138,0.8096210963056428,0.7890940460641702,0.7624309192707963,0.7307270023373816,0.7307270023373816,2.6541025581539616E-3,-0.7307221822858442]
[null,null,{"$f":"C51+Sheet2!B$12","v":-1.5373134328358167},0.9988805706432283,0.033439163276310496,-0.9983206983569567,{"$nulls":12},0.7995923954590457,0.819946555793569,0.8072149556820444,0.7863982542325365,0.7596733030383603,0.7281617934213467,0.7281617934213467,0.024376408769376592,-0.7277536589355633]
[null,null,{"$f":"C52+Sheet2!B$12","v":-1.5074626865671599},0.9960102566075664,0.06303879251661224,-0.9940133509694514,{"$nulls":12},0.7959007760838923,0.8180102985012481,0.8049490234252381,0.7840079639926755,0.7574396486808508,0.7263771904804587,0.7263771904804587,0.04597336292043712,-0.7249208734421091]
[null,null,{"$f":"C53+Sheet2!B$12","v":-1.477611940298503},0.9914167393082937,0.09225091771512245,-0.9871154538155134,{"$nulls":12},0.7922091567087389,0.8161276400511511,0.8028288872464864,0.7819292952583446,0.7557292536241096,0.7253580610829317,0.7253580610829317,0.06749426770184302,-0.7222110775980815]
[null,null,{"$f":"C54+Sheet2!B$12","v":-1.4477611940298463},0.9851654310850212,0.12090438545027087,-0.9777182908096933,{"$nulls":12},0.7885175373335855,0.814298580443278,0.8008601348570517,0.7801676583399748,0.7545397946858837,0.7250868767550627,0.7250868767550627,0.08898625597893257,-0.7196057428128707]
[null,null,{"$f":"C55+Sheet2!B$12","v":-1.4179104477611895},0.9773453514558799,0.14884088132629836,-0.9659453028295277,{"$nulls":12},0.7848259179584322,0.8125231196776287,0.7990483539681964,0.7787277539446698,0.7538673816643404,0.7255438729469503,0.7255438729469503,0.11049378741041153,-0.7170809121114319]
[null,null,{"$f":"C56+Sheet2!B$12","v":-1.3880597014925327},0.9680678594669249,0.17591856077426557,-0.9519495997730052,{"$nulls":12},0.7811342985832788,0.8108012577542034,0.7973991322911832,0.7776135731762063,0.7537066109265833,0.7267072057988997,0.7267072057988997,0.13205818631229777,-0.7146075834945714]
[null,null,{"$f":"C57+Sheet2!B$12","v":-1.3582089552238759},0.9574650679234802,0.20201529486428033,-0.935910880872005,{"$nulls":12},0.7774426792081254,0.8091329946730019,0.7959180575372742,0.7768283975350337,0.7540506189971676,0.7285531057085115,0.7285531057085115,0.15371722207389665,-0.7121521210214865]
[null,null,{"$f":"C58+Sheet2!B$12","v":-1.328358208955219},0.9456879620850049,0.22703145471645905,-0.9180318296234713,{"$nulls":12},0.773751059832972,0.8075183304340244,0.7946107174177323,0.7763747989182754,0.7548911361466172,0.7310560276984591,0.7310560276984591,0.17550473316979623,-0.7096766899576517]
[null,null,{"$f":"C59+Sheet2!B$12","v":-1.2985074626865623},0.9329042496135241,0.2508921685581037,-0.8985340609588401,{"$nulls":12},0.7700594404578186,0.8059572650372707,0.7934826996438196,0.7762546396197267,0.7562185399799388,0.7341887985849481,0.7341887985849481,0.19745029555214935,-0.707139712329875]
{"$rows_left_out":152}
{"sheet":"Sheet3","index":2,"n_rows":0,"n_cols":0,"rows_kept":0}