{"text_format":"3","workbook":"xlsx","n_sheets":4,"sheets":["Equation","Definition","Sheet3","Sheet4"],"not_rendered":{"charts":2,"images":6,"macros":1,"defined_names":15,"comments":2},"read":"whole","date_system":"1900"}

{"sheet":"Equation","index":0,"n_rows":38,"n_cols":10,"rows_kept":38}
[null,null,"         The Equation of"]
[null,null,"             The Ellipse"]
[]
[null,null,"       The equation of the ellipse "]
[null,null,"   with center on the x-axis at x0 is "]
[null,null,"       ","(x - x0)2   +  y2   =  1"]
[{"$nulls":3},"     a2           b2"]
[]
[]
[null,"What is the center, x0?",null,null,{"$f":"-2+G10/2","v":7.5},null,19]
[]
[]
[null,"Enter the value for the parameter a",null,null,{"$f":"G13+1","v":6},null,5]
[null,null,"a is between 1 and 10"]
[]
[{"$nulls":9},"Graph of   (x - x0)2/52  +  y2/32  =  1  for comparison"]
[null,"Enter the value for the parameter b"]
[null,null,"b is between 1 and 10",null,{"$f":"G18+1","v":6},null,5]
[]
[]
[]
[]
["Click each item below for suggestions and investigations"]
[{"$nulls":3},"   Item 1"]
[{"$nulls":3},"   Item 2"]
[{"$nulls":3},"   Item 3"]
[{"$nulls":3},"   Item 4"]
[]
[]
[]
["To access/download all the DIGMath Apps for College Algebra/Precalculus"]
["Click this link:",null,"DIGMath Modules for College Algebra and Precalculus"]
[]
["Created by:  Sheldon P. Gordon   &   Florence S. Gordon",{"$nulls":8}," "]
["                  Farmingdale State College      NYIT"]
["Development of this module was supported by the "]
["NSF's Division of Undergraduate Education  "]
["under grants DUE-0310123 and DUE-0442160."]

{"sheet":"Definition","index":1,"n_rows":860,"n_cols":24,"rows_kept":860}
[{"$nulls":3},"    The Definition of"]
[{"$nulls":3},"        The Ellipse"]
[]
[null,null,"An ellipse consists of the set of all points"]
[null,null,"          where the sum of the distances"]
[null,null,"        from two fixed points (the foci) "]
[{"$nulls":3},"             is a constant."]
[]
[]
[null,"Enter the x-value for the right focus",null,null,{"$f":"-2+G10/2","v":5},null,14]
[]
[]
[null,"Enter the x-value for the left focus",null,null,{"$f":"IF(-12+G13/2<E10,-12+G13/2,E10-0.5)","v":0.5},null,25]
[null,null,"a is between 0.01 (1%) and 0.50 (40%)"]
[]
[]
[null,"Enter the total distance D from the two foci"]
[{"$nulls":3},"D is between 1 and 20",{"$f":"G18+1","v":11},null,10,{"$nulls":4},"Select a point on the ellipse:   x =",null,null,{"$f":"LOOKUP(Q18,Sheet3!D2:D201,Sheet3!E2:E201)","v":-2.640000000000009},null,99]
[{"$nulls":13},"                 y = ",{"$f":"LOOKUP(Q18,Sheet3!D2:D201,Sheet3!F2:F201)","v":0.9987116701029959}]
[]
[{"$nulls":13},"D1 =",{"$f":"Sheet3!J12","v":7.705000000000004}]
[{"$nulls":13},"D2 =",{"$f":"Sheet3!J13","v":3.2949999999999955}]
[{"$nulls":13},"D =",{"$f":"O21+O22","v":11}]
[]
[]
["Click each item below for suggestions and investigations"]
[{"$nulls":3},"   Item 1"]
[{"$nulls":3},"   Item 2"]
[{"$nulls":3},"   Item 3"]
[{"$nulls":3},"   Item 4"]
[]
[]
[]
["To access/download all the DIGMath Apps for College Algebra/Precalculus",{"$nulls":8}," "]
["Click this link:",null,"DIGMath Modules for College Algebra and Precalculus"]
[]
["Created by:  Sheldon P. Gordon   &   Florence S. Gordon"]
["                  Farmingdale State College      NYIT"]
["Development of this module was supported by the "]
["NSF's Division of Undergraduate Education  "]
["under grants DUE-0310123 and DUE-0442160."]
{"$rows_empty":818}
[{"$nulls":22},{"$f":"Z860","v":0},{"$f":"Z860","v":0}]

{"sheet":"Sheet3","index":2,"n_rows":202,"n_cols":21,"rows_kept":202}
[{"$nulls":5},"Definition",{"$nulls":10},"Equation"]
["D = ",{"$f":"D","v":11},null,0,{"$f":"IF(a>cc,xMax,0)","v":8.25},{"$f":"IF(a>cc, b*(1-(E2-x0)^2/a^2)^0.5,x0)","v":0},{"$f":"E2","v":8.25},{"$f":"F2","v":0},{"$f":"a0","v":5},0,null,"D = ",{"$f":"D","v":11},null,0,{"$f":"x00+aa","v":13.5},{"$f":" bb*(1-(P2-x00)^2/aa^2)^0.5","v":0},{"$f":"x00+5","v":12.5},{"$f":" 3*(1-(R2-x00)^2/25)^0.5","v":0},{"$f":"x00+cc","v":9.75},0]
[{"$nulls":3},1,{"$f":"IF(a>cc,E2-dx,0)","v":8.14},0.9987116701030352,{"$f":"E3","v":8.14},{"$f":"F3","v":0.9987116701030352},{"$f":"b0","v":0.5},0,{"$nulls":4},1,{"$f":"P2-dxx","v":13.38},1.1939849245279386,{"$f":"R2-0.1","v":12.4},0.5969924622639701,{"$f":"x00-cc","v":5.25},0]
["a =",{"$f":"D/2","v":5.5},null,2,8.030000000000001,1.4052401929919274,8.030000000000001,1.4052401929919274,{"$nulls":3},"a =",{"$f":"aa","v":6},null,2,13.260000000000002,1.6799999999999942,{"$f":"R3-0.1","v":12.3},0.839999999999999]
[{"$nulls":3},3,7.920000000000001,1.7122572820694881,7.920000000000001,1.7122572820694881,{"$f":"a0","v":5},{"$f":"0","v":0},{"$nulls":4},3,13.140000000000002,2.0470466531078304,12.200000000000001,1.0235233265539172,"center"]
["c =",{"$f":"(a0-b0)/2","v":2.25},null,4,7.8100000000000005,1.9669265365030786,7.8100000000000005,1.9669265365030786,{"$f":"Definition!O18","v":-2.640000000000009},{"$f":"Definition!O19","v":0.9987116701029959},null,"c =",{"$f":"(aa^2-bb^2)^0.5","v":0},null,4,13.020000000000003,2.351510153071844,12.100000000000001,1.1757550765359233,{"$f":"x00","v":7.5},0]
[{"$nulls":3},5,7.7,2.1876071402333643,7.7,2.1876071402333643,{"$nulls":6},5,12.900000000000004,2.615339366124396,12.000000000000002,1.3076696830621999]
["b =",{"$f":"IF(a>cc,(a^2-cc^2)^0.5,0)","v":5.018714974971183},null,6,7.59,2.3837575380059106,7.59,2.3837575380059106,{"$f":"b0","v":0.5},0,null,"b =",{"$f":"bb","v":6},null,6,12.780000000000005,2.849842100889092,11.900000000000002,1.424921050444548,{"$f":"b0","v":0.5},0]
[{"$nulls":3},7,7.4799999999999995,2.5610203044880384,7.4799999999999995,2.5610203044880384,{"$f":"Definition!$O$18","v":-2.640000000000009},{"$f":"Definition!$O$19","v":0.9987116701029959},{"$nulls":4},7,12.660000000000005,3.0617641973215286,11.800000000000002,1.5308820986607663,{"$f":"Definition!$O$18","v":-2.640000000000009},{"$f":"Definition!$O$19","v":0.9987116701029959}]
["Center x0 =",{"$f":"(a0+b0)/2","v":2.75},null,8,7.369999999999999,2.723086484120548,7.369999999999999,2.723086484120548,{"$nulls":3},"Center x0 =",{"$f":"x00","v":7.5},null,8,12.540000000000006,3.255518391900119,11.700000000000003,1.6277591959500617]
[{"$nulls":3},9,7.259999999999999,2.8725293732179678,7.259999999999999,2.8725293732179678,{"$nulls":6},9,12.420000000000007,3.434181125100994,11.600000000000003,1.7170905625504993]
[{"$nulls":3},10,7.149999999999999,3.0112289849827114,7.149999999999999,3.0112289849827114,"D1 =",{"$f":"((I5-I6)^2+J6^2)^0.5","v":7.705000000000004},{"$nulls":4},10,12.300000000000008,3.59999999999999,11.500000000000004,1.7999999999999972]
["xMin =",{"$f":"x0-a","v":-2.75},null,11,7.039999999999998,3.14060901737227,7.039999999999998,3.14060901737227,"D2 =",{"$f":"((I8-I9)^2+J9^2)^0.5","v":3.2949999999999955},null,"xMin =",{"$f":"x00-aa","v":1.5},null,11,12.180000000000009,3.7546770833188727,11.400000000000004,1.8773385416594386]
["xMax =",{"$f":"x0+a","v":8.25},null,12,6.929999999999998,3.261778655887001,6.929999999999998,3.261778655887001,{"$nulls":3},"xMax =",{"$f":"x00+aa","v":13.5},null,12,12.06000000000001,3.89953843422525,11.300000000000004,1.9497692171126273]
[{"$nulls":3},13,6.819999999999998,3.3756221648756872,6.819999999999998,3.3756221648756872,{"$nulls":6},13,11.94000000000001,4.035641212992045,11.200000000000005,2.0178206064960253]
["dx =",{"$f":"(xMax-xMin)/100","v":0.11},null,14,6.709999999999997,3.482858021797618,6.709999999999997,3.482858021797618,{"$nulls":3},"dx =",{"$f":"(M14-M13)/100","v":0.12},null,14,11.820000000000011,4.163844377495382,11.100000000000005,2.0819221887476935]
[{"$nulls":3},15,6.599999999999997,3.5840793797012953,6.599999999999997,3.5840793797012953,{"$nulls":6},15,11.700000000000012,4.2848570571256985,11.000000000000005,2.1424285285628515]
[{"$nulls":3},16,6.489999999999997,3.679782602274219,6.489999999999997,3.679782602274219,{"$nulls":6},16,11.580000000000013,4.399272667157595,10.900000000000006,2.1996363335788]
[{"$nulls":3},17,6.379999999999996,3.770387911077589,6.379999999999996,3.770387911077589,{"$nulls":6},17,11.460000000000013,4.507593593038296,10.800000000000006,2.2537967965191505]
[{"$nulls":3},18,6.269999999999996,3.856254659640624,6.269999999999996,3.856254659640624,{"$nulls":6},18,11.340000000000014,4.610249450951638,10.700000000000006,2.3051247254758223]
[{"$nulls":3},19,6.159999999999996,3.9376928524200596,6.159999999999996,3.9376928524200596,{"$nulls":6},19,11.220000000000015,4.707610859023916,10.600000000000007,2.3538054295119606]
[{"$nulls":3},20,6.049999999999995,4.014971979976949,6.049999999999995,4.014971979976949,{"$nulls":6},20,11.100000000000016,4.799999999999988,10.500000000000007,2.399999999999997]
[{"$nulls":3},21,5.939999999999995,4.088327897808593,5.939999999999995,4.088327897808593,{"$nulls":6},21,10.980000000000016,4.887698845059901,10.400000000000007,2.443849422529953]
[{"$nulls":3},22,5.829999999999995,4.157968253847066,5.829999999999995,4.157968253847066,{"$nulls":6},22,10.860000000000017,4.970955642529903,10.300000000000008,2.4854778212649546]
[{"$nulls":3},23,5.719999999999994,4.224076822218085,5.719999999999994,4.224076822218085,{"$nulls":6},23,10.740000000000018,5.049990099000184,10.200000000000008,2.5249950495000943]
[{"$nulls":3},24,5.609999999999994,4.286817000992698,5.609999999999994,4.286817000992698,{"$nulls":6},24,10.620000000000019,5.124997560975018,10.100000000000009,2.5624987804875117]
[{"$nulls":3},25,5.499999999999994,4.346334662678431,5.499999999999994,4.346334662678431,{"$nulls":6},25,10.50000000000002,5.1961524227066205,10.000000000000009,2.598076211353313]
[{"$nulls":3},26,5.3899999999999935,4.402760497687789,5.3899999999999935,4.402760497687789,{"$nulls":6},26,10.38000000000002,5.263610927870703,9.90000000000001,2.631805463935354]
[{"$nulls":3},27,5.279999999999993,4.4562119563593505,5.279999999999993,4.4562119563593505,{"$nulls":6},27,10.260000000000021,5.327513491301536,9.80000000000001,2.6637567456507707]
[{"$nulls":3},28,5.169999999999993,4.506794869971345,5.169999999999993,4.506794869971345,{"$nulls":6},28,10.140000000000022,5.387986636954465,9.70000000000001,2.693993318477235]
[{"$nulls":3},29,5.0599999999999925,4.554604812714275,5.0599999999999925,4.554604812714275,{"$nulls":6},29,10.020000000000023,5.445144626178434,9.60000000000001,2.7225723130892194]
[{"$nulls":3},30,4.949999999999992,4.599728252842773,4.949999999999992,4.599728252842773,{"$nulls":6},30,9.900000000000023,5.4990908339469975,9.50000000000001,2.7495454169735014]
[{"$nulls":3},31,4.839999999999992,4.642243530880304,4.839999999999992,4.642243530880304,{"$nulls":6},31,9.780000000000024,5.549918918326636,9.400000000000011,2.77495945916332]
[{"$nulls":3},32,4.7299999999999915,{"$f":"IF(a>cc, b*(1-(E34-x0)^2/a^2)^0.5,x0)","v":4.682221694879476},4.7299999999999915,4.682221694879476,{"$nulls":6},32,9.660000000000025,{"$f":" bb*(1-(P34-x00)^2/aa^2)^0.5","v":5.597713819051479},9.300000000000011,{"$f":" 3*(1-(R34-x00)^2/25)^0.5","v":2.7988569095257416}]
[{"$nulls":3},33,{"$f":"IF(a>cc,E34-dx,0)","v":4.619999999999991},4.719727216693782,4.619999999999991,4.719727216693782,{"$nulls":6},33,{"$f":"P34-dxx","v":9.540000000000026},5.64255261384419,9.200000000000012,2.8212763069220967]
[{"$nulls":3},34,4.509999999999991,4.754818608527567,4.509999999999991,4.754818608527567,{"$nulls":6},34,9.420000000000027,5.684505255516957,9.100000000000012,2.84225262775848]
[{"$nulls":3},35,4.399999999999991,4.787548955363279,4.399999999999991,4.787548955363279,{"$nulls":6},35,9.300000000000027,5.7236352085016655,9.000000000000012,2.8618176042508345]
[{"$nulls":3},36,4.28999999999999,4.817966375972338,4.28999999999999,4.817966375972338,{"$nulls":6},36,9.180000000000028,5.759999999999992,8.900000000000013,2.8799999999999977]
[{"$nulls":3},37,4.17999999999999,4.846114422916573,4.17999999999999,4.846114422916573,{"$nulls":6},37,9.060000000000029,5.793651698195181,8.800000000000013,2.8968258490975924]
[{"$nulls":3},38,4.06999999999999,4.872032430105532,4.06999999999999,4.872032430105532,{"$nulls":6},38,8.94000000000003,5.82463732776556,8.700000000000014,2.912318663882781]
[{"$nulls":3},39,3.9599999999999898,4.895755814989144,3.9599999999999898,4.895755814989144,{"$nulls":6},39,8.82000000000003,5.852999231163448,8.600000000000014,2.9264996155817258]
[{"$nulls":3},40,3.84999999999999,4.917316341257701,3.84999999999999,4.917316341257701,{"$nulls":6},40,8.700000000000031,5.878775382679621,8.500000000000014,2.939387691339812]
[{"$nulls":3},41,3.73999999999999,4.936742346932846,3.73999999999999,4.936742346932846,{"$nulls":6},41,8.580000000000032,5.9019996611318035,8.400000000000015,2.9509998305659035]
[{"$nulls":3},42,3.62999999999999,4.954058941918235,3.62999999999999,4.954058941918235,{"$nulls":6},42,8.460000000000033,5.9227020860414665,8.300000000000015,2.961351043020734]
[{"$nulls":3},43,3.5199999999999902,4.969288178401412,3.5199999999999902,4.969288178401412,{"$nulls":6},43,8.340000000000034,5.940909021353545,8.200000000000015,2.970454510676774]
[{"$nulls":3},44,3.4099999999999904,4.9824491969311655,3.4099999999999904,4.9824491969311655,{"$nulls":6},44,8.220000000000034,5.956643350075606,8.100000000000016,2.9783216750378045]
[{"$nulls":3},45,3.2999999999999905,4.993558350515192,3.2999999999999905,4.993558350515192,{"$nulls":6},45,8.100000000000035,5.9699246226397165,8.000000000000016,2.984962311319859]
[{"$nulls":3},46,3.1899999999999906,5.0026293086735905,3.1899999999999906,5.0026293086735905,{"$nulls":6},46,7.980000000000035,5.980769181301011,7.900000000000016,2.9903845906505064]
[{"$nulls":3},47,3.0799999999999907,5.009673143030392,3.0799999999999907,5.009673143030392,{"$nulls":6},47,7.860000000000035,5.989190262464533,7.800000000000017,2.9945951312322667]
[{"$nulls":3},48,2.969999999999991,5.014698395716337,2.969999999999991,5.014698395716337,{"$nulls":6},48,7.740000000000035,5.995198078462461,7.700000000000017,2.997599039231231]
[{"$nulls":3},49,2.859999999999991,5.01771113158181,2.859999999999991,5.01771113158181,{"$nulls":6},49,7.620000000000035,5.998799879975993,7.600000000000017,2.9993999399879967]
[{"$nulls":3},50,2.749999999999991,5.018714974971183,2.749999999999991,5.018714974971183,{"$nulls":6},50,7.500000000000035,6,7.500000000000018,3]
[{"$nulls":3},51,2.6399999999999912,5.01771113158181,2.6399999999999912,5.01771113158181,{"$nulls":6},51,7.3800000000000345,5.998799879975994,7.400000000000018,2.999399939987997]
[{"$nulls":3},52,2.5299999999999914,5.014698395716336,2.5299999999999914,5.014698395716336,{"$nulls":6},52,7.260000000000034,5.995198078462464,7.3000000000000185,2.9975990392312317]
[{"$nulls":3},53,2.4199999999999915,5.009673143030391,2.4199999999999915,5.009673143030391,{"$nulls":6},53,7.140000000000034,5.989190262464536,7.200000000000019,2.994595131232268]
[{"$nulls":3},54,2.3099999999999916,5.00262930867359,2.3099999999999916,5.00262930867359,{"$nulls":6},54,7.020000000000034,5.980769181301016,7.100000000000019,2.9903845906505078]
[{"$nulls":3},55,2.1999999999999917,4.99355835051519,2.1999999999999917,4.99355835051519,{"$nulls":6},55,6.900000000000034,5.969924622639724,7.0000000000000195,2.984962311319861]
[{"$nulls":3},56,2.089999999999992,4.982449196931163,2.089999999999992,4.982449196931163,{"$nulls":6},56,6.780000000000034,5.956643350075615,6.90000000000002,2.978321675037807]
[{"$nulls":3},57,1.9799999999999918,4.969288178401409,1.9799999999999918,4.969288178401409,{"$nulls":6},57,6.660000000000034,5.940909021353555,6.80000000000002,2.970454510676777]
[{"$nulls":3},58,1.8699999999999917,4.954058941918231,1.8699999999999917,4.954058941918231,{"$nulls":6},58,6.540000000000034,5.922702086041477,6.700000000000021,2.9613510430207377]
[{"$nulls":3},59,1.7599999999999916,4.936742346932842,1.7599999999999916,4.936742346932842,{"$nulls":6},59,6.420000000000034,5.901999661131816,6.600000000000021,2.950999830565907]
[{"$nulls":3},60,1.6499999999999915,4.917316341257697,1.6499999999999915,4.917316341257697,{"$nulls":6},60,6.300000000000034,5.878775382679634,6.500000000000021,2.9393876913398165]
[{"$nulls":3},61,1.5399999999999914,4.8957558149891405,1.5399999999999914,4.8957558149891405,{"$nulls":6},61,6.1800000000000335,5.852999231163463,6.400000000000022,2.9264996155817307]
[{"$nulls":3},62,1.4299999999999913,4.872032430105529,1.4299999999999913,4.872032430105529,{"$nulls":6},62,6.060000000000033,5.824637327765575,6.300000000000022,2.9123186638827865]
[{"$nulls":3},63,1.3199999999999912,4.8461144229165685,1.3199999999999912,4.8461144229165685,{"$nulls":6},63,5.940000000000033,5.793651698195198,6.200000000000022,2.896825849097598]
[{"$nulls":3},64,1.209999999999991,{"$f":"IF(a>cc, b*(1-(E66-x0)^2/a^2)^0.5,x0)","v":4.8179663759723335},1.209999999999991,4.8179663759723335,{"$nulls":6},64,5.820000000000033,{"$f":" bb*(1-(P66-x00)^2/aa^2)^0.5","v":5.76000000000001},6.100000000000023,{"$f":" 3*(1-(R66-x00)^2/25)^0.5","v":2.880000000000004}]
[{"$nulls":3},65,{"$f":"IF(a>cc,E66-dx,0)","v":1.099999999999991},4.787548955363274,{"$f":"E67","v":1.099999999999991},{"$f":"F67","v":4.787548955363274},{"$nulls":6},65,{"$f":"P66-dxx","v":5.700000000000033},5.723635208501684,6.000000000000023,2.861817604250841]
[{"$nulls":3},66,0.989999999999991,4.754818608527562,0.989999999999991,4.754818608527562,{"$nulls":6},66,5.580000000000033,5.684505255516976,{"$f":"R67-0.1","v":5.9000000000000234},2.8422526277584876]
[{"$nulls":3},67,0.879999999999991,4.719727216693776,0.879999999999991,4.719727216693776,{"$nulls":6},67,5.460000000000033,5.642552613844211,5.800000000000024,2.8212763069221043]
[{"$nulls":3},68,0.769999999999991,4.68222169487947,0.769999999999991,4.68222169487947,{"$nulls":6},68,5.340000000000033,5.597713819051501,5.700000000000024,2.7988569095257496]
[{"$nulls":3},69,0.659999999999991,4.642243530880298,0.659999999999991,4.642243530880298,{"$nulls":6},69,5.220000000000033,5.549918918326659,5.6000000000000245,2.7749594591633286]
[{"$nulls":3},70,0.549999999999991,4.599728252842767,0.549999999999991,4.599728252842767,{"$nulls":6},70,5.1000000000000325,5.499090833947022,5.500000000000025,2.7495454169735107]
[{"$nulls":3},71,0.43999999999999106,4.554604812714268,0.43999999999999106,4.554604812714268,{"$nulls":6},71,4.980000000000032,5.44514462617846,5.400000000000025,2.7225723130892296]
[{"$nulls":3},72,0.3299999999999911,4.506794869971338,0.3299999999999911,4.506794869971338,{"$nulls":6},72,4.860000000000032,5.3879866369544915,5.300000000000026,2.6939933184772453]
[{"$nulls":3},73,0.2199999999999911,4.456211956359343,0.2199999999999911,4.456211956359343,{"$nulls":6},73,4.740000000000032,5.327513491301564,5.200000000000026,2.663756745650782]
[{"$nulls":3},74,0.10999999999999109,4.402760497687781,0.10999999999999109,4.402760497687781,{"$nulls":6},74,4.620000000000032,5.263610927870731,5.100000000000026,2.6318054639353656]
[{"$nulls":3},75,-8.909539772616881e-15,4.346334662678423,-8.909539772616881e-15,4.346334662678423,{"$nulls":6},75,4.500000000000032,5.19615242270665,5.000000000000027,2.598076211353325]
[{"$nulls":3},76,-0.11000000000000891,4.2868170009926905,-0.11000000000000891,4.2868170009926905,{"$nulls":6},76,4.380000000000032,5.124997560975049,4.900000000000027,2.5624987804875246]
[{"$nulls":3},77,-0.2200000000000089,4.224076822218076,-0.2200000000000089,4.224076822218076,{"$nulls":6},77,4.260000000000032,5.049990099000215,4.800000000000027,2.524995049500108]
[{"$nulls":3},78,-0.3300000000000089,4.157968253847058,-0.3300000000000089,4.157968253847058,{"$nulls":6},78,4.140000000000032,4.970955642529937,4.700000000000028,2.485477821264969]
{"$rows_left_out":123}
{"sheet":"Sheet4","index":3,"n_rows":0,"n_cols":0,"rows_kept":0}