{"text_format":"3","workbook":"xlsx","n_sheets":5,"sheets":["Cosine -- Radians","Cosine -- Degrees","4 Points - Radians","4 Points - Degrees","Calculations"],"not_rendered":{"charts":8,"images":14,"defined_names":58,"comments":4},"read":"whole","date_system":"1900"}

{"sheet":"Cosine -- Radians","index":0,"n_rows":39,"n_cols":19,"rows_kept":39}
[null,"   Approximating Sinusoidal Functions"]
[null,"with Lagrange Interpolation Polynomials"]
[]
[null,"This DIGMath module lets you investigate how"]
[null," Lagrange quadratic Interpolation Polynomials"]
[null,"                 are used to approximate "]
[null,"             the cosine function y = cos x"]
[null,"              with x in radians on [0, p/4]."]
[]
["The three interpolating points are x = x0,  p/8,  and x2."]
[]
[null,"What is the first point x0 (0 to 0.35)?",null,null,{"$f":"F13/100","v":0.11}]
[{"$nulls":5},11,127]
[]
[null,"What is the third point x2 (0.40 to 0.78)?",null,null,{"$f":"F16/100","v":0.74},{"$nulls":6},"Now trace along the curve:  x = ",{"$f":"xMin+N16*dx","v":0.5434955290710343},"and  y = ",{"$f":"LOOKUP(M15+0.001,Calculations!D2:D502,Calculations!E2:E502)","v":{"v":0.8559062676711312,"d":"0.86"}}]
[{"$nulls":5},74,127,{"$nulls":6},346,{"$nulls":4}," "]
[]
[{"$nulls":11},"The corresponding error = ",{"$f":"Calculations!B13","v":{"v":9.133702035041269E-4,"d":"0.0009"}}]
[]
[]
[]
[]
["Click each item below for suggestions and investigations"]
[{"$nulls":3},"   Item 1"]
[{"$nulls":3},"   Item 2"]
[{"$nulls":3},"   Item 3"]
[{"$nulls":3},"   Item 4"]
[{"$nulls":3},"   Item 5"]
[]
[]
{"$rows_left_out":10}
{"sheet":"Cosine -- Degrees","index":1,"n_rows":37,"n_cols":16,"rows_kept":37}
[null,"   Approximating Sinusoidal Functions"]
[null,"with Lagrange Interpolation Polynomials"]
[]
[null,"This DIGMath module lets you investigate how"]
[null,"Lagrange quadratic Interpolation Polynomials"]
[null,"                 are used to approximate "]
[null,"             the cosine function y = cos x"]
[null,"             with x in degrees on [0°, 45°]."]
[null,"  "]
["The three interpolating points are x = x0,  22.5°,  and x2."]
[]
[null,"What is the first point x0 (0 to 20°)?",null,null,{"$f":"F13/10","v":11},"°"]
[{"$nulls":5},110,127]
[]
[null,"What is the third point x2 (25° to 45°)?",null,null,{"$f":"F16/10","v":25},"°",{"$nulls":6},"Now trace along the curve:  x = ",{"$f":"O16/10","v":17.2},"° and  y = ",{"$f":"LOOKUP(N15+0.001,Calculations!M2:M452,Calculations!N2:N452)","v":{"v":0.9552783621223438,"d":"0.96"}}]
[{"$nulls":5},250,127,{"$nulls":7},172]
[]
[{"$nulls":12},"The corresponding error = ",{"$f":"Calculations!K13","v":{"v":-7.3595768360967817E-5,"d":"-0.0001"}}]
[]
[]
[]
[]
[null,"Click each item below for suggestions and investigations"]
[{"$nulls":3},"   Item 1"]
[{"$nulls":3},"   Item 2"]
[{"$nulls":3},"   Item 3"]
[{"$nulls":3},"   Item 4"]
[{"$nulls":3},"   Item 5"]
[]
["To access/download all the DIGMath Apps for College Algebra/Precalculus"]
{"$rows_left_out":8}
{"sheet":"4 Points - Radians","index":2,"n_rows":41,"n_cols":15,"rows_kept":41}
[null,"   Approximating Sinusoidal Functions"]
[null,"with Lagrange Interpolation Polynomials"]
[]
[null,"This DIGMath module lets you investigate how"]
[null,"    Lagrange cubic Interpolation Polynomials"]
[null,"                    are used to approximate "]
[null,"                the cosine function y = cos x"]
[null,"                with x in radians on [0, p/4]."]
[]
["The four interpolating points are x = x0,  x1,  x2,  and x3."]
[]
[null,"What is the first point x0 (0 to 0.20)?",null,null,{"$f":"G13/980","v":{"v":0.2,"d":"0.20"}}]
[{"$nulls":5},29,196]
[]
[null,"What is the second point x1 (0.20 to 0.40)?",null,null,{"$f":"G16/980+0.196","v":{"v":0.396,"d":"0.40"}},"",{"$nulls":5},"Now trace along the curve:  x = ",{"$f":"O16*dxxx0","v":{"v":0.3440043955680824,"d":"0.344"}},"and  y = ",{"$f":"LOOKUP(M15+0.00001,Calculations!V2:V502,Calculations!W2:W502)","v":{"v":0.9414116962513962,"d":"0.941"}}]
[{"$nulls":5},50,196,{"$nulls":7},219]
[]
[null,"What is the third point x2 (0.39 to 0.59)?",null,null,{"$f":"G19/980+0.196*2","v":{"v":0.5920000000000001,"d":"0.59"}},"",{"$nulls":5},"The corresponding error = ",{"$f":"Calculations!T13","v":{"v":-4.1769885078979385E-5,"d":"-0.000042"}}]
[{"$nulls":5},50,196]
[]
[null,"What is the fourth point x3 (0.59 to 0.79)?",null,null,{"$f":"G22/980+0.196*3","v":{"v":0.5880000000000001,"d":"0.59"}},""]
[{"$nulls":5},50,0]
[]
[]
[]
["Click each item below for suggestions and investigations"]
[{"$nulls":3},"   Item 1"]
[{"$nulls":3},"   Item 2"]
[{"$nulls":3},"   Item 3"]
[{"$nulls":3},"   Item 4"]
{"$rows_left_out":12}
{"sheet":"4 Points - Degrees","index":3,"n_rows":41,"n_cols":15,"rows_kept":41}
[null,"   Approximating Sinusoidal Functions"]
[null,"with Lagrange Interpolation Polynomials"]
[]
[null,"This DIGMath module lets you investigate how"]
[null,"    Lagrange cubic Interpolation Polynomials"]
[null,"                  are used to approximate "]
[null,"              the cosine function y = cos x"]
[null,"             with x in degrees on [0°, 45°]."]
[]
["The four interpolating points are x = x0,  x1,  x2,  and x3."]
[]
[null,"What is the first point x0 (0 to 11°)?",null,null,{"$f":"F13/10","v":6.2},"°"]
[{"$nulls":4},29,62]
[]
[null,"What is the second point x1 (11.5° to 22.5°)?",null,null,{"$f":"F16/10+11.5","v":19.2},"°",{"$nulls":5},"Now trace along the curve:  x = ",{"$f":"N16*dxxxx0","v":{"v":33.1,"d":"33.10"}},"°  and  y = ",{"$f":"LOOKUP(M15+0.00001,Calculations!AE2:AE452,Calculations!AF2:AF502)","v":{"v":0.8377187166204368,"d":"0.838"}}]
[{"$nulls":4},50,77,{"$nulls":7},331]
[]
[null,"What is the third point x2 (23° to 34°)?",null,null,{"$f":"F19/10+11.5*2","v":32.8},"°",{"$nulls":5},"The corresponding error = ",{"$f":"Calculations!AC13","v":{"v":7.221491053477358E-5,"d":"0.000072"}}]
[{"$nulls":4},50,98]
[]
[null,"What is the fourth point x3 (34.5° to 45°)?",null,null,{"$f":"F22/10+11.5*3","v":41.5},"°"]
[{"$nulls":4},50,70]
[]
[]
[]
["Click each item below for suggestions and investigations"]
[{"$nulls":3},"   Item 1"]
[{"$nulls":3},"   Item 2"]
[{"$nulls":3},"   Item 3"]
[{"$nulls":3},"   Item 4"]
{"$rows_left_out":12}
{"sheet":"Calculations","index":4,"n_rows":502,"n_cols":35,"rows_kept":502}
[null,"dx =",{"$f":"PI()/4/500","v":1.5707963267948967E-3},"x","Cosine","L(x)","Error","ABS(Error)",null,null,"dxx =",{"$f":"45/450","v":0.1},"x","Cosine","L(x)","Error","ABS(Error)",null,null,"dxxx0 =",{"$f":"PI()/4/500","v":1.5707963267948967E-3},"x","Cosine","L3(x)","Error","ABS(Error)",null,null,"dxxxx0 =",0.1,"x","Cosine","L3(x)","Error","ABS(Error)"]
[{"$nulls":3},{"$f":"0","v":0},{"$f":"COS(x)","v":1},{"$f":"y0*(x-x00)*(x-x000)/(x0-x00)/(x0-x000)+y00*(x-x0)*(x-x000)/(x00-x0)/(x00-x000)+y000*(x-x0)*(x-x00)/(x000-x0)/(x000-x00)","v":1.0016147752978666},{"$f":"F2-E2","v":1.6147752978665775E-3},{"$f":"ABS(G2)","v":1.6147752978665775E-3},{"$nulls":4},{"$f":"0","v":0},{"$f":"COS(xx*PI()/180)","v":1},{"$f":"yy0*(xx-xx00)*(xx-xx000)/(xx0-xx00)/(xx0-xx000)+yy00*(xx-xx0)*(xx-xx000)/(xx00-xx0)/(xx00-xx000)+yy000*(xx-xx0)*(xx-xx00)/(xx000-xx0)/(xx000-xx00)","v":1.001380286727672},{"$f":"O2-N2","v":1.3802867276719866E-3},{"$f":"ABS(P2)","v":1.3802867276719866E-3},null,null,"dxxx =",{"$f":"T5-T4","v":0.196},0,{"$f":"COS(xxx)","v":1},{"$f":"yyy0*(xxx-xxx00)*(xxx-xxx000)*(xxx-xxx0000)/(xxx0-xxx00)/(xxx0-xxx000)/(xxx0-xxx0000)+yyy00*(xxx-xxx0)*(xxx-xxx000)*(xxx-xxx0000)/(xxx00-xxx0)/(xxx00-xxx000)/(xxx00-xxx0000)+yyy000*(xxx-xxx0)*(xxx-xxx00)*(xxx-xxx0000)/(xxx000-xxx0)/(xxx000-xxx00)/(xxx000-xxx0000)+yyy0000*(xxx-xxx0)*(xxx-xxx00)*(xxx-xxx000)/(xxx0000-xxx0)/(xxx0000-xxx00)/(xxx0000-xxx000)","v":0.9989277010971875},-2.8867100836271753E-4,2.8867100836271753E-4,null,null,"dxxxx =",13.5,0,{"$f":"COS(xxxx*PI()/180)","v":1},{"$f":"yyyy0*(xxxx-xxxx00)*(xxxx-xxxx000)*(xxxx-xxxx0000)/(xxxx0-xxxx00)/(xxxx0-xxxx000)/(xxxx0-xxxx0000)+yyyy00*(xxxx-xxxx0)*(xxxx-xxxx000)*(xxxx-xxxx0000)/(xxxx00-xxxx0)/(xxxx00-xxxx000)/(xxxx00-xxxx0000)+yyyy000*(xxxx-xxxx0)*(xxxx-xxxx00)*(xxxx-xxxx0000)/(xxxx000-xxxx0)/(xxxx000-xxxx00)/(xxxx000-xxxx0000)+yyyy0000*(xxxx-xxxx0)*(xxxx-xxxx00)*(xxxx-xxxx000)/(xxxx0000-xxxx0)/(xxxx0000-xxxx00)/(xxxx0000-xxxx000)","v":0.9994146961122199},-1.3972281566543288E-4,1.3972281566543288E-4]
[null,"x","y",{"$f":"D2+dx","v":1.5707963267948967E-3},0.9999987662997035,1.0015827238322816,{"$f":"F3-E3","v":1.5839575325781174E-3},{"$f":"ABS(G3)","v":1.5839575325781174E-3},null,null,"x","y",{"$f":"M2+dxx","v":0.1},0.9999984769132877,1.0013569850632882,{"$f":"O3-N3","v":1.3585081500004925E-3},{"$f":"ABS(P3)","v":1.3585081500004925E-3},null,null,"x","y",{"$f":"V2+dxxx0","v":1.5707963267948967E-3},0.9999987662997035,0.9989448473049833,-2.7798897286768209E-4,2.7798897286768209E-4,null,null,"xxxx","yyyy",0.1,0.9999984769132877,0.9994287960071527,-1.3110398558335845E-4,1.3110398558335845E-4]
[1,{"$f":"x0","v":0.11},{"$f":"COS(x0)","v":0.9939560979566968},3.1415926535897933E-3,0.9999950652018582,1.0015484322903465,1.5533670884883E-3,1.5533670884883E-3,null,1,{"$f":"xx0","v":11},{"$f":"COS(K4*PI()/180)","v":0.981627183447664},0.2,0.9999939076577904,1.0013308160227226,1.3369083649321656E-3,1.3369083649321656E-3,null,1,{"$f":"xxx0","v":0.2},{"$f":"COS(T4)","v":0.9800665778412416},3.1415926535897933E-3,0.9999950652018582,0.9989593073598257,-2.6748398509035543E-4,2.6748398509035543E-4,null,1,{"$f":"xxxx0","v":6.2},{"$f":"COS(AC4*PI()/180)","v":0.9941509639723154},0.2,0.9999939076577904,0.9994396054710699,-1.2266869253252377E-4,1.2266869253252377E-4]
[2,{"$f":"PI()/8","v":0.39269908169872414},{"$f":"COS(B5)","v":0.9238795325112867},0.00471238898038469,0.999988896715596,1.001511900672062,1.5230039564660958E-3,1.5230039564660958E-3,null,2,{"$f":"22.5","v":22.5},{"$f":"COS(K5*PI()/180)","v":0.9238795325112867},0.30000000000000004,0.9999862922474267,1.001301779605976,0.00131548735854925,0.00131548735854925,null,2,{"$f":"xxx00","v":0.396},{"$f":"COS(T5)","v":0.9226112947402},0.00471238898038469,0.999988896715596,0.9989710829221963,-2.5715448179097766E-4,2.5715448179097766E-4,null,2,{"$f":"xxxx00","v":19.2},{"$f":"COS(AC5*PI()/180)","v":0.9443763702374811},0.3,0.9999862922474267,0.9994471267324063,-1.1441495124453471E-4,1.1441495124453471E-4]
[3,{"$f":"x000","v":0.74},{"$f":"COS(x000)","v":0.7384685587295879},0.006283185307179587,0.9999802608561371,1.001473128977428,1.4928681212907913E-3,1.4928681212907913E-3,null,3,{"$f":"xx000","v":25},{"$f":"COS(K6*PI()/180)","v":0.9063077870366499},0.4,0.9999756307053947,1.0012698758130512,1.294245107656411E-3,1.294245107656411E-3,null,3,{"$f":"xxx000","v":0.5920000000000001},{"$f":"COS(T6)","v":0.8298262959153482},0.006283185307179587,0.9999802608561371,0.9989801756528323,-2.4699890581847406E-4,2.4699890581847406E-4,null,3,{"$f":"xxxx000","v":32.8},{"$f":"COS(AC6*PI()/180)","v":0.8405666034956844},0.4,0.9999756307053947,0.9994513620195987,-1.0634078573168448E-4,1.0634078573168448E-4]
[{"$nulls":3},0.007853981633974483,0.9999691576447897,1.001432117206443,1.4629595616534319E-3,1.4629595616534319E-3,{"$nulls":4},0.5,0.9999619230641713,1.0012351046439463,1.2731815797749624E-3,1.2731815797749624E-3,null,4,{"$f":"xxx0000","v":0.5880000000000001},{"$f":"COS(T7)","v":0.8320517385233702},0.007853981633974483,0.9999691576447897,0.9989865872123147,-2.3701570610967782E-4,2.3701570610967782E-4,null,4,{"$f":"xxxx0000","v":41.5},{"$f":"COS(AC7*PI()/180)","v":0.7489557207890022},0.5,0.9999619230641713,0.9994523135610802,-9.8444229284289086E-5,9.8444229284289086E-5]
[{"$nulls":3},0.00942477796076938,0.9999555871089498,1.0013888653591085,1.4332782501587094E-3,1.4332782501587094E-3,{"$nulls":4},0.6,0.9999451693655121,1.0011974660986613,0.001252296733149194,0.001252296733149194,{"$nulls":4},0.00942477796076938,0.9999555871089498,0.9989903192611678,-2.2720333768921908E-4,2.2720333768921908E-4,{"$nulls":4},0.6,0.9999451693655121,0.9994499835852877,-9.072332447179754E-5,9.072332447179754E-5]
["MaxError =",{"$f":"MAX(H2:H502)","v":1.6147752978665775E-3},null,0.010995574287564275,0.9999395492821014,1.001343373435425,1.4038241533235185E-3,1.4038241533235185E-3,null,"MaxError =",{"$f":"MAX(Q2:Q452)","v":0.005888921991268337},null,0.7,0.999925369660452,1.0011569601771972,1.2315905167452623E-3,1.2315905167452623E-3,null,"MaxError =",{"$f":"MAX(Z2:Z502)","v":2.8867100836271753E-4},null,0.010995574287564275,0.9999395492821014,0.9989913734600435,-2.1756026166941389E-4,2.1756026166941389E-4,null,"MaxError =",{"$f":"MAX(AI2:AL452)","v":1.7392530246373994E-4},null,0.7,0.999925369660452,0.9994443743206578,-8.3176123142680858E-5,8.3176123142680858E-5]
[{"$nulls":3},0.012566370614359171,0.9999210442038161,1.00129564143539,1.3745972315738486E-3,1.3745972315738486E-3,{"$nulls":4},0.7999999999999999,0.9999025240093042,1.001113586879553,0.001211062870248858,0.001211062870248858,{"$nulls":4},0.012566370614359171,0.9999210442038161,0.9989897514694945,-2.080849452511524E-4,2.080849452511524E-4,{"$nulls":4},0.8,0.9999025240093042,0.9994354879956231,-7.5800686424098984E-5,7.5800686424098984E-5]
[{"$nulls":3},0.014137166941154067,0.9999000719197535,1.0012456693590062,0.001345597439252666,0.001345597439252666,{"$nulls":4},0.8999999999999999,0.9998766324816606,1.0010673462057307,1.1907137240700916E-3,1.1907137240700916E-3,{"$nulls":4},0.014137166941154067,0.9999000719197535,0.9989854549501729,-1.9877586172223349E-4,1.9877586172223349E-4,{"$nulls":4},0.9,0.9998766324816606,0.9994233268386202,-6.8595084721234656E-5,6.8595084721234656E-5]
["Point",null,null,0.015707963267948963,0.9998766324816606,1.0011934572062722,1.3168247246115872E-3,1.3168247246115872E-3,null,"Point",null,null,0.9999999999999999,0.9998476951563913,1.0010182381557264,1.1705429993351668E-3,1.1705429993351668E-3,null,"Point",null,null,0.015707963267948963,0.9998766324816606,0.9989784855627022,-1.8963149045803096E-4,1.8963149045803096E-4,null,"Point",null,null,1,0.9998476951563913,0.9994078930780848,-6.1557397718403628E-5,6.1557397718403628E-5]
[{"$f":"'Cosine -- Radians'!M15","v":0.5434955290710343},{"$f":"LOOKUP(A13,D2:D502,G2:G502)","v":9.133702035041269E-4},null,0.01727875959474386,0.9998507259473718,1.001139004977188,1.2882790298162083E-3,1.2882790298162083E-3,null,{"$f":"'Cosine -- Degrees'!N15","v":17.2},{"$f":"LOOKUP(J13,M2:M452,P2:P452)","v":-7.3595768360967817E-5},null,1.0999999999999999,0.9998157121216442,1.0009662627295413,1.1505506078970384E-3,1.1505506078970384E-3,null,{"$f":"'4 Points - Radians'!M15","v":0.3440043955680824},{"$f":"LOOKUP(S13+0.000001,V2:V502,Y2:Y502)","v":-4.1769885078979385E-5},null,0.01727875959474386,0.9998507259473718,0.9989688449676493,-1.8065031692204858E-4,1.8065031692204858E-4,null,{"$f":"'4 Points - Degrees'!M15","v":33.1},{"$f":"LOOKUP(AB13,AE2:AE452,AH2:AH452)","v":7.221491053477358E-5},null,1.1,0.9998157121216442,0.9993891889424509,-5.4685714376834227E-5,5.4685714376834227E-5]
[{"$nulls":3},0.018849555921538756,0.999822352380809,1.0010823126717545,1.2599602909455498E-3,1.2599602909455498E-3,{"$nulls":4},1.2,0.9997806834748455,1.0009114199271805,1.1307364523349683E-3,1.1307364523349683E-3,{"$nulls":4},0.018849555921538756,0.999822352380809,0.9989565348255809,-1.718308326646989E-4,1.718308326646989E-4,{"$nulls":4},1.2,0.9997806834748455,0.9993672166601555,-4.7978132936554729E-5,4.7978132936554729E-5]
[{"$nulls":3},0.02042035224833365,0.9997915118519811,1.001023380289971,0.001231868437989947,0.001231868437989947,{"$nulls":4},1.3,0.9997426093226983,1.0008537097486387,1.1111004259404256E-3,1.1111004259404256E-3,{"$nulls":4},0.02042035224833365,0.9997915118519811,0.9989415567971065,-1.631715353233032E-4,1.631715353233032E-4,{"$nulls":4},1.3,0.9997426093226983,0.9993419784596339,-4.1432760914283939E-5,4.1432760914283939E-5]
[{"$nulls":3},0.021991148575128548,0.999758204436984,1.0009622078318374,1.2040033948533813E-3,1.2040033948533813E-3,{"$nulls":4},1.4000000000000001,0.9997014897811831,1.000793132193916,1.0916424127329627E-3,1.0916424127329627E-3,{"$nulls":4},0.021991148575128548,0.999758204436984,0.9989239125429208,-1.5467092862253562E-4,1.5467092862253562E-4,{"$nulls":4},1.4,0.9997014897811831,0.9993134765693199,-3.5047715104208343E-5,3.5047715104208343E-5]
[{"$nulls":3},0.023561944901923444,0.9997224302180006,1.0008987952973545,1.1763650793539249E-3,1.1763650793539249E-3,{"$nulls":4},1.5000000000000002,0.9996573249755573,1.0007296872630134,1.0723622874561078E-3,1.0723622874561078E-3,{"$nulls":4},0.023561944901923444,0.9997224302180006,0.9989036037235337,-1.4632752237386804E-4,1.4632752237386804E-4,{"$nulls":4},1.5,0.9996573249755573,0.9992817132176502,-2.8821121577427E-5,2.8821121577427E-5]
[{"$nulls":3},0.02513274122871834,0.9996841892832999,1.000833142686521,1.1489534032209647E-3,1.1489534032209647E-3,{"$nulls":4},1.6000000000000003,0.9996101150403544,1.0006633749559306,1.0532599155762545E-3,1.0532599155762545E-3,{"$nulls":4},0.02513274122871834,0.9996841892832999,0.9988806319995263,-1.3813983247501493E-4,1.3813983247501493E-4,{"$nulls":4},1.6,0.9996101150403544,0.9992466906330597,-2.2751115681285405E-5,2.2751115681285405E-5]
[{"$nulls":3},0.026703537555513236,0.999643481727238,1.0007652499993378,1.1217682720997546E-3,1.1217682720997546E-3,{"$nulls":4},1.7000000000000004,0.999559860119384,1.0005941952726687,0.00103433515328466,0.00103433515328466,{"$nulls":4},0.026703537555513236,0.999643481727238,0.9988549990315221,-1.3010638091026649E-4,1.3010638091026649E-4,{"$nulls":4},1.7,0.999559860119384,0.9992084110439843,-1.6835842039042426E-5,1.6835842039042426E-5]
[{"$nulls":3},0.02827433388230813,0.9996003076502565,1.0006951172358043,1.0948095855477513E-3,1.0948095855477513E-3,{"$nulls":4},1.8000000000000005,0.9995065603657316,1.0005221482132294,1.0155878474977786E-3,1.0155878474977786E-3,{"$nulls":4},0.02827433388230813,0.9996003076502565,0.9988267064801875,-1.2222569575037756E-4,1.2222569575037756E-4,{"$nulls":4},1.8,0.9995065603657316,0.9991668766788576,-1.1073454549648254E-5,1.1073454549648254E-5]
[{"$nulls":3},0.029845130209103028,0.9995546671588833,1.0006227443959215,1.0680772370381675E-3,1.0680772370381675E-3,{"$nulls":4},1.9000000000000006,0.9994502159417572,1.0004472337776074,9.970178358501558E-4,9.970178358501558E-4,{"$nulls":4},0.029845130209103028,0.9995546671588833,0.998795756006075,-1.1449631115156844E-4,1.1449631115156844E-4,{"$nulls":4},1.9,0.9994502159417572,0.9991220897661168,-5.4621163871892975E-6,5.4621163871892975E-6]
[{"$nulls":3},0.03141592653589793,0.9995065603657316,1.0005481314796887,0.001041571113957085,0.001041571113957085,{"$nulls":4},2.0000000000000004,0.9993908270190958,1.0003694519658057,9.7862494670997169E-4,9.7862494670997169E-4,{"$nulls":4},0.03141592653589793,0.9995065603657316,0.9987621492697514,-1.0691676735574696E-4,1.0691676735574696E-4,{"$nulls":4},2,0.9993908270190958,0.9990740525341967,0,0]
[{"$nulls":3},0.03298672286269282,0.9994559873895001,1.0004712784871062,0.001015291097606008,0.001015291097606008,{"$nulls":4},2.1000000000000005,0.9993283937786562,1.0002888027778272,9.6040899917093636E-4,9.6040899917093636E-4,{"$nulls":4},0.03298672286269282,0.9994559873895001,0.9987258879318546,-9.9485610690397408E-5,9.9485610690397408E-5,{"$nulls":4},2.1,0.9993283937786562,0.9990227672115318,5.3147128891151141E-6,5.3147128891151141E-6]
[{"$nulls":3},0.03455751918948772,0.9994029483549729,1.0003921854181734,0.000989237063200532,0.000989237063200532,{"$nulls":4},2.2000000000000006,0.9992629164106211,1.0002052862136654,9.4236980304429618E-4,9.4236980304429618E-4,{"$nulls":4},0.03455751918948772,0.9994029483549729,0.9986869736530508,-9.2201393567803436E-5,9.2201393567803436E-5,{"$nulls":4},2.2,0.9992629164106211,0.9989682360265603,1.048383128388064E-5,1.048383128388064E-5]
[{"$nulls":3},0.036128315516282615,0.9993474433930183,1.0003108522728907,9.6340887987245161E-4,9.6340887987245161E-4,{"$nulls":4},2.3000000000000007,0.999194395114446,1.000118902273326,9.2450715887992807E-4,9.2450715887992807E-4,{"$nulls":4},0.036128315516282615,0.9993474433930183,0.9986454080937932,-8.5062674485270051E-5,8.5062674485270051E-5,{"$nulls":4},2.3,0.999194395114446,0.9989104612077129,1.550915491532745E-5,1.550915491532745E-5]
[{"$nulls":3},0.03769911184307751,0.9992894726405892,1.0002272790512583,9.3780641066909531E-4,9.3780641066909531E-4,{"$nulls":4},2.400000000000001,0.9991228300988584,1.000029650956804,9.0682085794568934E-4,9.0682085794568934E-4,{"$nulls":4},0.03769911184307751,0.9992894726405892,0.9986011929147764,-7.8068018024346486E-5,7.8068018024346486E-5,{"$nulls":4},2.4,0.9991228300988584,0.9988494449834292,2.0392474242014735E-5,2.0392474242014735E-5]
[{"$nulls":3},0.03926990816987241,0.9992290362407229,1.0001414657532761,9.1242951255321447E-4,9.1242951255321447E-4,{"$nulls":4},2.500000000000001,0.9990482215818578,0.999937532264104,8.8931068224618048E-4,8.8931068224618048E-4,{"$nulls":4},0.03926990816987241,0.9992290362407229,0.9985543297766526,-7.121599485071517E-5,7.121599485071517E-5,{"$nulls":4},2.5,0.9990482215818578,0.9987851895821418,2.5135570450585121E-5,2.5135570450585121E-5]
[{"$nulls":3},0.0408407044966673,0.9991661343425401,1.0000534123789437,8.8727803640364922E-4,8.8727803640364922E-4,{"$nulls":4},2.600000000000001,0.9989705697907147,0.9998425461952256,8.7197640451086578E-4,8.7197640451086578E-4,{"$nulls":4},0.0408407044966673,0.9991661343425401,0.9985048203398605,-6.4505181713858661E-5,6.4505181713858661E-5,{"$nulls":4},2.6,0.9989705697907147,0.9987176972322878,2.9740215457207952E-5,2.9740215457207952E-5]
[{"$nulls":3},0.0424115008234622,0.999100767101245,0.999963118928262,8.6235182701699387E-4,8.6235182701699387E-4,{"$nulls":4},2.700000000000001,0.99888987496197,0.9997446927501668,8.5481778819673782E-4,8.5481778819673782E-4,{"$nulls":4},0.0424115008234622,0.999100767101245,0.9984526662651234,-5.7934161446393517E-5,5.7934161446393517E-5,{"$nulls":4},2.7,0.99888987496197,0.9986469701623018,3.4208171907024187E-5,3.4208171907024187E-5]
[{"$nulls":3},0.043982297150257095,0.9990329346781247,0.9998705854012295,8.3765072310482136E-4,8.3765072310482136E-4,{"$nulls":4},2.800000000000001,0.9988061373414341,0.9996439719289287,8.3783458749464579E-4,8.3783458749464579E-4,{"$nulls":4},0.043982297150257095,0.9990329346781247,0.9983978692130364,-5.1501522964292334E-5,5.1501522964292334E-5,{"$nulls":4},2.8,0.9988061373414341,0.9985730106006186,3.8541193176144795E-5,3.8541193176144795E-5]
{"$rows_left_out":472}