{"text_format":"3","workbook":"xlsx","n_sheets":5,"sheets":["Sine -- Radians","Sine -- Degrees","4 Points - Radians","4 Points - Degrees","Calculations"],"not_rendered":{"charts":8,"images":14,"defined_names":58,"comments":4},"read":"whole","date_system":"1900"}

{"sheet":"Sine -- Radians","index":0,"n_rows":37,"n_cols":19,"rows_kept":37}
[null,"   Approximating Sinusoidal Functions"]
[null,"with Lagrange Interpolation Polynomials"]
[]
[null,"This DIGMath module lets you investigate how"]
[null,"Lagrange quadratic Interpolation Polynomials"]
[null,"                 are used to approximate "]
[null,"               the sine function y = sin x"]
[null,"              with x in radians on [0, p/4]."]
[]
["The three interpolating points are x = x0,  p/8,  and x2."]
[]
[null,"What is the first point x0 (0 to 0.35)?",null,null,{"$f":"F13/100","v":0.06}]
[{"$nulls":5},6,127]
[]
[null,"What is the third point x2 (0.40 to 0.78)?",null,null,{"$f":"F16/100","v":0.59},{"$nulls":6},"Now trace along the curve:  x = ",{"$f":"xMin+N16*dx","v":0.3832743037379548},"and  y = ",{"$f":"LOOKUP(M15+0.001,Calculations!D2:D502,Calculations!E2:E502)","v":{"v":0.3739592057378024,"d":"0.37"}}]
[{"$nulls":5},59,127,{"$nulls":6},244,{"$nulls":4}," "]
[]
[{"$nulls":11},"The corresponding error = ",{"$f":"Calculations!B13","v":{"v":1.1468126858238392E-4,"d":"0.0001"}}]
[]
[]
["Click each item below for suggestions and investigations"]
[{"$nulls":3},"   Item 1"]
[{"$nulls":3},"   Item 2"]
[{"$nulls":3},"   Item 3"]
[{"$nulls":3},"   Item 4"]
[{"$nulls":3},"   Item 5"]
[]
[]
[]
["To access/download all the DIGMath Apps for College Algebra/Precalculus"]
{"$rows_left_out":8}
{"sheet":"Sine -- Degrees","index":1,"n_rows":38,"n_cols":16,"rows_kept":38}
[null,"   Approximating Sinusoidal Functions"]
[null,"with Lagrange Interpolation Polynomials"]
[]
[null,"This DIGMath module lets you investigate how"]
[null,"Lagrange quadratic Interpolation Polynomials"]
[null,"                 are used to approximate "]
[null,"               the sine function y = sin x"]
[null,"             with x in degrees on [0°, 45°]."]
[null,"  "]
["The three interpolating points are x = x0,  22.5°,  and x2."]
[]
[null,"What is the first point x0 (0 to 20°)?",null,null,{"$f":"F13/10","v":11},"°"]
[{"$nulls":5},110,127]
[]
[null,"What is the third point x2 (25° to 45°)?",null,null,{"$f":"F16/10","v":35.2},"°",{"$nulls":6},"Now trace along the curve:  x = ",{"$f":"O16/10","v":25.3},"° and  y = ",{"$f":"LOOKUP(N15+0.001,Calculations!M2:M452,Calculations!N2:N452)","v":{"v":0.4273578633871938,"d":"0.43"}}]
[{"$nulls":5},352,127,{"$nulls":7},253]
[]
[{"$nulls":12},"The corresponding error = ",{"$f":"Calculations!K13","v":{"v":-3.1090646340053985E-4,"d":"-0.0003"}}]
[]
[]
[]
[]
["Click each item below for suggestions and investigations"]
[{"$nulls":3},"   Item 1"]
[{"$nulls":3},"   Item 2"]
[{"$nulls":3},"   Item 3"]
[{"$nulls":3},"   Item 4"]
[{"$nulls":3},"   Item 5"]
[]
[]
{"$rows_left_out":9}
{"sheet":"4 Points - Radians","index":2,"n_rows":42,"n_cols":15,"rows_kept":42}
[null,"   Approximating Sinusoidal Functions"]
[null,"with Lagrange Interpolation Polynomials"]
[]
[null,"This DIGMath module lets you investigate how"]
[null,"     Lagrange cubic Interpolation Polynomials"]
[null,"                    are used to approximate "]
[null,"                the sine function y = sin x"]
[null,"                with x in radians on [0, p/4]."]
[]
["The four interpolating points are x = x0,  x1,  x2,  and x3."]
[]
[null,"What is the first point x0 (0 to 0.20)?",null,null,{"$f":"G13/980","v":{"v":0.2,"d":"0.20"}}]
[{"$nulls":5},29,196]
[]
[null,"What is the second point x1 (0.20 to 0.40)?",null,null,{"$f":"G16/980+0.196","v":{"v":0.196,"d":"0.20"}},"",{"$nulls":5},"Now trace along the curve:  x = ",{"$f":"O16*dxxx0","v":{"v":0.7853981633974483,"d":"0.785"}},"and  y = ",{"$f":"LOOKUP(M15+0.00001,Calculations!V2:V502,Calculations!W2:W502)","v":{"v":0.7071067811865515,"d":"0.707"}}]
[{"$nulls":5},50,0,{"$nulls":7},500]
[]
[null,"What is the third point x2 (0.39 to 0.59)?",null,null,{"$f":"G19/980+0.196*2","v":{"v":0.392,"d":"0.39"}},"",{"$nulls":5},"The corresponding error = ",{"$f":"Calculations!T13","v":{"v":-4.3788409126443995E-6,"d":"-0.000004"}}]
[{"$nulls":5},50,0]
[]
[null,"What is the fourth point x3 (0.59 to 0.79)?",null,null,{"$f":"G22/980+0.196*3","v":{"v":0.5880000000000001,"d":"0.59"}},""]
[{"$nulls":5},50,0]
[]
[]
[]
["Click each item below for suggestions and investigations"]
[{"$nulls":3},"   Item 1"]
[{"$nulls":3},"   Item 2"]
[{"$nulls":3},"   Item 3"]
[{"$nulls":3},"   Item 4"]
{"$rows_left_out":13}
{"sheet":"4 Points - Degrees","index":3,"n_rows":41,"n_cols":15,"rows_kept":41}
[null,"   Approximating Sinusoidal Functions"]
[null,"with Lagrange Interpolation Polynomials"]
[]
[null,"This DIGMath module lets you investigate how"]
[null,"   Lagrange cubic Interpolation Polynomials"]
[null,"                    are used to approximate "]
[null,"                the sine function y = sin x"]
[null,"             with x in degrees on [0°, 45°]."]
[]
["The four interpolating points are x = x0,  x1,  x2,  and x3."]
[]
[null,"What is the first point x0 (0 to 11°)?",null,null,{"$f":"F13/10","v":7.3},"°"]
[{"$nulls":4},29,73]
[]
[null,"What is the second point x1 (11.5° to 22.5°)?",null,null,{"$f":"F16/10+11.5","v":18.4},"°",{"$nulls":5},"Now trace along the curve:  x = ",{"$f":"N16*dxxxx0","v":{"v":25.3,"d":"25.30"}},"° and  y = ",{"$f":"LOOKUP(M15+0.00001,Calculations!AE2:AE452,Calculations!AF2:AF502)","v":{"v":0.4273578633871938,"d":"0.427"}}]
[{"$nulls":4},50,69,{"$nulls":7},253]
[]
[null,"What is the third point x2 (23° to 34°)?",null,null,{"$f":"F19/10+11.5*2","v":34},"°",{"$nulls":5},"The corresponding error = ",{"$f":"Calculations!AC13","v":{"v":-5.1529636473923723E-5,"d":"-0.000052"}}]
[{"$nulls":4},50,110]
[]
[null,"What is the fourth point x3 (34.5° to 45°)?",null,null,{"$f":"F22/10+11.5*3","v":41.5},"°"]
[{"$nulls":4},50,70]
[]
[]
[]
["Click each item below for suggestions and investigations"]
[{"$nulls":3},"   Item 1"]
[{"$nulls":3},"   Item 2"]
[{"$nulls":3},"   Item 3"]
[{"$nulls":3},"   Item 4"]
{"$rows_left_out":12}
{"sheet":"Calculations","index":4,"n_rows":502,"n_cols":35,"rows_kept":502}
[null,"dx =",{"$f":"PI()/4/500","v":1.5707963267948967E-3},"x","Sine","L2(x)","Error","ABS(Error)",null,null,"dxx =",{"$f":"45/450","v":0.1},"x","Sine","L2(x)","Error","ABS(Error)",null,null,"dxxx0 =",{"$f":"PI()/4/500","v":1.5707963267948967E-3},"x","Sine","L3(x)","Error","ABS(Error)",null,null,"dxxxx0 =",0.1,"x","Sine","L3(x)","Error","ABS(Error)"]
[{"$nulls":3},{"$f":"0","v":0},{"$f":"SIN(x)","v":0},{"$f":"y0*(x-x00)*(x-x000)/(x0-x00)/(x0-x000)+y00*(x-x0)*(x-x000)/(x00-x0)/(x00-x000)+y000*(x-x0)*(x-x00)/(x000-x0)/(x000-x00)","v":-2.2255987689207835E-3},{"$f":"F2-E2","v":-2.2255987689207835E-3},{"$f":"ABS(G2)","v":2.2255987689207835E-3},{"$nulls":4},{"$f":"0","v":0},{"$f":"SIN(xx*PI()/180)","v":0},{"$f":"yy0*(xx-xx00)*(xx-xx000)/(xx0-xx00)/(xx0-xx000)+yy00*(xx-xx0)*(xx-xx000)/(xx00-xx0)/(xx00-xx000)+yy000*(xx-xx0)*(xx-xx00)/(xx000-xx0)/(xx000-xx00)","v":-0.007336988716913739},{"$f":"O2-N2","v":-0.007336988716913739},{"$f":"ABS(P2)","v":0.007336988716913739},null,null,"dxxx =",{"$f":"T5-T4","v":-4.0000000000000036E-3},0,{"$f":"SIN(xxx)","v":0},{"$f":"yyy0*(xxx-xxx00)*(xxx-xxx000)*(xxx-xxx0000)/(xxx0-xxx00)/(xxx0-xxx000)/(xxx0-xxx0000)+yyy00*(xxx-xxx0)*(xxx-xxx000)*(xxx-xxx0000)/(xxx00-xxx0)/(xxx00-xxx000)/(xxx00-xxx0000)+yyy000*(xxx-xxx0)*(xxx-xxx00)*(xxx-xxx0000)/(xxx000-xxx0)/(xxx000-xxx00)/(xxx000-xxx0000)+yyy0000*(xxx-xxx0)*(xxx-xxx00)*(xxx-xxx000)/(xxx0000-xxx0)/(xxx0000-xxx00)/(xxx0000-xxx000)","v":-1.0195857795031182E-4},-2.8867100836271753E-4,2.8867100836271753E-4,null,null,"dxxxx =",13.5,0,{"$f":"SIN(xxxx*PI()/180)","v":0},{"$f":"yyyy0*(xxxx-xxxx00)*(xxxx-xxxx000)*(xxxx-xxxx0000)/(xxxx0-xxxx00)/(xxxx0-xxxx000)/(xxxx0-xxxx0000)+yyyy00*(xxxx-xxxx0)*(xxxx-xxxx000)*(xxxx-xxxx0000)/(xxxx00-xxxx0)/(xxxx00-xxxx000)/(xxxx00-xxxx0000)+yyyy000*(xxxx-xxxx0)*(xxxx-xxxx00)*(xxxx-xxxx0000)/(xxxx000-xxxx0)/(xxxx000-xxxx00)/(xxxx000-xxxx0000)+yyyy0000*(xxxx-xxxx0)*(xxxx-xxxx00)*(xxxx-xxxx000)/(xxxx0000-xxxx0)/(xxxx0000-xxxx00)/(xxxx0000-xxxx000)","v":-2.5192469811829987E-4},-1.3972281566543288E-4,1.3972281566543288E-4]
[null,"x","y",{"$f":"D2+dx","v":1.5707963267948967E-3},0.001570795680830879,-5.8193900518380137E-4,{"$f":"F3-E3","v":-2.1527346860146803E-3},{"$f":"ABS(G3)","v":2.1527346860146803E-3},null,null,"x","y",{"$f":"M2+dxx","v":0.1},1.7453283658983088E-3,-0.00547130132138024,{"$f":"O3-N3","v":-0.007216629687278549},{"$f":"ABS(P3)","v":0.007216629687278549},null,null,"x","y",{"$f":"V2+dxxx0","v":1.5707963267948967E-3},0.001570795680830879,1.4710054441895437E-3,-2.7798897286768209E-4,2.7798897286768209E-4,null,null,"xxxx","yyyy",0.1,1.7453283658983088E-3,1.4992881835167449E-3,-1.3110398558335845E-4,1.3110398558335845E-4]
[1,{"$f":"x0","v":0.06},{"$f":"SIN(x0)","v":0.059964006479444595},3.1415926535897933E-3,3.1415874858795635E-3,1.0608852273145813E-3,-0.002080702258564982,0.002080702258564982,null,1,{"$f":"xx0","v":11},{"$f":"SIN(K4*PI()/180)","v":0.1908089953765448},0.2,0.003490651415223732,-3.6067948481843803E-3,-7.0974462634081125E-3,7.0974462634081125E-3,null,1,{"$f":"xxx0","v":0.2},{"$f":"SIN(T4)","v":0.19866933079506122},3.1415926535897933E-3,3.1415874858795635E-3,3.0439343879946623E-3,-2.6748398509035543E-4,2.6748398509035543E-4,null,1,{"$f":"xxxx0","v":7.3},{"$f":"SIN(AC4*PI()/180)","v":0.12706460860135046},0.2,0.003490651415223732,3.2504155746252428E-3,-1.2266869253252377E-4,1.2266869253252377E-4]
[2,{"$f":"PI()/8","v":0.39269908169872414},{"$f":"SIN(B5)","v":0.3826834323650898},0.00471238898038469,0.004712371539373423,2.7028739285744896E-3,-2.009497610798933E-3,2.009497610798933E-3,null,2,{"$f":"22.5","v":22.5},{"$f":"SIN(K5*PI()/180)","v":0.3826834323650898},0.30000000000000004,5.2359638314195805E-3,-1.7434692973267718E-3,-0.006979433128746352,0.006979433128746352,null,2,{"$f":"xxx00","v":0.196},{"$f":"SIN(T5)","v":0.19474748558520416},0.00471238898038469,0.004712371539373423,4.616824614242343E-3,-2.5715448179097766E-4,2.5715448179097766E-4,null,2,{"$f":"xxxx00","v":18.4},{"$f":"SIN(AC5*PI()/180)","v":0.3156490369471024},0.3,0.00523596383141958,0.005001452694546216,-1.1441495124453471E-4,1.1441495124453471E-4]
[3,{"$f":"x000","v":0.59},{"$f":"SIN(x000)","v":0.5563610229127838},0.006283185307179587,0.006283143965558951,0.004344027098595785,-1.9391168669631665E-3,1.9391168669631665E-3,null,3,{"$f":"xx000","v":35.2},{"$f":"SIN(K6*PI()/180)","v":0.5764323161697933},0.4,6.9812602979615525E-3,1.1867533119302998E-4,-0.006862584966768523,0.006862584966768523,null,3,{"$f":"xxx000","v":0.392},{"$f":"SIN(T6)","v":0.38203747163308743},0.006283185307179587,0.006283143965558951,0.006189672483721986,-2.4699890581847406E-4,2.4699890581847406E-4,null,3,{"$f":"xxxx000","v":34},{"$f":"SIN(AC6*PI()/180)","v":0.5591929034707469},0.4,6.9812602979615525E-3,0.006752394762620462,-1.0634078573168448E-4,1.0634078573168448E-4]
[{"$nulls":3},0.007853981633974483,0.007853900888711334,0.005984344737378439,-1.8695561513328955E-3,1.8695561513328955E-3,{"$nulls":4},0.5,0.008726535498373935,1.9796390373756356E-3,-0.006746896460998299,0.006746896460998299,null,4,{"$f":"xxx0000","v":0.5880000000000001},{"$f":"SIN(T7)","v":0.5546980299408293},0.007853981633974483,0.007853900888711334,7.7624743571998445E-3,-2.3701570610967782E-4,2.3701570610967782E-4,null,4,{"$f":"xxxx0000","v":41.5},{"$f":"SIN(AC7*PI()/180)","v":0.6626200482157375},0.5,0.008726535498373935,0.008503236998186059,-9.8444229284289086E-5,9.8444229284289086E-5]
[{"$nulls":3},0.00942477796076938,0.009424638433144006,0.00762382684492266,-1.800811588221346E-3,1.800811588221346E-3,{"$nulls":4},0.6,0.010471784116245792,3.8394218212196574E-3,-0.006632362295026135,0.006632362295026135,{"$nulls":4},0.00942477796076938,0.009424638433144006,0.00933522659544711,-2.2720333768921908E-4,2.2720333768921908E-4,{"$nulls":4},0.6,0.010471784116245792,0.010253974620583417,-9.072332447179754E-5,9.072332447179754E-5]
["MaxError =",{"$f":"MAX(H2:H502)","v":0.008264979902445457},null,0.010995574287564275,0.010995352723218221,9.26247342122824E-3,-1.7328793019899813E-3,1.7328793019899813E-3,null,"MaxError =",{"$f":"MAX(Q2:Q452)","v":0.007336988716913739},null,0.7,0.012217000835247169,0.00569802368272615,-0.006518977152521019,0.006518977152521019,null,"MaxError =",{"$f":"MAX(Z2:Z502)","v":2.8867100836271753E-4},null,0.010995574287564275,0.010995352723218221,0.010907925559247938,-2.1756026166941389E-4,2.1756026166941389E-4,null,"MaxError =",{"$f":"MAX(AI2:AL452)","v":1.7392530246373994E-4},null,0.7,0.012217000835247169,0.012004602849152834,-8.3176123142680858E-5,8.3176123142680858E-5]
[{"$nulls":3},0.012566370614359171,0.012566039883352606,0.010900284466295318,-1.6657554170572877E-3,1.6657554170572877E-3,{"$nulls":4},0.7999999999999999,0.013962180339145272,0.007555444621895113,-0.006406735717250159,0.006406735717250159,{"$nulls":4},0.012566370614359171,0.012566039883352606,0.012480567609366222,-2.080849452511524E-4,2.080849452511524E-4,{"$nulls":4},0.8,0.013962180339145272,0.013755116903232112,-7.5800686424098984E-5,7.5800686424098984E-5]
[{"$nulls":3},0.014137166941154067,0.014136696038032732,0.012537259980123727,-0.001599436057909005,0.001599436057909005,{"$nulls":4},0.8999999999999999,0.015707317311820672,0.009411684638726048,-0.006295632673094624,0.006295632673094624,{"$nulls":4},0.014137166941154067,0.014136696038032732,0.01405314910658298,-1.9877586172223349E-4,1.9877586172223349E-4,{"$nulls":4},0.9,0.015707317311820675,0.015505512002161825,-6.8595084721234656E-5,6.8595084721234656E-5]
["Point",null,null,0.015707963267948963,0.015707317311820672,0.014173399962713662,-1.5339173491070099E-3,1.5339173491070099E-3,null,"Point",null,null,0.9999999999999999,0.017452406437283508,0.011266743733219009,-0.006185662704064499,0.006185662704064499,null,"Point",null,null,0.015707963267948963,0.015707317311820672,0.015625666411669514,-1.8963149045803096E-4,1.8963149045803096E-4,null,"Point",null,null,1,0.01745240643728351,0.017255783365282273,-6.1557397718403628E-5,6.1557397718403628E-5]
[{"$f":"'Sine -- Radians'!M15","v":0.3832743037379548},{"$f":"LOOKUP(A13,D2:D502,G2:G502)","v":1.1468126858238392E-4},null,0.01727875959474386,0.017277899829364566,0.015808704414065053,-0.001469195415299513,0.001469195415299513,null,{"$f":"'Sine -- Degrees'!N15","v":25.3},{"$f":"LOOKUP(J13,M2:M452,P2:P452)","v":-3.1090646340053985E-4},null,1.0999999999999999,0.019197442399689662,0.013120621905374441,-0.006076820494315221,0.006076820494315221,null,{"$f":"'4 Points - Radians'!M15","v":0.7853981633974483},{"$f":"LOOKUP(S13+0.000001,V2:V502,Y2:Y502)","v":-4.3788409126443995E-6},null,0.01727875959474386,0.017277899829364566,0.01719811588540976,-1.8065031692204858E-4,1.8065031692204858E-4,null,{"$f":"'4 Points - Degrees'!M15","v":25.3},{"$f":"LOOKUP(AB13+0.000001,AE2:AE452,AH2:AH452)","v":-5.1529636473923723E-5},null,1.1,0.01919744239968967,0.01900592621193148,-5.4685714376834227E-5,5.4685714376834227E-5]
[{"$nulls":3},0.018849555921538756,0.018848439715408172,0.0174431733341779,-1.4052663812302718E-3,1.4052663812302718E-3,{"$nulls":4},1.2,0.020942419883356957,0.01497331915519201,-5.9691007281649465E-3,5.9691007281649465E-3,{"$nulls":4},0.018849555921538756,0.018848439715408172,0.01877049388855717,-1.718308326646989E-4,1.718308326646989E-4,{"$nulls":4},1.2,0.020942419883356957,0.020755935761450295,-4.7978132936554729E-5,4.7978132936554729E-5]
[{"$nulls":3},0.02042035224833365,0.020418933094800452,0.019076806723052092,-1.3421263717483603E-3,1.3421263717483603E-3,{"$nulls":4},1.3,0.022687333572781358,0.016824835482671496,-0.005862498090109861,0.005862498090109861,{"$nulls":4},0.02042035224833365,0.020418933094800452,0.020342796781910727,-1.631715353233032E-4,1.631715353233032E-4,{"$nulls":4},1.3,0.022687333572781358,0.022505807233177355,-4.1432760914283939E-5,4.1432760914283939E-5]
[{"$nulls":3},0.021991148575128548,0.021989376092505102,0.020709604580687754,-0.001279771511817348,0.001279771511817348,{"$nulls":4},1.4000000000000001,0.024432178152653153,0.01867517088781334,-0.005757007264839811,0.005757007264839811,{"$nulls":4},0.021991148575128548,0.021989376092505102,0.02191502092622663,-1.5467092862253562E-4,1.5467092862253562E-4,{"$nulls":4},1.4,0.024432178152653153,0.024255535846452736,-3.5047715104208343E-5,3.5047715104208343E-5]
[{"$nulls":3},0.023561944901923444,0.023559764833610147,0.022341566907084873,-0.001218197926525274,0.001218197926525274,{"$nulls":4},1.5000000000000002,0.026176948307873156,0.020524325370617214,-5.6526229372559425E-3,5.6526229372559425E-3,{"$nulls":4},0.023561944901923444,0.023559764833610147,0.02348716268228987,-1.4632752237386804E-4,1.4632752237386804E-4,{"$nulls":4},1.5,0.02617694830787315,0.02600511682061607,-2.8821121577427E-5,2.8821121577427E-5]
[{"$nulls":3},0.02513274122871834,0.025130095443337472,0.023972693702243433,-1.1574017410940392E-3,1.1574017410940392E-3,{"$nulls":4},1.6000000000000003,0.027921638723568884,0.02237229893108339,-0.005549339792485494,0.005549339792485494,{"$nulls":4},0.02513274122871834,0.025130095443337472,0.02505921841086753,-1.3813983247501493E-4,1.3813983247501493E-4,{"$nulls":4},1.6,0.02792163872356888,0.027754545375006767,-2.2751115681285405E-5,2.2751115681285405E-5]
[{"$nulls":3},0.026703537555513236,0.0267003640470524,0.025602984966163422,-1.0973790808889786E-3,1.0973790808889786E-3,{"$nulls":4},1.7000000000000004,0.02966624408511076,0.024219091569211815,-0.005447152515898945,0.005447152515898945,{"$nulls":4},0.026703537555513236,0.0267003640470524,0.026631184472744096,-1.3010638091026649E-4,1.3010638091026649E-4,{"$nulls":4},1.7,0.029666244085110757,0.029503816728964682,-1.6835842039042426E-5,1.6835842039042426E-5]
[{"$nulls":3},0.02827433388230813,0.028270566770273245,0.027232440698844854,-1.0381260714283913E-3,1.0381260714283913E-3,{"$nulls":4},1.8000000000000005,0.0314107590781283,0.026064703285002266,-5.3460557931260325E-3,5.3460557931260325E-3,{"$nulls":4},0.02827433388230813,0.028270566770273245,0.028203057228683687,-1.2222569575037756E-4,1.2222569575037756E-4,{"$nulls":4},1.8,0.03141075907812829,0.03125292610182884,-1.1073454549648254E-5,1.1073454549648254E-5]
[{"$nulls":3},0.029845130209103028,0.02984069973868088,0.028861060900287734,-9.7963883839314453E-4,9.7963883839314453E-4,{"$nulls":4},1.9000000000000006,0.03315517838852629,0.027909134078454967,-0.005246044310071321,0.005246044310071321,{"$nulls":4},0.029845130209103028,0.02984069973868088,0.029774833039470427,-1.1449631115156844E-4,1.1449631115156844E-4,{"$nulls":4},1.9,0.033155178388526274,0.03300186871293914,-5.4621163871892975E-6,5.4621163871892975E-6]
[{"$nulls":3},0.03141592653589793,0.031410759078128285,0.030488845570492036,-9.2191350763624891E-4,9.2191350763624891E-4,{"$nulls":4},2.0000000000000004,0.034899496702500976,0.02975238394956997,-5.1471127529310046E-3,5.1471127529310046E-3,{"$nulls":4},0.03141592653589793,0.031410759078128285,0.03134650826587229,-1.0691676735574696E-4,1.0691676735574696E-4,{"$nulls":4},2,0.03489949670250097,0.034750639781635284,0,0]
[{"$nulls":3},0.03298672286269282,0.03298074091465012,0.03211579470945777,-8.6494620519234761E-4,8.6494620519234761E-4,{"$nulls":4},2.1000000000000005,0.03664370870655628,0.031594452898347114,-0.005049255808209169,0.005049255808209169,{"$nulls":4},0.03298672286269282,0.03298074091465012,0.032918079268669964,-9.9485610690397408E-5,9.9485610690397408E-5,{"$nulls":4},2.1,0.036643708706556276,0.03649923452725651,5.3147128891151141E-6,5.3147128891151141E-6]
[{"$nulls":3},0.03455751918948772,0.034550641374472266,0.03374190831718494,-8.0873305728732664E-4,8.0873305728732664E-4,{"$nulls":4},2.2000000000000006,0.03838780908751995,0.03343534092478628,-0.004952468162733668,0.004952468162733668,{"$nulls":4},0.03455751918948772,0.034550641374472266,0.034489542408615737,-9.2201393567803436E-5,9.2201393567803436E-5,{"$nulls":4},2.2,0.038387809087519945,0.03824764816914278,1.048383128388064E-5,1.048383128388064E-5]
[{"$nulls":3},0.036128315516282615,0.036120456584021396,0.03536718639367357,-7.5327019034782811E-4,7.5327019034782811E-4,{"$nulls":4},2.3000000000000007,0.040131792532559746,0.0352750480288877,-0.004856744503672045,0.004856744503672045,{"$nulls":4},0.036128315516282615,0.036120456584021396,0.03606089404651344,-8.5062674485270051E-5,8.5062674485270051E-5,{"$nulls":4},2.3,0.040131792532559725,0.03999587592663312,1.550915491532745E-5,1.550915491532745E-5]
[{"$nulls":3},0.03769911184307751,0.037690182669934534,0.03699162893892363,-6.9855373101090218E-4,6.9855373101090218E-4,{"$nulls":4},2.400000000000001,0.041875653729199644,0.03711357421065142,-0.004762079518548221,0.004762079518548221,{"$nulls":4},0.03769911184307751,0.037690182669934534,0.03763213054312928,-7.8068018024346486E-5,7.8068018024346486E-5,{"$nulls":4},2.4,0.04187565372919962,0.04174391301906771,2.0392474242014735E-5,2.0392474242014735E-5]
[{"$nulls":3},0.03926990816987241,0.0392598157590686,0.038615235952935124,-6.4457980613347871E-4,6.4457980613347871E-4,{"$nulls":4},2.500000000000001,0.043619387365336014,0.03895091947007728,-0.004668467895258731,0.004668467895258731,{"$nulls":4},0.03926990816987241,0.0392598157590686,0.039203248259226914,-7.121599485071517E-5,7.121599485071517E-5,{"$nulls":4},2.5,0.043619387365336,0.0434917546657857,2.5135570450585121E-5,2.5135570450585121E-5]
[{"$nulls":3},0.0408407044966673,0.04082935197850999,0.04023800743570804,-5.9134454280194981E-4,5.9134454280194981E-4,{"$nulls":4},2.600000000000001,0.0453629881292538,0.04078708380716517,-0.004575904322088632,0.004575904322088632,{"$nulls":4},0.0408407044966673,0.04082935197850999,0.04077424355558787,-6.4505181713858661E-5,6.4505181713858661E-5,{"$nulls":4},2.6,0.04536298812925378,0.04523939608612715,2.9740215457207952E-5,2.9740215457207952E-5]
[{"$nulls":3},0.0424115008234622,0.04239878745558409,0.04185994338724242,-5.3884406834166926E-4,5.3884406834166926E-4,{"$nulls":4},2.700000000000001,0.04710645070964268,0.042622067221915416,-0.004484383487727263,0.004484383487727263,{"$nulls":4},0.0424115008234622,0.04239878745558409,0.04234511279298972,-5.7934161446393517E-5,5.7934161446393517E-5,{"$nulls":4},2.7,0.04710645070964266,0.046986832499430864,3.4208171907024187E-5,3.4208171907024187E-5]
[{"$nulls":3},0.043982297150257095,0.043968118317864895,0.04348104380753824,-4.87074510326653E-4,4.87074510326653E-4,{"$nulls":4},2.800000000000001,0.04884976979561328,0.044455869714327856,-4.393900081285422E-3,4.393900081285422E-3,{"$nulls":4},0.043982297150257095,0.043968118317864895,0.04391585233220319,-5.1501522964292334E-5,5.1501522964292334E-5,{"$nulls":4},2.8,0.04884976979561326,0.048734059125037005,3.8541193176144795E-5,3.8541193176144795E-5]
{"$rows_left_out":472}